FailedConsole Output

Started by an SCM change
Started by an SCM change
Started by an SCM change
Started by an SCM change
Started by an SCM change
Started by an SCM change
Started by an SCM change
Started by an SCM change
Started by an SCM change
Started by an SCM change
Started by an SCM change
Started by an SCM change
Started by timer
Started by an SCM change
Started by an SCM change
Building remotely on Worker-US01 (US01) in workspace /home/wso2/jenwoker2/workspace/product-es
Fetching changes from the remote Git repository
Fetching upstream changes from https://github.com/wso2/product-es.git
Checking out Revision 4131be9c0d7ba96dce42d5403c33374c08d013c2 (origin/master)
executing script 'Script - Kill Carbon Servers'
[product-es] $ /bin/bash /tmp/build_step_template6713735625305059296.sh
Killing all carbon servers......
kill: invalid option -- '9'

Usage:
 kill [options] <pid> [...]

Options:
 <pid> [...]            send signal to every <pid> listed
 -<signal>, -s, --signal <signal>
                        specify the <signal> to be sent
 -l, --list=[<signal>]  list all signal names, or convert one to a name
 -L, --table            list all signal names in a nice table

 -h, --help     display this help and exit
 -V, --version  output version information and exit

For more details see kill(1).
executing script 'Removing M2 repos'
[product-es] $ /bin/sh /tmp/build_step_template6523979134226105983.sh
RepoCleaner - ****************************************************************
RepoCleaner - ** Day of the week, repository is scheduled to delete is  - 6 **
RepoCleaner - ** No of days to keep the repository is set to            - 7 **
RepoCleaner - ****************************************************************
RepoCleaner - current date is - 2015-08-20
RepoCleaner - current day of the week is - 4
RepoCleaner - last repo deletion time is set and value is 2015-08-15
RepoCleaner - no of days passed after the last repo deletion is - 5
Parsing POMs
using settings config with name maven-settings-xml
Modules changed, recalculating dependency graph
maven3-agent.jar already up to date
maven3-interceptor.jar already up to date
maven3-interceptor-commons.jar already up to date
[product-es] $ /home/wso2/software/java/jdk1.7.0_51//bin/java -Xmx1024m -XX:MaxPermSize=512m -Dorg.apache.maven.global-settings=/build/software/maven/settings/settings.xml -cp /home/wso2/jenwoker2/maven3-agent.jar:/home/wso2/software/maven/apache-maven-3.0.5/boot/plexus-classworlds-2.4.jar org.jvnet.hudson.maven3.agent.Maven3Main /home/wso2/software/maven/apache-maven-3.0.5 /home/wso2/jenwoker2/slave.jar /home/wso2/jenwoker2/maven3-interceptor.jar /home/wso2/jenwoker2/maven3-interceptor-commons.jar 58413
<===[JENKINS REMOTING CAPACITY]===>channel started
using settings config with name maven-settings-xml
Executing Maven:  -B -f /home/wso2/jenwoker2/workspace/product-es/pom.xml -Dmaven.repo.local=/home/wso2/jenwoker2/workspace/product-es/.repository -s /tmp/settings8706020763838554943.xml clean install -U
[INFO] Scanning for projects...
[WARNING] 
[WARNING] Some problems were encountered while building the effective model for org.wso2.es:org.wso2.store.admin.styles:bundle:2.0.0-SNAPSHOT
[WARNING] 'dependencyManagement.dependencies.dependency.(groupId:artifactId:type:classifier)' must be unique: org.wso2.es:org.wso2.es.integration.common.clients:jar -> duplicate declaration of version ${product.es.version} @ org.wso2.es:wso2es-parent:2.0.0-SNAPSHOT, /home/wso2/jenwoker2/workspace/product-es/pom.xml, line 434, column 25
[WARNING] 
[WARNING] Some problems were encountered while building the effective model for org.wso2.es:wso2es:jar:2.0.0-SNAPSHOT
[WARNING] 'build.plugins.plugin.version' for org.codehaus.mojo:buildnumber-maven-plugin is missing. @ line 44, column 21
[WARNING] 
[WARNING] Some problems were encountered while building the effective model for org.wso2.es:wso2es-parent:pom:2.0.0-SNAPSHOT
[WARNING] 'dependencyManagement.dependencies.dependency.(groupId:artifactId:type:classifier)' must be unique: org.wso2.es:org.wso2.es.integration.common.clients:jar -> duplicate declaration of version ${product.es.version} @ line 434, column 25
[WARNING] 
[WARNING] It is highly recommended to fix these problems because they threaten the stability of your build.
[WARNING] 
[WARNING] For this reason, future Maven versions might no longer support building such malformed projects.
[WARNING] 
[INFO] ------------------------------------------------------------------------
[INFO] Reactor Build Order:
[INFO] 
[INFO] WSO2 Enterprise Store
[INFO] WSO2 Enterprise Store - UI styles
[INFO] WSO2 Enterprise Store Features
[INFO] WSO2 Enterprise Store Styles Feature
[INFO] wso2es-profile-gen
[INFO] WSO2 Enterprise Store - Distribution
[INFO] wso2es-integration
[INFO] WSO2 ES Integration Test Common
[INFO] admin-clients
[INFO] ES Integration Test UI Pages
[INFO] integration-test-utils
[INFO] WSO2 ES Integration Test
[INFO] org.wso2.es.integration.test
[INFO] WSO2 ES UI Integration Test
[INFO] ui-test-utils
[INFO] WSO2 ES UI Integration Test - Extension
[INFO] WSO2 ES UI Integration Test - Default Pages
[INFO] es-platform-tests
[INFO] org.wso2.store.platform.tests
[INFO]                                                                         
[INFO] ------------------------------------------------------------------------
[INFO] Building WSO2 Enterprise Store 2.0.0-SNAPSHOT
[INFO] ------------------------------------------------------------------------
[INFO] 
[INFO] --- maven-clean-plugin:2.6.1:clean (default-clean) @ wso2es-parent ---
[INFO] Deleting /home/wso2/jenwoker2/workspace/product-es/target
[INFO] 
[INFO] --- maven-remote-resources-plugin:1.5:process (default) @ wso2es-parent ---
[INFO] 
[INFO] --- maven-install-plugin:2.5.2:install (default-install) @ wso2es-parent ---
[INFO] Installing /home/wso2/jenwoker2/workspace/product-es/pom.xml to /home/wso2/jenwoker2/workspace/product-es/.repository/org/wso2/es/wso2es-parent/2.0.0-SNAPSHOT/wso2es-parent-2.0.0-SNAPSHOT.pom
[INFO]                                                                         
[INFO] ------------------------------------------------------------------------
[INFO] Building WSO2 Enterprise Store - UI styles 2.0.0-SNAPSHOT
[INFO] ------------------------------------------------------------------------
[INFO] 
[INFO] --- maven-clean-plugin:2.6.1:clean (default-clean) @ org.wso2.store.admin.styles ---
[INFO] Deleting /home/wso2/jenwoker2/workspace/product-es/modules/components/store-admin/target
[INFO] 
[INFO] --- maven-remote-resources-plugin:1.5:process (default) @ org.wso2.store.admin.styles ---
[INFO] 
[INFO] --- maven-resources-plugin:2.5:resources (default-resources) @ org.wso2.store.admin.styles ---
[debug] execute contextualize
[INFO] Using 'UTF-8' encoding to copy filtered resources.
[INFO] Copying 21 resources
[INFO] Copying 3 resources
[INFO] 
[INFO] --- maven-compiler-plugin:3.1:compile (default-compile) @ org.wso2.store.admin.styles ---
[INFO] No sources to compile
[INFO] 
[INFO] --- maven-scr-plugin:1.7.2:scr (generate-scr-scrdescriptor) @ org.wso2.store.admin.styles ---
[WARNING] Source tree does not exist. Ignoring /home/wso2/jenwoker2/workspace/product-es/modules/components/store-admin/src/main/java
[INFO] 
[INFO] --- maven-resources-plugin:2.5:testResources (default-testResources) @ org.wso2.store.admin.styles ---
[debug] execute contextualize
[INFO] Using 'UTF-8' encoding to copy filtered resources.
[INFO] skip non existing resourceDirectory /home/wso2/jenwoker2/workspace/product-es/modules/components/store-admin/src/test/resources
[INFO] Copying 3 resources
[INFO] 
[INFO] --- maven-compiler-plugin:3.1:testCompile (default-testCompile) @ org.wso2.store.admin.styles ---
[INFO] No sources to compile
[INFO] 
[INFO] --- maven-surefire-plugin:2.12:test (default-test) @ org.wso2.store.admin.styles ---
[INFO] Surefire report directory: /home/wso2/jenwoker2/workspace/product-es/modules/components/store-admin/target/surefire-reports

-------------------------------------------------------
 T E S T S
-------------------------------------------------------

Results :

Tests run: 0, Failures: 0, Errors: 0, Skipped: 0

[JENKINS] Recording test results
[INFO] 
[INFO] --- maven-bundle-plugin:2.3.5:bundle (default-bundle) @ org.wso2.store.admin.styles ---
[WARNING] Bundle org.wso2.es:org.wso2.store.admin.styles:bundle:2.0.0-SNAPSHOT : Instructions in Private-Package, or -testpackages that are never used: org\.wso2\.store\.styles\.internal
Classpath: Jar:.

[WARNING] Bundle org.wso2.es:org.wso2.store.admin.styles:bundle:2.0.0-SNAPSHOT : Did not find matching referal for javax.servlet.*
[INFO] 
[INFO] --- maven-install-plugin:2.5.2:install (default-install) @ org.wso2.store.admin.styles ---
[INFO] Installing /home/wso2/jenwoker2/workspace/product-es/modules/components/store-admin/target/org.wso2.store.admin.styles-2.0.0-SNAPSHOT.jar to /home/wso2/jenwoker2/workspace/product-es/.repository/org/wso2/es/org.wso2.store.admin.styles/2.0.0-SNAPSHOT/org.wso2.store.admin.styles-2.0.0-SNAPSHOT.jar
[INFO] Installing /home/wso2/jenwoker2/workspace/product-es/modules/components/store-admin/pom.xml to /home/wso2/jenwoker2/workspace/product-es/.repository/org/wso2/es/org.wso2.store.admin.styles/2.0.0-SNAPSHOT/org.wso2.store.admin.styles-2.0.0-SNAPSHOT.pom
[INFO] 
[INFO] --- maven-bundle-plugin:2.3.5:install (default-install) @ org.wso2.store.admin.styles ---
[INFO] Local OBR update disabled (enable with -DobrRepository)
[INFO]                                                                         
[INFO] ------------------------------------------------------------------------
[INFO] Building WSO2 Enterprise Store Features 2.0.0-SNAPSHOT
[INFO] ------------------------------------------------------------------------
[INFO] 
[INFO] --- maven-clean-plugin:2.6.1:clean (default-clean) @ wso2es-features ---
[INFO] Deleting /home/wso2/jenwoker2/workspace/product-es/modules/features/target
[INFO] 
[INFO] --- maven-remote-resources-plugin:1.5:process (default) @ wso2es-features ---
[INFO] 
[INFO] --- maven-install-plugin:2.5.2:install (default-install) @ wso2es-features ---
[INFO] Installing /home/wso2/jenwoker2/workspace/product-es/modules/features/pom.xml to /home/wso2/jenwoker2/workspace/product-es/.repository/org/wso2/es/wso2es-features/2.0.0-SNAPSHOT/wso2es-features-2.0.0-SNAPSHOT.pom
[INFO]                                                                         
[INFO] ------------------------------------------------------------------------
[INFO] Building WSO2 Enterprise Store Styles Feature 2.0.0-SNAPSHOT
[INFO] ------------------------------------------------------------------------
[INFO] 
[INFO] --- maven-clean-plugin:2.6.1:clean (default-clean) @ org.wso2.store.styles.feature ---
[INFO] Deleting /home/wso2/jenwoker2/workspace/product-es/modules/features/org.wso2.store.styles.feature/target
[INFO] 
[INFO] --- maven-remote-resources-plugin:1.5:process (default) @ org.wso2.store.styles.feature ---
[INFO] 
[INFO] --- carbon-p2-plugin:1.5.3:p2-feature-gen (p2-feature-generation) @ org.wso2.store.styles.feature ---
[INFO]    /home/wso2/jenwoker2/workspace/product-es/modules/features/org.wso2.store.styles.feature/target/maven-shared-archive-resources
[INFO] Generating feature manifest
[INFO] Generating feature properties
[INFO] Generating MANIFEST.MF
[INFO] Generating Advice file (p2.inf)
[INFO] Copying bundle dependencies
[INFO]    org.wso2.store.admin.styles:2.0.0.SNAPSHOT
[INFO] Generating feature archive: /home/wso2/jenwoker2/workspace/product-es/modules/features/org.wso2.store.styles.feature/target/org.wso2.store.styles.feature-2.0.0-SNAPSHOT.zip
[INFO] 
[INFO] --- maven-install-plugin:2.5.2:install (default-install) @ org.wso2.store.styles.feature ---
[INFO] Installing /home/wso2/jenwoker2/workspace/product-es/modules/features/org.wso2.store.styles.feature/pom.xml to /home/wso2/jenwoker2/workspace/product-es/.repository/org/wso2/es/org.wso2.store.styles.feature/2.0.0-SNAPSHOT/org.wso2.store.styles.feature-2.0.0-SNAPSHOT.pom
[INFO] Installing /home/wso2/jenwoker2/workspace/product-es/modules/features/org.wso2.store.styles.feature/target/org.wso2.store.styles.feature-2.0.0-SNAPSHOT.zip to /home/wso2/jenwoker2/workspace/product-es/.repository/org/wso2/es/org.wso2.store.styles.feature/2.0.0-SNAPSHOT/org.wso2.store.styles.feature-2.0.0-SNAPSHOT.zip
[INFO]                                                                         
[INFO] ------------------------------------------------------------------------
[INFO] Building wso2es-profile-gen 2.0.0-SNAPSHOT
[INFO] ------------------------------------------------------------------------
[INFO] 
[INFO] --- maven-clean-plugin:2.6.1:clean (default-clean) @ wso2es-profile-gen ---
[INFO] Deleting /home/wso2/jenwoker2/workspace/product-es/modules/p2-profile-gen/target
[INFO] 
[INFO] --- maven-remote-resources-plugin:1.5:process (default) @ wso2es-profile-gen ---
[INFO] 
[INFO] --- maven-dependency-plugin:2.8:unpack (1-unpack-p2-agent-distribution) @ wso2es-profile-gen ---
[INFO] Configured Artifact: org.wso2.carbon:wso2carbon-core:4.4.1:zip
[INFO] Unpacking /home/wso2/jenwoker2/workspace/product-es/.repository/org/wso2/carbon/wso2carbon-core/4.4.1/wso2carbon-core-4.4.1.zip to /home/wso2/jenwoker2/workspace/product-es/modules/p2-profile-gen/target with includes "" and excludes ""
[INFO] 
[INFO] --- carbon-p2-plugin:1.5.3:p2-repo-gen (2-p2-repo-generation) @ wso2es-profile-gen ---
Downloading: http://maven.wso2.org/nexus/content/repositories/releases/org/wso2/carbon/store/event.feature/2.3.2-SNAPSHOT/maven-metadata.xml
Downloading: http://maven.wso2.org/nexus/content/groups/wso2-public/org/wso2/carbon/store/event.feature/2.3.2-SNAPSHOT/maven-metadata.xml
Downloading: http://maven.wso2.org/nexus/content/repositories/snapshots/org/wso2/carbon/store/event.feature/2.3.2-SNAPSHOT/maven-metadata.xml
Downloaded: http://maven.wso2.org/nexus/content/repositories/snapshots/org/wso2/carbon/store/event.feature/2.3.2-SNAPSHOT/maven-metadata.xml (784 B at 0.8 KB/sec)
Downloading: http://maven.wso2.org/nexus/content/repositories/snapshots/org/wso2/carbon/store/event.feature/2.3.2-SNAPSHOT/event.feature-2.3.2-20150820.200056-3.zip
Downloaded: http://maven.wso2.org/nexus/content/repositories/snapshots/org/wso2/carbon/store/event.feature/2.3.2-SNAPSHOT/event.feature-2.3.2-20150820.200056-3.zip (13 KB at 26.5 KB/sec)
Downloading: http://maven.wso2.org/nexus/content/groups/wso2-public/org/wso2/carbon/store/login.feature/2.3.2-SNAPSHOT/maven-metadata.xml
Downloading: http://maven.wso2.org/nexus/content/repositories/releases/org/wso2/carbon/store/login.feature/2.3.2-SNAPSHOT/maven-metadata.xml
Downloading: http://maven.wso2.org/nexus/content/repositories/snapshots/org/wso2/carbon/store/login.feature/2.3.2-SNAPSHOT/maven-metadata.xml
Downloaded: http://maven.wso2.org/nexus/content/repositories/snapshots/org/wso2/carbon/store/login.feature/2.3.2-SNAPSHOT/maven-metadata.xml (784 B at 1.1 KB/sec)
Downloading: http://maven.wso2.org/nexus/content/repositories/snapshots/org/wso2/carbon/store/login.feature/2.3.2-SNAPSHOT/login.feature-2.3.2-20150820.200115-3.zip
Downloaded: http://maven.wso2.org/nexus/content/repositories/snapshots/org/wso2/carbon/store/login.feature/2.3.2-SNAPSHOT/login.feature-2.3.2-20150820.200115-3.zip (14 KB at 19.0 KB/sec)
Downloading: http://maven.wso2.org/nexus/content/groups/wso2-public/org/wso2/carbon/store/permission.feature/2.3.2-SNAPSHOT/maven-metadata.xml
Downloading: http://maven.wso2.org/nexus/content/repositories/snapshots/org/wso2/carbon/store/permission.feature/2.3.2-SNAPSHOT/maven-metadata.xml
Downloading: http://maven.wso2.org/nexus/content/repositories/releases/org/wso2/carbon/store/permission.feature/2.3.2-SNAPSHOT/maven-metadata.xml
Downloaded: http://maven.wso2.org/nexus/content/repositories/snapshots/org/wso2/carbon/store/permission.feature/2.3.2-SNAPSHOT/maven-metadata.xml (789 B at 1.1 KB/sec)
Downloading: http://maven.wso2.org/nexus/content/repositories/snapshots/org/wso2/carbon/store/permission.feature/2.3.2-SNAPSHOT/permission.feature-2.3.2-20150820.200241-3.zip
Downloaded: http://maven.wso2.org/nexus/content/repositories/snapshots/org/wso2/carbon/store/permission.feature/2.3.2-SNAPSHOT/permission.feature-2.3.2-20150820.200241-3.zip (15 KB at 20.2 KB/sec)
Downloading: http://maven.wso2.org/nexus/content/groups/wso2-public/org/wso2/carbon/store/registration.feature/2.3.2-SNAPSHOT/maven-metadata.xml
Downloading: http://maven.wso2.org/nexus/content/repositories/snapshots/org/wso2/carbon/store/registration.feature/2.3.2-SNAPSHOT/maven-metadata.xml
Downloading: http://maven.wso2.org/nexus/content/repositories/releases/org/wso2/carbon/store/registration.feature/2.3.2-SNAPSHOT/maven-metadata.xml
Downloaded: http://maven.wso2.org/nexus/content/repositories/snapshots/org/wso2/carbon/store/registration.feature/2.3.2-SNAPSHOT/maven-metadata.xml (791 B at 1.1 KB/sec)
Downloading: http://maven.wso2.org/nexus/content/repositories/snapshots/org/wso2/carbon/store/registration.feature/2.3.2-SNAPSHOT/registration.feature-2.3.2-20150820.200246-3.zip
Downloaded: http://maven.wso2.org/nexus/content/repositories/snapshots/org/wso2/carbon/store/registration.feature/2.3.2-SNAPSHOT/registration.feature-2.3.2-20150820.200246-3.zip (13 KB at 18.0 KB/sec)
Downloading: http://maven.wso2.org/nexus/content/groups/wso2-public/org/wso2/carbon/store/bampublisher.feature/2.3.2-SNAPSHOT/maven-metadata.xml
Downloading: http://maven.wso2.org/nexus/content/repositories/snapshots/org/wso2/carbon/store/bampublisher.feature/2.3.2-SNAPSHOT/maven-metadata.xml
Downloading: http://maven.wso2.org/nexus/content/repositories/releases/org/wso2/carbon/store/bampublisher.feature/2.3.2-SNAPSHOT/maven-metadata.xml
Downloaded: http://maven.wso2.org/nexus/content/repositories/snapshots/org/wso2/carbon/store/bampublisher.feature/2.3.2-SNAPSHOT/maven-metadata.xml (791 B at 1.0 KB/sec)
Downloading: http://maven.wso2.org/nexus/content/repositories/snapshots/org/wso2/carbon/store/bampublisher.feature/2.3.2-SNAPSHOT/bampublisher.feature-2.3.2-20150820.200049-3.zip
Downloaded: http://maven.wso2.org/nexus/content/repositories/snapshots/org/wso2/carbon/store/bampublisher.feature/2.3.2-SNAPSHOT/bampublisher.feature-2.3.2-20150820.200049-3.zip (13 KB at 24.5 KB/sec)
Downloading: http://maven.wso2.org/nexus/content/groups/wso2-public/org/wso2/carbon/store/store.feature/2.3.2-SNAPSHOT/maven-metadata.xml
Downloading: http://maven.wso2.org/nexus/content/repositories/releases/org/wso2/carbon/store/store.feature/2.3.2-SNAPSHOT/maven-metadata.xml
Downloading: http://maven.wso2.org/nexus/content/repositories/snapshots/org/wso2/carbon/store/store.feature/2.3.2-SNAPSHOT/maven-metadata.xml
Downloaded: http://maven.wso2.org/nexus/content/repositories/snapshots/org/wso2/carbon/store/store.feature/2.3.2-SNAPSHOT/maven-metadata.xml (784 B at 1.1 KB/sec)
Downloading: http://maven.wso2.org/nexus/content/repositories/snapshots/org/wso2/carbon/store/store.feature/2.3.2-SNAPSHOT/store.feature-2.3.2-20150820.200300-3.zip
Downloaded: http://maven.wso2.org/nexus/content/repositories/snapshots/org/wso2/carbon/store/store.feature/2.3.2-SNAPSHOT/store.feature-2.3.2-20150820.200300-3.zip (21 KB at 29.3 KB/sec)
Downloading: http://maven.wso2.org/nexus/content/groups/wso2-public/org/wso2/carbon/store/ues.feature/2.3.2-SNAPSHOT/maven-metadata.xml
Downloading: http://maven.wso2.org/nexus/content/repositories/snapshots/org/wso2/carbon/store/ues.feature/2.3.2-SNAPSHOT/maven-metadata.xml
Downloading: http://maven.wso2.org/nexus/content/repositories/releases/org/wso2/carbon/store/ues.feature/2.3.2-SNAPSHOT/maven-metadata.xml
Downloaded: http://maven.wso2.org/nexus/content/repositories/snapshots/org/wso2/carbon/store/ues.feature/2.3.2-SNAPSHOT/maven-metadata.xml (782 B at 1.0 KB/sec)
Downloading: http://maven.wso2.org/nexus/content/repositories/snapshots/org/wso2/carbon/store/ues.feature/2.3.2-SNAPSHOT/ues.feature-2.3.2-20150820.200306-3.zip
Downloaded: http://maven.wso2.org/nexus/content/repositories/snapshots/org/wso2/carbon/store/ues.feature/2.3.2-SNAPSHOT/ues.feature-2.3.2-20150820.200306-3.zip (13 KB at 24.1 KB/sec)
Downloading: http://maven.wso2.org/nexus/content/groups/wso2-public/org/wso2/carbon/store/account-management.feature/2.3.2-SNAPSHOT/maven-metadata.xml
Downloading: http://maven.wso2.org/nexus/content/repositories/snapshots/org/wso2/carbon/store/account-management.feature/2.3.2-SNAPSHOT/maven-metadata.xml
Downloading: http://maven.wso2.org/nexus/content/repositories/releases/org/wso2/carbon/store/account-management.feature/2.3.2-SNAPSHOT/maven-metadata.xml
Downloaded: http://maven.wso2.org/nexus/content/repositories/snapshots/org/wso2/carbon/store/account-management.feature/2.3.2-SNAPSHOT/maven-metadata.xml (797 B at 1.1 KB/sec)
Downloading: http://maven.wso2.org/nexus/content/repositories/snapshots/org/wso2/carbon/store/account-management.feature/2.3.2-SNAPSHOT/account-management.feature-2.3.2-20150820.200044-3.zip
Downloaded: http://maven.wso2.org/nexus/content/repositories/snapshots/org/wso2/carbon/store/account-management.feature/2.3.2-SNAPSHOT/account-management.feature-2.3.2-20150820.200044-3.zip (18 KB at 24.5 KB/sec)
Downloading: http://maven.wso2.org/nexus/content/groups/wso2-public/org/wso2/carbon/store/rxt.feature/2.3.2-SNAPSHOT/maven-metadata.xml
Downloading: http://maven.wso2.org/nexus/content/repositories/snapshots/org/wso2/carbon/store/rxt.feature/2.3.2-SNAPSHOT/maven-metadata.xml
Downloading: http://maven.wso2.org/nexus/content/repositories/releases/org/wso2/carbon/store/rxt.feature/2.3.2-SNAPSHOT/maven-metadata.xml
Downloaded: http://maven.wso2.org/nexus/content/repositories/snapshots/org/wso2/carbon/store/rxt.feature/2.3.2-SNAPSHOT/maven-metadata.xml (782 B at 1.1 KB/sec)
Downloading: http://maven.wso2.org/nexus/content/repositories/snapshots/org/wso2/carbon/store/rxt.feature/2.3.2-SNAPSHOT/rxt.feature-2.3.2-20150820.200251-3.zip
Downloaded: http://maven.wso2.org/nexus/content/repositories/snapshots/org/wso2/carbon/store/rxt.feature/2.3.2-SNAPSHOT/rxt.feature-2.3.2-20150820.200251-3.zip (73 KB at 63.3 KB/sec)
Downloading: http://maven.wso2.org/nexus/content/groups/wso2-public/org/wso2/carbon/store/utils.feature/2.3.2-SNAPSHOT/maven-metadata.xml
Downloading: http://maven.wso2.org/nexus/content/repositories/releases/org/wso2/carbon/store/utils.feature/2.3.2-SNAPSHOT/maven-metadata.xml
Downloading: http://maven.wso2.org/nexus/content/repositories/snapshots/org/wso2/carbon/store/utils.feature/2.3.2-SNAPSHOT/maven-metadata.xml
Downloaded: http://maven.wso2.org/nexus/content/repositories/snapshots/org/wso2/carbon/store/utils.feature/2.3.2-SNAPSHOT/maven-metadata.xml (784 B at 1.0 KB/sec)
Downloading: http://maven.wso2.org/nexus/content/repositories/snapshots/org/wso2/carbon/store/utils.feature/2.3.2-SNAPSHOT/utils.feature-2.3.2-20150820.200312-3.zip
Downloaded: http://maven.wso2.org/nexus/content/repositories/snapshots/org/wso2/carbon/store/utils.feature/2.3.2-SNAPSHOT/utils.feature-2.3.2-20150820.200312-3.zip (27 KB at 34.7 KB/sec)
Downloading: http://maven.wso2.org/nexus/content/groups/wso2-public/org/wso2/carbon/store/lifecycle.feature/2.3.2-SNAPSHOT/maven-metadata.xml
Downloading: http://maven.wso2.org/nexus/content/repositories/snapshots/org/wso2/carbon/store/lifecycle.feature/2.3.2-SNAPSHOT/maven-metadata.xml
Downloading: http://maven.wso2.org/nexus/content/repositories/releases/org/wso2/carbon/store/lifecycle.feature/2.3.2-SNAPSHOT/maven-metadata.xml
Downloaded: http://maven.wso2.org/nexus/content/repositories/snapshots/org/wso2/carbon/store/lifecycle.feature/2.3.2-SNAPSHOT/maven-metadata.xml (788 B at 1.0 KB/sec)
Downloading: http://maven.wso2.org/nexus/content/repositories/snapshots/org/wso2/carbon/store/lifecycle.feature/2.3.2-SNAPSHOT/lifecycle.feature-2.3.2-20150820.200108-3.zip
Downloaded: http://maven.wso2.org/nexus/content/repositories/snapshots/org/wso2/carbon/store/lifecycle.feature/2.3.2-SNAPSHOT/lifecycle.feature-2.3.2-20150820.200108-3.zip (18 KB at 22.8 KB/sec)
Downloading: http://maven.wso2.org/nexus/content/groups/wso2-public/org/wso2/carbon/store/org.wso2.carbon.store.feature/2.3.2-SNAPSHOT/maven-metadata.xml
Downloading: http://maven.wso2.org/nexus/content/repositories/releases/org/wso2/carbon/store/org.wso2.carbon.store.feature/2.3.2-SNAPSHOT/maven-metadata.xml
Downloading: http://maven.wso2.org/nexus/content/repositories/snapshots/org/wso2/carbon/store/org.wso2.carbon.store.feature/2.3.2-SNAPSHOT/maven-metadata.xml
Downloaded: http://maven.wso2.org/nexus/content/repositories/snapshots/org/wso2/carbon/store/org.wso2.carbon.store.feature/2.3.2-SNAPSHOT/maven-metadata.xml (800 B at 1.5 KB/sec)
Downloading: http://maven.wso2.org/nexus/content/repositories/snapshots/org/wso2/carbon/store/org.wso2.carbon.store.feature/2.3.2-SNAPSHOT/org.wso2.carbon.store.feature-2.3.2-20150820.200209-3.zip
Downloaded: http://maven.wso2.org/nexus/content/repositories/snapshots/org/wso2/carbon/store/org.wso2.carbon.store.feature/2.3.2-SNAPSHOT/org.wso2.carbon.store.feature-2.3.2-20150820.200209-3.zip (13083 KB at 1711.2 KB/sec)
Downloading: http://maven.wso2.org/nexus/content/repositories/snapshots/org/wso2/carbon/store/org.wso2.carbon.social.feature/2.3.2-SNAPSHOT/maven-metadata.xml
Downloading: http://maven.wso2.org/nexus/content/repositories/releases/org/wso2/carbon/store/org.wso2.carbon.social.feature/2.3.2-SNAPSHOT/maven-metadata.xml
Downloading: http://maven.wso2.org/nexus/content/groups/wso2-public/org/wso2/carbon/store/org.wso2.carbon.social.feature/2.3.2-SNAPSHOT/maven-metadata.xml
Downloaded: http://maven.wso2.org/nexus/content/repositories/snapshots/org/wso2/carbon/store/org.wso2.carbon.social.feature/2.3.2-SNAPSHOT/maven-metadata.xml (801 B at 1.5 KB/sec)
Downloading: http://maven.wso2.org/nexus/content/repositories/snapshots/org/wso2/carbon/store/org.wso2.carbon.social.feature/2.3.2-SNAPSHOT/org.wso2.carbon.social.feature-2.3.2-20150820.200145-3.zip
Downloaded: http://maven.wso2.org/nexus/content/repositories/snapshots/org/wso2/carbon/store/org.wso2.carbon.social.feature/2.3.2-SNAPSHOT/org.wso2.carbon.social.feature-2.3.2-20150820.200145-3.zip (123 KB at 96.7 KB/sec)
Downloading: http://maven.wso2.org/nexus/content/groups/wso2-public/org/wso2/carbon/store/org.wso2.carbon.store.extensions.assets.gadget.feature/2.3.2-SNAPSHOT/maven-metadata.xml
Downloading: http://maven.wso2.org/nexus/content/repositories/releases/org/wso2/carbon/store/org.wso2.carbon.store.extensions.assets.gadget.feature/2.3.2-SNAPSHOT/maven-metadata.xml
Downloading: http://maven.wso2.org/nexus/content/repositories/snapshots/org/wso2/carbon/store/org.wso2.carbon.store.extensions.assets.gadget.feature/2.3.2-SNAPSHOT/maven-metadata.xml
Downloaded: http://maven.wso2.org/nexus/content/repositories/snapshots/org/wso2/carbon/store/org.wso2.carbon.store.extensions.assets.gadget.feature/2.3.2-SNAPSHOT/maven-metadata.xml (825 B at 1.2 KB/sec)
Downloading: http://maven.wso2.org/nexus/content/repositories/snapshots/org/wso2/carbon/store/org.wso2.carbon.store.extensions.assets.gadget.feature/2.3.2-SNAPSHOT/org.wso2.carbon.store.extensions.assets.gadget.feature-2.3.2-20150820.200155-3.zip
Downloaded: http://maven.wso2.org/nexus/content/repositories/snapshots/org/wso2/carbon/store/org.wso2.carbon.store.extensions.assets.gadget.feature/2.3.2-SNAPSHOT/org.wso2.carbon.store.extensions.assets.gadget.feature-2.3.2-20150820.200155-3.zip (2954 KB at 923.4 KB/sec)
Downloading: http://maven.wso2.org/nexus/content/groups/wso2-public/org/wso2/carbon/store/org.wso2.carbon.store.extensions.assets.site.feature/2.3.2-SNAPSHOT/maven-metadata.xml
Downloading: http://maven.wso2.org/nexus/content/repositories/releases/org/wso2/carbon/store/org.wso2.carbon.store.extensions.assets.site.feature/2.3.2-SNAPSHOT/maven-metadata.xml
Downloading: http://maven.wso2.org/nexus/content/repositories/snapshots/org/wso2/carbon/store/org.wso2.carbon.store.extensions.assets.site.feature/2.3.2-SNAPSHOT/maven-metadata.xml
Downloaded: http://maven.wso2.org/nexus/content/repositories/snapshots/org/wso2/carbon/store/org.wso2.carbon.store.extensions.assets.site.feature/2.3.2-SNAPSHOT/maven-metadata.xml (823 B at 1.1 KB/sec)
Downloading: http://maven.wso2.org/nexus/content/repositories/snapshots/org/wso2/carbon/store/org.wso2.carbon.store.extensions.assets.site.feature/2.3.2-SNAPSHOT/org.wso2.carbon.store.extensions.assets.site.feature-2.3.2-20150820.200204-3.zip
Downloaded: http://maven.wso2.org/nexus/content/repositories/snapshots/org/wso2/carbon/store/org.wso2.carbon.store.extensions.assets.site.feature/2.3.2-SNAPSHOT/org.wso2.carbon.store.extensions.assets.site.feature-2.3.2-20150820.200204-3.zip (463 KB at 216.5 KB/sec)
[INFO] Extracting feature org.jaggeryjs:org.jaggeryjs.feature
[INFO] Extracting feature org.wso2.carbon.deployment:org.wso2.carbon.webapp.mgt.server.feature
[INFO] Extracting feature org.jaggeryjs.modules:caramel.feature
[INFO] Extracting feature org.wso2.carbon.store:event.feature
[INFO] Extracting feature org.wso2.carbon.store:login.feature
[INFO] Extracting feature org.wso2.carbon.store:permission.feature
[INFO] Extracting feature org.wso2.carbon.store:registration.feature
[INFO] Extracting feature org.jaggeryjs.modules:sso.feature
[INFO] Extracting feature org.wso2.carbon.store:bampublisher.feature
[INFO] Extracting feature org.wso2.carbon.store:store.feature
[INFO] Extracting feature org.wso2.carbon.store:ues.feature
[INFO] Extracting feature org.wso2.carbon.store:account-management.feature
[INFO] Extracting feature org.wso2.carbon.store:rxt.feature
[INFO] Extracting feature org.wso2.carbon.store:utils.feature
[INFO] Extracting feature org.wso2.carbon.store:lifecycle.feature
[INFO] Extracting feature org.jaggeryjs.modules:handlebars.feature
[INFO] Extracting feature org.jaggeryjs.modules:markdown.feature
[INFO] Extracting feature org.jaggeryjs.modules:carbon.feature
[INFO] Extracting feature org.jaggeryjs.modules:process.feature
[INFO] Extracting feature org.jaggeryjs.modules:uuid.feature
[INFO] Extracting feature org.jaggeryjs.modules:jaggery-test.feature
[INFO] Extracting feature org.wso2.carbon.registry:org.wso2.carbon.registry.associations.dependencies.feature
[INFO] Extracting feature org.wso2.carbon.registry:org.wso2.carbon.registry.community.features.feature
[INFO] Extracting feature org.wso2.carbon.governance:org.wso2.carbon.registry.extensions.feature
[INFO] Extracting feature org.wso2.carbon.registry:org.wso2.carbon.registry.core.feature
[INFO] Extracting feature org.wso2.carbon.registry:org.wso2.carbon.registry.ui.menu.feature
[INFO] Extracting feature org.wso2.carbon.registry:org.wso2.carbon.registry.resource.properties.feature
[INFO] Extracting feature org.wso2.carbon.registry:org.wso2.carbon.registry.ui.menu.governance.feature
[INFO] Extracting feature org.wso2.carbon.registry:org.wso2.carbon.registry.contentsearch.server.feature
[INFO] Extracting feature org.wso2.es:org.wso2.store.styles.feature
[INFO] Extracting feature org.wso2.carbon.store:org.wso2.carbon.store.feature
[INFO] Extracting feature org.wso2.carbon.identity:org.wso2.carbon.security.mgt.feature
[INFO] Extracting feature org.wso2.carbon.identity:org.wso2.carbon.identity.application.authenticator.basicauth.server.feature
[INFO] Extracting feature org.wso2.carbon.identity:org.wso2.carbon.identity.application.authentication.framework.server.feature
[INFO] Extracting feature org.wso2.carbon.identity:org.wso2.carbon.identity.authenticator.saml2.sso.server.feature
[INFO] Extracting feature org.wso2.carbon.identity:org.wso2.carbon.identity.authenticator.saml2.sso.ui.feature
[INFO] Extracting feature org.wso2.carbon.identity:org.wso2.carbon.identity.sso.saml.feature
[INFO] Extracting feature org.wso2.carbon.identity:org.wso2.carbon.identity.user.profile.feature
[INFO] Extracting feature org.wso2.carbon.identity:org.wso2.carbon.identity.application.mgt.server.feature
[INFO] Extracting feature org.wso2.carbon.identity:org.wso2.carbon.idp.mgt.server.feature
[INFO] Extracting feature org.wso2.carbon.identity:org.wso2.carbon.identity.mgt.feature
[INFO] Extracting feature org.wso2.carbon.identity:org.wso2.carbon.identity.core.feature
[INFO] Extracting feature org.wso2.carbon.governance:org.wso2.carbon.governance.metadata.feature
[INFO] Extracting feature org.wso2.carbon.deployment:org.wso2.carbon.module.mgt.server.feature
[INFO] Extracting feature org.wso2.carbon.identity:org.wso2.carbon.user.mgt.feature
[INFO] Extracting feature org.wso2.carbon.commons:org.wso2.carbon.event.feature
[INFO] Extracting feature org.wso2.carbon.registry:org.wso2.carbon.registry.ws.feature
[INFO] Extracting feature org.wso2.carbon.governance:org.wso2.carbon.governance.lifecycle.management.feature
[INFO] Extracting feature org.wso2.carbon.identity:org.wso2.carbon.claim.mgt.feature
[INFO] Extracting feature org.wso2.carbon.multitenancy:org.wso2.carbon.tenant.common.feature
[INFO] Extracting feature org.wso2.carbon.commons:org.wso2.carbon.tenant.mgt.common.feature
[INFO] Extracting feature org.wso2.carbon.multitenancy:org.wso2.carbon.tenant.usage.agent.feature
[INFO] Extracting feature org.wso2.carbon.multitenancy:org.wso2.carbon.tenant.throttling.agent.feature
[INFO] Extracting feature org.wso2.carbon.multitenancy:org.wso2.carbon.tenant.deployment.feature
[INFO] Extracting feature org.wso2.carbon.store:org.wso2.carbon.social.feature
[INFO] Extracting feature org.wso2.carbon.commons:org.wso2.carbon.databridge.datapublisher.feature
[INFO] Extracting feature org.apache.axis2.transport:org.apache.axis2.transport.mail.feature
[INFO] Extracting feature org.wso2.carbon.commons:org.wso2.carbon.ntask.feature
[INFO] Extracting feature org.wso2.carbon.registry:org.wso2.carbon.registry.task.feature
[INFO] Extracting feature org.wso2.carbon.dashboards:org.wso2.carbon.dashboards.shindig.feature
[INFO] Extracting feature org.wso2.carbon.store:org.wso2.carbon.store.extensions.assets.gadget.feature
[INFO] Extracting feature org.wso2.carbon.store:org.wso2.carbon.store.extensions.assets.site.feature
[INFO] Extracting feature org.wso2.ciphertool:org.wso2.ciphertool.feature
[INFO] Copying resources
[INFO]    /home/wso2/jenwoker2/workspace/product-es/modules/p2-profile-gen/target/maven-shared-archive-resources
[INFO] Running Equinox P2 Publisher Application for Repository Generation
[INFO] Command line:
	/bin/sh -c cd /home/wso2/jenwoker2/workspace/product-es/modules/p2-profile-gen && /home/wso2/software/java/jdk1.7.0_51/jre/bin/java -jar /home/wso2/jenwoker2/workspace/product-es/.repository/org/eclipse/tycho/tycho-p2-runtime/0.13.0/eclipse/plugins/org.eclipse.equinox.launcher_1.2.0.v20110725-1610.jar -nosplash -application org.eclipse.equinox.p2.publisher.FeaturesAndBundlesPublisher -source /home/wso2/jenwoker2/workspace/product-es/modules/p2-profile-gen/target/tmp.1440102799805/featureExtract -metadataRepository file:/home/wso2/jenwoker2/workspace/product-es/modules/p2-profile-gen/target/p2-repo -metadataRepositoryName wso2es-profile-gen -artifactRepository file:/home/wso2/jenwoker2/workspace/product-es/modules/p2-profile-gen/target/p2-repo -artifactRepositoryName wso2es-profile-gen -publishArtifacts -publishArtifactRepository -compress -append
Generating metadata for ..
Generation completed with success [12 seconds].
[INFO] Running Equinox P2 Category Publisher Application for the Generated Repository
[INFO] 
[INFO] --- carbon-p2-plugin:1.5.3:p2-profile-gen (3-p2-profile-generation) @ wso2es-profile-gen ---
[INFO] Running Equinox P2 Director Application
[INFO] Command line:
	/bin/sh -c cd /home/wso2/jenwoker2/workspace/product-es/modules/p2-profile-gen && /home/wso2/software/java/jdk1.7.0_51/jre/bin/java -jar /home/wso2/jenwoker2/workspace/product-es/.repository/org/eclipse/tycho/tycho-p2-runtime/0.13.0/eclipse/plugins/org.eclipse.equinox.launcher_1.2.0.v20110725-1610.jar -nosplash -application org.eclipse.equinox.p2.director -metadataRepository file:/home/wso2/jenwoker2/workspace/product-es/modules/p2-profile-gen/target/p2-repo -artifactRepository file:/home/wso2/jenwoker2/workspace/product-es/modules/p2-profile-gen/target/p2-repo -profileProperties org.eclipse.update.install.features=true -installIU org.jaggeryjs.feature.group/0.10.2,org.wso2.carbon.webapp.mgt.server.feature.group/4.4.0,org.wso2.carbon.user.mgt.feature.group/4.5.4,org.jaggeryjs.modules.caramel.feature.group/1.0.1,org.jaggeryjs.modules.handlebars.feature.group/1.0.0,org.jaggeryjs.modules.markdown.feature.group/1.0.0,org.jaggeryjs.modules.carbon.feature.group/1.3.2,org.jaggeryjs.modules.process.feature.group/1.3.2,org.jaggeryjs.modules.uuid.feature.group/1.3.2,org.jaggeryjs.modules.jaggery-test.feature.group/1.3.2,org.wso2.store.modules.event.feature.group/2.3.2.SNAPSHOT,org.wso2.store.modules.login.feature.group/2.3.2.SNAPSHOT,org.wso2.store.modules.permission.feature.group/2.3.2.SNAPSHOT,org.wso2.store.modules.registration.feature.group/2.3.2.SNAPSHOT,org.jaggeryjs.modules.sso.feature.group/1.3.2,org.wso2.store.modules.bampublisher.feature.group/2.3.2.SNAPSHOT,org.wso2.store.modules.store.feature.group/2.3.2.SNAPSHOT,org.wso2.store.modules.ues.feature.group/2.3.2.SNAPSHOT,org.wso2.store.modules.account-management.feature.group/2.3.2.SNAPSHOT,org.wso2.store.modules.rxt.feature.group/2.3.2.SNAPSHOT,org.wso2.store.modules.utils.feature.group/2.3.2.SNAPSHOT,org.wso2.store.modules.lifecycle.feature.group/2.3.2.SNAPSHOT,org.wso2.carbon.registry.core.feature.group/4.4.5,org.wso2.carbon.registry.ui.menu.feature.group/4.4.5,org.wso2.carbon.registry.resource.properties.feature.group/4.4.5,org.wso2.carbon.registry.contentsearch.server.feature.group/4.4.5,org.wso2.carbon.registry.ws.feature.group/4.4.5,org.wso2.carbon.registry.extensions.feature.group/4.5.2,org.wso2.carbon.store.feature.group/2.3.2.SNAPSHOT,org.wso2.store.styles.feature.group/2.0.0.SNAPSHOT,org.wso2.carbon.security.mgt.feature.group/4.5.4,org.wso2.carbon.databridge.datapublisher.feature.group/4.4.4,org.wso2.carbon.identity.application.authenticator.basicauth.server.feature.group/4.5.4,org.wso2.carbon.identity.application.authentication.framework.server.feature.group/4.5.4,org.wso2.carbon.identity.authenticator.saml2.sso.server.feature.group/4.5.4,org.wso2.carbon.identity.authenticator.saml2.sso.ui.feature.group/4.5.4,org.wso2.carbon.identity.user.profile.feature.group/4.5.4,org.wso2.carbon.identity.application.mgt.server.feature.group/4.5.4,org.wso2.carbon.idp.mgt.server.feature.group/4.5.4,org.wso2.carbon.identity.mgt.feature.group/4.5.4,org.wso2.carbon.identity.core.feature.group/4.5.4,org.wso2.carbon.governance.metadata.feature.group/4.5.2,org.wso2.carbon.registry.ui.menu.governance.feature.group/4.4.5,org.wso2.carbon.governance.lifecycle.management.feature.group/4.5.2,org.wso2.carbon.event.feature.group/4.4.4,org.wso2.carbon.claim.mgt.feature.group/4.5.4,org.wso2.carbon.tenant.common.feature.group/4.4.1,org.wso2.carbon.tenant.mgt.common.feature.group/4.4.4,org.wso2.carbon.tenant.usage.agent.feature.group/4.4.1,org.wso2.carbon.tenant.throttling.agent.feature.group/4.4.1,org.wso2.carbon.tenant.deployment.feature.group/4.4.1,org.wso2.carbon.social.feature.group/2.3.2.SNAPSHOT,org.apache.axis2.transport.mail.feature.group/1.1.0.wso2v12,org.wso2.carbon.dashboards.shindig.feature.group/1.0.0,org.wso2.carbon.store.extensions.assets.gadget.feature.group/2.3.2.SNAPSHOT,org.wso2.carbon.store.extensions.assets.site.feature.group/2.3.2.SNAPSHOT,org.wso2.ciphertool.feature.group/1.0.0.wso2v3, -bundlepool /home/wso2/jenwoker2/workspace/product-es/modules/p2-profile-gen/target/wso2carbon-core-4.4.1/repository/components -shared /home/wso2/jenwoker2/workspace/product-es/modules/p2-profile-gen/target/wso2carbon-core-4.4.1/repository/components/p2 -destination /home/wso2/jenwoker2/workspace/product-es/modules/p2-profile-gen/target/wso2carbon-core-4.4.1/repository/components/default -profile default -roaming
Installing org.jaggeryjs.feature.group 0.10.2.
Installing org.wso2.carbon.webapp.mgt.server.feature.group 4.4.0.
Installing org.wso2.carbon.user.mgt.feature.group 4.5.4.
Installing org.jaggeryjs.modules.caramel.feature.group 1.0.1.
Installing org.jaggeryjs.modules.handlebars.feature.group 1.0.0.
Installing org.jaggeryjs.modules.markdown.feature.group 1.0.0.
Installing org.jaggeryjs.modules.carbon.feature.group 1.3.2.
Installing org.jaggeryjs.modules.process.feature.group 1.3.2.
Installing org.jaggeryjs.modules.uuid.feature.group 1.3.2.
Installing org.jaggeryjs.modules.jaggery-test.feature.group 1.3.2.
Installing org.wso2.store.modules.event.feature.group 2.3.2.SNAPSHOT.
Installing org.wso2.store.modules.login.feature.group 2.3.2.SNAPSHOT.
Installing org.wso2.store.modules.permission.feature.group 2.3.2.SNAPSHOT.
Installing org.wso2.store.modules.registration.feature.group 2.3.2.SNAPSHOT.
Installing org.jaggeryjs.modules.sso.feature.group 1.3.2.
Installing org.wso2.store.modules.bampublisher.feature.group 2.3.2.SNAPSHOT.
Installing org.wso2.store.modules.store.feature.group 2.3.2.SNAPSHOT.
Installing org.wso2.store.modules.ues.feature.group 2.3.2.SNAPSHOT.
Installing org.wso2.store.modules.account-management.feature.group 2.3.2.SNAPSHOT.
Installing org.wso2.store.modules.rxt.feature.group 2.3.2.SNAPSHOT.
Installing org.wso2.store.modules.utils.feature.group 2.3.2.SNAPSHOT.
Installing org.wso2.store.modules.lifecycle.feature.group 2.3.2.SNAPSHOT.
Installing org.wso2.carbon.registry.core.feature.group 4.4.5.
Installing org.wso2.carbon.registry.ui.menu.feature.group 4.4.5.
Installing org.wso2.carbon.registry.resource.properties.feature.group 4.4.5.
Installing org.wso2.carbon.registry.contentsearch.server.feature.group 4.4.5.
Installing org.wso2.carbon.registry.ws.feature.group 4.4.5.
Installing org.wso2.carbon.registry.extensions.feature.group 4.5.2.
Installing org.wso2.carbon.store.feature.group 2.3.2.SNAPSHOT.
Installing org.wso2.store.styles.feature.group 2.0.0.SNAPSHOT.
Installing org.wso2.carbon.security.mgt.feature.group 4.5.4.
Installing org.wso2.carbon.databridge.datapublisher.feature.group 4.4.4.
Installing org.wso2.carbon.identity.application.authenticator.basicauth.server.feature.group 4.5.4.
Installing org.wso2.carbon.identity.application.authentication.framework.server.feature.group 4.5.4.
Installing org.wso2.carbon.identity.authenticator.saml2.sso.server.feature.group 4.5.4.
Installing org.wso2.carbon.identity.authenticator.saml2.sso.ui.feature.group 4.5.4.
Installing org.wso2.carbon.identity.user.profile.feature.group 4.5.4.
Installing org.wso2.carbon.identity.application.mgt.server.feature.group 4.5.4.
Installing org.wso2.carbon.idp.mgt.server.feature.group 4.5.4.
Installing org.wso2.carbon.identity.mgt.feature.group 4.5.4.
Installing org.wso2.carbon.identity.core.feature.group 4.5.4.
Installing org.wso2.carbon.governance.metadata.feature.group 4.5.2.
Installing org.wso2.carbon.registry.ui.menu.governance.feature.group 4.4.5.
Installing org.wso2.carbon.governance.lifecycle.management.feature.group 4.5.2.
Installing org.wso2.carbon.event.feature.group 4.4.4.
Installing org.wso2.carbon.claim.mgt.feature.group 4.5.4.
Installing org.wso2.carbon.tenant.common.feature.group 4.4.1.
Installing org.wso2.carbon.tenant.mgt.common.feature.group 4.4.4.
Installing org.wso2.carbon.tenant.usage.agent.feature.group 4.4.1.
Installing org.wso2.carbon.tenant.throttling.agent.feature.group 4.4.1.
Installing org.wso2.carbon.tenant.deployment.feature.group 4.4.1.
Installing org.wso2.carbon.social.feature.group 2.3.2.SNAPSHOT.
Installing org.apache.axis2.transport.mail.feature.group 1.1.0.wso2v12.
Installing org.wso2.carbon.dashboards.shindig.feature.group 1.0.0.
Installing org.wso2.carbon.store.extensions.assets.gadget.feature.group 2.3.2.SNAPSHOT.
Installing org.wso2.carbon.store.extensions.assets.site.feature.group 2.3.2.SNAPSHOT.
Installing org.wso2.ciphertool.feature.group 1.0.0.wso2v3.
Operation completed in 22053 ms.
[INFO] 
[INFO] --- maven-antrun-plugin:1.7:run (configure-user-mgt.xml) @ wso2es-profile-gen ---
[WARNING] Parameter tasks is deprecated, use target instead
[INFO] Executing tasks

main:
[INFO] Executed tasks
[INFO] 
[INFO] --- maven-antrun-plugin:1.7:run (default) @ wso2es-profile-gen ---
[WARNING] Parameter tasks is deprecated, use target instead
[INFO] Executing tasks

main:
[INFO] Executed tasks
[INFO] 
[INFO] --- maven-install-plugin:2.5.2:install (default-install) @ wso2es-profile-gen ---
[INFO] Installing /home/wso2/jenwoker2/workspace/product-es/modules/p2-profile-gen/pom.xml to /home/wso2/jenwoker2/workspace/product-es/.repository/org/wso2/es/wso2es-profile-gen/2.0.0-SNAPSHOT/wso2es-profile-gen-2.0.0-SNAPSHOT.pom
[INFO]                                                                         
[INFO] ------------------------------------------------------------------------
[INFO] Building WSO2 Enterprise Store - Distribution 2.0.0-SNAPSHOT
[INFO] ------------------------------------------------------------------------
Downloading: http://repo.maven.apache.org/maven2/org/codehaus/mojo/buildnumber-maven-plugin/maven-metadata.xml
Downloading: http://maven.wso2.org/nexus/content/groups/wso2-public/org/codehaus/mojo/buildnumber-maven-plugin/maven-metadata.xml
Downloading: http://maven.wso2.org/nexus/content/repositories/snapshots/org/codehaus/mojo/buildnumber-maven-plugin/maven-metadata.xml
Downloading: http://maven.wso2.org/nexus/content/repositories/releases/org/codehaus/mojo/buildnumber-maven-plugin/maven-metadata.xml
Downloaded: http://repo.maven.apache.org/maven2/org/codehaus/mojo/buildnumber-maven-plugin/maven-metadata.xml (573 B at 1.5 KB/sec)
Downloaded: http://maven.wso2.org/nexus/content/groups/wso2-public/org/codehaus/mojo/buildnumber-maven-plugin/maven-metadata.xml (1006 B at 0.1 KB/sec)
[INFO] 
[INFO] --- maven-clean-plugin:2.6.1:clean (default-clean) @ wso2es ---
[INFO] Deleting /home/wso2/jenwoker2/workspace/product-es/modules/distribution/target
[INFO] 
[INFO] --- buildnumber-maven-plugin:1.3:create (default) @ wso2es ---
[INFO] Storing buildNumber: 20 Aug 2015 at timestamp: 1440102869887
[WARNING] Cannot get the branch information from the git repository: 
Detecting the current branch failed: fatal: ref HEAD is not a symbolic ref

[INFO] Executing: /bin/sh -c cd /home/wso2/jenwoker2/workspace/product-es/modules/distribution && git rev-parse --verify HEAD
[INFO] Working directory: /home/wso2/jenwoker2/workspace/product-es/modules/distribution
[INFO] Storing buildScmBranch: UNKNOWN
[INFO] 
[INFO] --- maven-remote-resources-plugin:1.5:process (default) @ wso2es ---
[INFO] 
[INFO] --- maven-resources-plugin:2.5:resources (default-resources) @ wso2es ---
[debug] execute contextualize
[INFO] Using 'UTF-8' encoding to copy filtered resources.
[INFO] skip non existing resourceDirectory /home/wso2/jenwoker2/workspace/product-es/modules/distribution/src/main/resources
[INFO] Copying 3 resources
[INFO] 
[INFO] --- maven-compiler-plugin:3.1:compile (default-compile) @ wso2es ---
[INFO] No sources to compile
[INFO] 
[INFO] --- maven-resources-plugin:2.5:testResources (default-testResources) @ wso2es ---
[debug] execute contextualize
[INFO] Using 'UTF-8' encoding to copy filtered resources.
[INFO] skip non existing resourceDirectory /home/wso2/jenwoker2/workspace/product-es/modules/distribution/src/test/resources
[INFO] Copying 3 resources
[INFO] 
[INFO] --- maven-compiler-plugin:3.1:testCompile (default-testCompile) @ wso2es ---
[INFO] No sources to compile
[INFO] 
[INFO] --- maven-surefire-plugin:2.12:test (default-test) @ wso2es ---
[INFO] Surefire report directory: /home/wso2/jenwoker2/workspace/product-es/modules/distribution/target/surefire-reports

-------------------------------------------------------
 T E S T S
-------------------------------------------------------

Results :

Tests run: 0, Failures: 0, Errors: 0, Skipped: 0

[JENKINS] Recording test results[INFO] 

[INFO] --- maven-assembly-plugin:2.4:attached (1-pre-dist) @ wso2es ---
[INFO] Reading assembly descriptor: /home/wso2/jenwoker2/workspace/product-es/modules/distribution/src/assembly/dist.xml
[INFO] Building zip: /home/wso2/jenwoker2/workspace/product-es/modules/distribution/target/wso2es-2.0.0-SNAPSHOT.zip
[INFO] 
[INFO] --- maven-jar-plugin:2.5:jar (default-jar) @ wso2es ---
[INFO] Building jar: /home/wso2/jenwoker2/workspace/product-es/modules/distribution/target/wso2es-2.0.0-SNAPSHOT.jar
[INFO] 
[INFO] --- maven-dependency-plugin:2.8:unpack (2-unpack-wso2carbon) @ wso2es ---
[INFO] Configured Artifact: org.wso2.carbon:wso2carbon-core:4.4.1:zip
[INFO] Unpacking /home/wso2/jenwoker2/workspace/product-es/.repository/org/wso2/carbon/wso2carbon-core/4.4.1/wso2carbon-core-4.4.1.zip to /home/wso2/jenwoker2/workspace/product-es/modules/distribution/target with includes "" and excludes ""
[INFO] 
[INFO] --- maven-antrun-plugin:1.7:run (configure-user-mgt.xml) @ wso2es ---
[WARNING] Parameter tasks is deprecated, use target instead
[INFO] Executing tasks

main:
[INFO] Executed tasks
[INFO] 
[INFO] --- maven-antrun-plugin:1.7:run (3-extract-docs-from-components) @ wso2es ---
[WARNING] Parameter tasks is deprecated, use target instead
[INFO] Executing tasks

main:
    [mkdir] Created dir: /home/wso2/jenwoker2/workspace/product-es/modules/distribution/target/docs-temp
    [unzip] Expanding: /home/wso2/jenwoker2/workspace/product-es/modules/distribution/target/wso2es-2.0.0-SNAPSHOT.zip into /home/wso2/jenwoker2/workspace/product-es/modules/distribution/target/docs-temp
     [copy] Copying 2548 files to /home/wso2/jenwoker2/workspace/product-es/modules/distribution/target/wso2carbon-core-4.4.1/repository/components
   [delete] Deleting: /home/wso2/jenwoker2/workspace/product-es/modules/distribution/target/wso2es-2.0.0-SNAPSHOT.zip
   [delete] Deleting directory /home/wso2/jenwoker2/workspace/product-es/modules/distribution/target/docs-temp
[INFO] Executed tasks
[INFO] 
[INFO] --- maven-antrun-plugin:1.7:run (2-identity-h2-table-gen) @ wso2es ---
[INFO] Executing tasks

main:
     [echo] ########### Create Identity Database ##############
     [copy] Copying 8 files to /home/wso2/jenwoker2/workspace/product-es/modules/distribution/target/wso2carbon-core-4.4.1/dbscripts/identity
     [echo] ########### Create Identity Database ##############
      [sql] Executing resource: /home/wso2/jenwoker2/workspace/product-es/modules/distribution/target/wso2carbon-core-4.4.1/dbscripts/identity/h2.sql
      [sql] 55 of 55 SQL statements executed successfully
     [echo] ##################### END ########################
[INFO] Executed tasks
[INFO] 
[INFO] --- maven-antrun-plugin:1.7:run (social-h2-table-gen) @ wso2es ---
[INFO] Executing tasks

main:
     [echo] ########### Create Social Database ##############
     [copy] Copying 6 files to /home/wso2/jenwoker2/workspace/product-es/modules/distribution/target/wso2carbon-core-4.4.1/dbscripts/social
[INFO] Executed tasks
[INFO] 
[INFO] --- maven-assembly-plugin:2.4:attached (2-dist) @ wso2es ---
[INFO] Reading assembly descriptor: /home/wso2/jenwoker2/workspace/product-es/modules/distribution/src/assembly/bin.xml
[WARNING] The following patterns were never triggered in this artifact inclusion filter:
o  'org.hibernate.wso2:hibernate:jar'
o  'org.apache.rampart:rampart:mar'

[INFO] Building zip: /home/wso2/jenwoker2/workspace/product-es/modules/distribution/target/wso2es-2.0.0-SNAPSHOT.zip
[WARNING] Artifact org.wso2.es:wso2es:zip:2.0.0-SNAPSHOT already attached to project, ignoring duplicate
[INFO] 
[INFO] --- maven-install-plugin:2.5.2:install (default-install) @ wso2es ---
[INFO] Installing /home/wso2/jenwoker2/workspace/product-es/modules/distribution/target/wso2es-2.0.0-SNAPSHOT.jar to /home/wso2/jenwoker2/workspace/product-es/.repository/org/wso2/es/wso2es/2.0.0-SNAPSHOT/wso2es-2.0.0-SNAPSHOT.jar
[INFO] Installing /home/wso2/jenwoker2/workspace/product-es/modules/distribution/pom.xml to /home/wso2/jenwoker2/workspace/product-es/.repository/org/wso2/es/wso2es/2.0.0-SNAPSHOT/wso2es-2.0.0-SNAPSHOT.pom
[INFO] Installing /home/wso2/jenwoker2/workspace/product-es/modules/distribution/target/wso2es-2.0.0-SNAPSHOT.zip to /home/wso2/jenwoker2/workspace/product-es/.repository/org/wso2/es/wso2es/2.0.0-SNAPSHOT/wso2es-2.0.0-SNAPSHOT.zip
[INFO] 
[INFO] --- maven-antrun-plugin:1.7:run (clean_target) @ wso2es ---
[WARNING] Parameter tasks is deprecated, use target instead
[INFO] Executing tasks

main:
   [delete] Deleting directory /home/wso2/jenwoker2/workspace/product-es/modules/distribution/target/archive-tmp
   [delete] Deleting directory /home/wso2/jenwoker2/workspace/product-es/modules/distribution/target/dependency-maven-plugin-markers
   [delete] Deleting directory /home/wso2/jenwoker2/workspace/product-es/modules/distribution/target/maven-archiver
   [delete] Deleting directory /home/wso2/jenwoker2/workspace/product-es/modules/distribution/target/wso2carbon-core-4.4.1
   [delete] Deleting: /home/wso2/jenwoker2/workspace/product-es/modules/distribution/target/wso2es-2.0.0-SNAPSHOT.jar
   [delete] Deleting directory /home/wso2/jenwoker2/workspace/product-es/modules/distribution/target/antrun
[INFO] Executed tasks
[INFO]                                                                         
[INFO] ------------------------------------------------------------------------
[INFO] Building wso2es-integration 2.0.0-SNAPSHOT
[INFO] ------------------------------------------------------------------------
[INFO] 
[INFO] --- maven-clean-plugin:2.6.1:clean (default-clean) @ wso2es-integration ---
[INFO] Deleting /home/wso2/jenwoker2/workspace/product-es/modules/integration/target
[INFO] 
[INFO] --- maven-remote-resources-plugin:1.5:process (default) @ wso2es-integration ---
[INFO] 
[INFO] --- maven-install-plugin:2.5.2:install (default-install) @ wso2es-integration ---
[INFO] Installing /home/wso2/jenwoker2/workspace/product-es/modules/integration/pom.xml to /home/wso2/jenwoker2/workspace/product-es/.repository/org/wso2/es/wso2es-integration/2.0.0-SNAPSHOT/wso2es-integration-2.0.0-SNAPSHOT.pom
[INFO]                                                                         
[INFO] ------------------------------------------------------------------------
[INFO] Building WSO2 ES Integration Test Common 2.0.0-SNAPSHOT
[INFO] ------------------------------------------------------------------------
[INFO] 
[INFO] --- maven-clean-plugin:2.6.1:clean (default-clean) @ es-integration-tests-common ---
[INFO] Deleting /home/wso2/jenwoker2/workspace/product-es/modules/integration/tests-common/target
[INFO] 
[INFO] --- maven-remote-resources-plugin:1.5:process (default) @ es-integration-tests-common ---
[INFO] 
[INFO] --- maven-install-plugin:2.5.2:install (default-install) @ es-integration-tests-common ---
[INFO] Installing /home/wso2/jenwoker2/workspace/product-es/modules/integration/tests-common/pom.xml to /home/wso2/jenwoker2/workspace/product-es/.repository/org/wso2/es/es-integration-tests-common/2.0.0-SNAPSHOT/es-integration-tests-common-2.0.0-SNAPSHOT.pom
[INFO]                                                                         
[INFO] ------------------------------------------------------------------------
[INFO] Building admin-clients 2.0.0-SNAPSHOT
[INFO] ------------------------------------------------------------------------
[INFO] 
[INFO] --- maven-clean-plugin:2.6.1:clean (default-clean) @ org.wso2.es.integration.common.clients ---
[INFO] Deleting /home/wso2/jenwoker2/workspace/product-es/modules/integration/tests-common/admin-clients/target
[INFO] 
[INFO] --- maven-remote-resources-plugin:1.5:process (default) @ org.wso2.es.integration.common.clients ---
[INFO] 
[INFO] --- maven-resources-plugin:2.5:resources (default-resources) @ org.wso2.es.integration.common.clients ---
[debug] execute contextualize
[INFO] Using 'UTF-8' encoding to copy filtered resources.
[INFO] skip non existing resourceDirectory /home/wso2/jenwoker2/workspace/product-es/modules/integration/tests-common/admin-clients/src/main/resources
[INFO] Copying 3 resources
[INFO] 
[INFO] --- maven-compiler-plugin:3.1:compile (default-compile) @ org.wso2.es.integration.common.clients ---
[INFO] Changes detected - recompiling the module!
[INFO] Compiling 2 source files to /home/wso2/jenwoker2/workspace/product-es/modules/integration/tests-common/admin-clients/target/classes
[INFO] 
[INFO] --- maven-resources-plugin:2.5:testResources (default-testResources) @ org.wso2.es.integration.common.clients ---
[debug] execute contextualize
[INFO] Using 'UTF-8' encoding to copy filtered resources.
[INFO] skip non existing resourceDirectory /home/wso2/jenwoker2/workspace/product-es/modules/integration/tests-common/admin-clients/src/test/resources
[INFO] Copying 3 resources
[INFO] 
[INFO] --- maven-compiler-plugin:3.1:testCompile (default-testCompile) @ org.wso2.es.integration.common.clients ---
[INFO] No sources to compile
[INFO] 
[INFO] --- maven-surefire-plugin:2.12:test (default-test) @ org.wso2.es.integration.common.clients ---
[INFO] Surefire report directory: /home/wso2/jenwoker2/workspace/product-es/modules/integration/tests-common/admin-clients/target/surefire-reports

-------------------------------------------------------
 T E S T S
-------------------------------------------------------

Results :

Tests run: 0, Failures: 0, Errors: 0, Skipped: 0

[JENKINS] Recording test results
[INFO] 
[INFO] --- maven-jar-plugin:2.5:jar (default-jar) @ org.wso2.es.integration.common.clients ---
[INFO] Building jar: /home/wso2/jenwoker2/workspace/product-es/modules/integration/tests-common/admin-clients/target/org.wso2.es.integration.common.clients-2.0.0-SNAPSHOT.jar
[INFO] 
[INFO] --- maven-install-plugin:2.5.2:install (default-install) @ org.wso2.es.integration.common.clients ---
[INFO] Installing /home/wso2/jenwoker2/workspace/product-es/modules/integration/tests-common/admin-clients/target/org.wso2.es.integration.common.clients-2.0.0-SNAPSHOT.jar to /home/wso2/jenwoker2/workspace/product-es/.repository/org/wso2/es/org.wso2.es.integration.common.clients/2.0.0-SNAPSHOT/org.wso2.es.integration.common.clients-2.0.0-SNAPSHOT.jar
[INFO] Installing /home/wso2/jenwoker2/workspace/product-es/modules/integration/tests-common/admin-clients/pom.xml to /home/wso2/jenwoker2/workspace/product-es/.repository/org/wso2/es/org.wso2.es.integration.common.clients/2.0.0-SNAPSHOT/org.wso2.es.integration.common.clients-2.0.0-SNAPSHOT.pom
[INFO]                                                                         
[INFO] ------------------------------------------------------------------------
[INFO] Building ES Integration Test UI Pages 2.0.0-SNAPSHOT
[INFO] ------------------------------------------------------------------------
[INFO] 
[INFO] --- maven-clean-plugin:2.6.1:clean (default-clean) @ ui-pages ---
[INFO] Deleting /home/wso2/jenwoker2/workspace/product-es/modules/integration/tests-common/ui-pages/target
[INFO] 
[INFO] --- maven-remote-resources-plugin:1.5:process (default) @ ui-pages ---
[INFO] 
[INFO] --- maven-resources-plugin:2.5:resources (default-resources) @ ui-pages ---
[debug] execute contextualize
[INFO] Using 'UTF-8' encoding to copy filtered resources.
[INFO] Copying 1 resource
[INFO] Copying 3 resources
[INFO] 
[INFO] --- maven-compiler-plugin:3.1:compile (default-compile) @ ui-pages ---
[INFO] Changes detected - recompiling the module!
[INFO] Compiling 3 source files to /home/wso2/jenwoker2/workspace/product-es/modules/integration/tests-common/ui-pages/target/classes
[INFO] 
[INFO] --- maven-resources-plugin:2.5:testResources (default-testResources) @ ui-pages ---
[debug] execute contextualize
[INFO] Using 'UTF-8' encoding to copy filtered resources.
[INFO] skip non existing resourceDirectory /home/wso2/jenwoker2/workspace/product-es/modules/integration/tests-common/ui-pages/src/test/resources
[INFO] Copying 3 resources
[INFO] 
[INFO] --- maven-compiler-plugin:3.1:testCompile (default-testCompile) @ ui-pages ---
[INFO] No sources to compile
[INFO] 
[INFO] --- maven-surefire-plugin:2.12:test (default-test) @ ui-pages ---
[INFO] Surefire report directory: /home/wso2/jenwoker2/workspace/product-es/modules/integration/tests-common/ui-pages/target/surefire-reports

-------------------------------------------------------
 T E S T S
-------------------------------------------------------

Results :

Tests run: 0, Failures: 0, Errors: 0, Skipped: 0

[JENKINS] Recording test results
[INFO] 
[INFO] --- maven-jar-plugin:2.5:jar (default-jar) @ ui-pages ---
[INFO] Building jar: /home/wso2/jenwoker2/workspace/product-es/modules/integration/tests-common/ui-pages/target/ui-pages-2.0.0-SNAPSHOT.jar
[INFO] 
[INFO] --- maven-install-plugin:2.5.2:install (default-install) @ ui-pages ---
[INFO] Installing /home/wso2/jenwoker2/workspace/product-es/modules/integration/tests-common/ui-pages/target/ui-pages-2.0.0-SNAPSHOT.jar to /home/wso2/jenwoker2/workspace/product-es/.repository/org/wso2/es/ui-pages/2.0.0-SNAPSHOT/ui-pages-2.0.0-SNAPSHOT.jar
[INFO] Installing /home/wso2/jenwoker2/workspace/product-es/modules/integration/tests-common/ui-pages/pom.xml to /home/wso2/jenwoker2/workspace/product-es/.repository/org/wso2/es/ui-pages/2.0.0-SNAPSHOT/ui-pages-2.0.0-SNAPSHOT.pom
[INFO]                                                                         
[INFO] ------------------------------------------------------------------------
[INFO] Building integration-test-utils 2.0.0-SNAPSHOT
[INFO] ------------------------------------------------------------------------
[INFO] 
[INFO] --- maven-clean-plugin:2.6.1:clean (default-clean) @ org.wso2.es.integration.common.utils ---
[INFO] Deleting /home/wso2/jenwoker2/workspace/product-es/modules/integration/tests-common/integration-test-utils/target
[INFO] 
[INFO] --- maven-remote-resources-plugin:1.5:process (default) @ org.wso2.es.integration.common.utils ---
Downloading: http://maven.wso2.org/nexus/content/groups/wso2-public/com/saucelabs/selenium/selenium-client-factory/2.6/selenium-client-factory-2.6.pom
Downloading: http://maven.wso2.org/nexus/content/repositories/releases/com/saucelabs/selenium/selenium-client-factory/2.6/selenium-client-factory-2.6.pom
Downloading: http://repo.maven.apache.org/maven2/com/saucelabs/selenium/selenium-client-factory/2.6/selenium-client-factory-2.6.pom
Downloading: http://maven.wso2.org/nexus/content/groups/wso2-public/com/saucelabs/selenium/sauce-ondemand-driver/2.6/sauce-ondemand-driver-2.6.pom
Downloading: http://maven.wso2.org/nexus/content/repositories/releases/com/saucelabs/selenium/sauce-ondemand-driver/2.6/sauce-ondemand-driver-2.6.pom
Downloading: http://repo.maven.apache.org/maven2/com/saucelabs/selenium/sauce-ondemand-driver/2.6/sauce-ondemand-driver-2.6.pom
[INFO] 
[INFO] --- maven-resources-plugin:2.5:resources (default-resources) @ org.wso2.es.integration.common.utils ---
[debug] execute contextualize
[INFO] Using 'UTF-8' encoding to copy filtered resources.
[INFO] skip non existing resourceDirectory /home/wso2/jenwoker2/workspace/product-es/modules/integration/tests-common/integration-test-utils/src/main/resources
[INFO] Copying 3 resources
[INFO] 
[INFO] --- maven-compiler-plugin:3.1:compile (default-compile) @ org.wso2.es.integration.common.utils ---
[INFO] Changes detected - recompiling the module!
[INFO] Compiling 13 source files to /home/wso2/jenwoker2/workspace/product-es/modules/integration/tests-common/integration-test-utils/target/classes
[INFO] 
[INFO] --- maven-resources-plugin:2.5:testResources (default-testResources) @ org.wso2.es.integration.common.utils ---
[debug] execute contextualize
[INFO] Using 'UTF-8' encoding to copy filtered resources.
[INFO] skip non existing resourceDirectory /home/wso2/jenwoker2/workspace/product-es/modules/integration/tests-common/integration-test-utils/src/test/resources
[INFO] Copying 3 resources
[INFO] 
[INFO] --- maven-compiler-plugin:3.1:testCompile (default-testCompile) @ org.wso2.es.integration.common.utils ---
[INFO] No sources to compile
[INFO] 
[INFO] --- maven-surefire-plugin:2.12:test (default-test) @ org.wso2.es.integration.common.utils ---
[INFO] Surefire report directory: /home/wso2/jenwoker2/workspace/product-es/modules/integration/tests-common/integration-test-utils/target/surefire-reports

-------------------------------------------------------
 T E S T S
-------------------------------------------------------

Results :

Tests run: 0, Failures: 0, Errors: 0, Skipped: 0

[JENKINS] Recording test results
[INFO] 
[INFO] --- maven-jar-plugin:2.5:jar (default-jar) @ org.wso2.es.integration.common.utils ---
[INFO] Building jar: /home/wso2/jenwoker2/workspace/product-es/modules/integration/tests-common/integration-test-utils/target/org.wso2.es.integration.common.utils-2.0.0-SNAPSHOT.jar
[INFO] 
[INFO] --- maven-install-plugin:2.5.2:install (default-install) @ org.wso2.es.integration.common.utils ---
[INFO] Installing /home/wso2/jenwoker2/workspace/product-es/modules/integration/tests-common/integration-test-utils/target/org.wso2.es.integration.common.utils-2.0.0-SNAPSHOT.jar to /home/wso2/jenwoker2/workspace/product-es/.repository/org/wso2/es/org.wso2.es.integration.common.utils/2.0.0-SNAPSHOT/org.wso2.es.integration.common.utils-2.0.0-SNAPSHOT.jar
[INFO] Installing /home/wso2/jenwoker2/workspace/product-es/modules/integration/tests-common/integration-test-utils/pom.xml to /home/wso2/jenwoker2/workspace/product-es/.repository/org/wso2/es/org.wso2.es.integration.common.utils/2.0.0-SNAPSHOT/org.wso2.es.integration.common.utils-2.0.0-SNAPSHOT.pom
[INFO]                                                                         
[INFO] ------------------------------------------------------------------------
[INFO] Building WSO2 ES Integration Test 2.0.0-SNAPSHOT
[INFO] ------------------------------------------------------------------------
[INFO] 
[INFO] --- maven-clean-plugin:2.6.1:clean (default-clean) @ es-integration-tests ---
[INFO] Deleting /home/wso2/jenwoker2/workspace/product-es/modules/integration/tests-integration/target
[INFO] 
[INFO] --- maven-remote-resources-plugin:1.5:process (default) @ es-integration-tests ---
[INFO] 
[INFO] --- maven-install-plugin:2.5.2:install (default-install) @ es-integration-tests ---
[INFO] Installing /home/wso2/jenwoker2/workspace/product-es/modules/integration/tests-integration/pom.xml to /home/wso2/jenwoker2/workspace/product-es/.repository/org/wso2/es/es-integration-tests/2.0.0-SNAPSHOT/es-integration-tests-2.0.0-SNAPSHOT.pom
[INFO]                                                                         
[INFO] ------------------------------------------------------------------------
[INFO] Building org.wso2.es.integration.test 2.0.0-SNAPSHOT
[INFO] ------------------------------------------------------------------------
[INFO] 
[INFO] --- maven-clean-plugin:2.6.1:clean (default-clean) @ org.wso2.es.integration.test ---
[INFO] Deleting /home/wso2/jenwoker2/workspace/product-es/modules/integration/tests-integration/tests/target
[INFO] Deleting /home/wso2/jenwoker2/workspace/product-es/modules/integration/tests-integration/tests/src/test/resources/client/modules (includes = [**/*.mar], excludes = [])
[INFO] 
[INFO] --- maven-remote-resources-plugin:1.5:process (default) @ org.wso2.es.integration.test ---
[INFO] 
[INFO] --- maven-resources-plugin:2.5:resources (default-resources) @ org.wso2.es.integration.test ---
[debug] execute contextualize
[INFO] Using 'UTF-8' encoding to copy filtered resources.
[INFO] skip non existing resourceDirectory /home/wso2/jenwoker2/workspace/product-es/modules/integration/tests-integration/tests/src/main/resources
[INFO] Copying 3 resources
[INFO] 
[INFO] --- maven-compiler-plugin:3.1:compile (default-compile) @ org.wso2.es.integration.test ---
[INFO] No sources to compile
[INFO] 
[INFO] --- maven-dependency-plugin:2.8:copy-dependencies (copy-emma-dependencies) @ org.wso2.es.integration.test ---
[INFO] 
[INFO] --- maven-dependency-plugin:2.8:copy-dependencies (copy-jar-dependencies) @ org.wso2.es.integration.test ---
[INFO] 
[INFO] --- maven-dependency-plugin:2.8:copy-dependencies (copy-secVerifier) @ org.wso2.es.integration.test ---
[INFO] 
[INFO] --- maven-dependency-plugin:2.8:unpack (unpack-mar-jks) @ org.wso2.es.integration.test ---
[INFO] Configured Artifact: org.wso2.es:wso2es:2.0.0-SNAPSHOT:zip
[INFO] Unpacking /home/wso2/jenwoker2/workspace/product-es/modules/distribution/target/wso2es-2.0.0-SNAPSHOT.zip to /home/wso2/jenwoker2/workspace/product-es/modules/integration/tests-integration/tests/target/tobeCopied with includes "**/*.jks,**/*.mar" and excludes ""
[INFO] 
[INFO] --- maven-resources-plugin:2.5:copy-resources (copy-resources-jks) @ org.wso2.es.integration.test ---
[debug] execute contextualize
[INFO] Using 'UTF-8' encoding to copy filtered resources.
[INFO] Copying 2 resources
[INFO] 
[INFO] --- maven-resources-plugin:2.5:copy-resources (copy-resources-mar) @ org.wso2.es.integration.test ---
[debug] execute contextualize
[INFO] Using 'UTF-8' encoding to copy filtered resources.
[INFO] Copying 1 resource
[INFO] 
[INFO] --- maven-resources-plugin:2.5:testResources (default-testResources) @ org.wso2.es.integration.test ---
[debug] execute contextualize
[INFO] Using 'UTF-8' encoding to copy filtered resources.
[INFO] Copying 28 resources
[INFO] Copying 3 resources
[INFO] 
[INFO] --- maven-compiler-plugin:3.1:testCompile (default-testCompile) @ org.wso2.es.integration.test ---
[INFO] Changes detected - recompiling the module!
[INFO] Compiling 2 source files to /home/wso2/jenwoker2/workspace/product-es/modules/integration/tests-integration/tests/target/test-classes
[INFO] 
[INFO] --- maven-surefire-plugin:2.12:test (default-test) @ org.wso2.es.integration.test ---
[INFO] Surefire report directory: /home/wso2/jenwoker2/workspace/product-es/modules/integration/tests-integration/tests/target/surefire-reports

-------------------------------------------------------
 T E S T S
-------------------------------------------------------
Running TestSuite
INFO  [org.wso2.es.integration.common.utils.ESServerExtensionForWait] - Initializing Testing Enterprise Store Jaggery-APPs
INFO  [org.wso2.carbon.automation.extensions.servers.carbonserver.CarbonServerManager] - Extracting carbon zip file.. 
INFO  [org.wso2.carbon.automation.extensions.servers.carbonserver.TestServerManager] - Carbon Home - /home/wso2/jenwoker2/workspace/product-es/modules/integration/tests-integration/tests/target/carbontmp1440103157717/wso2es-2.0.0-SNAPSHOT
INFO  [org.wso2.carbon.automation.extensions.servers.utils.ClientConnectionUtil] - Successfully connected to the server on port 9763
ERROR [org.wso2.carbon.automation.extensions.servers.carbonserver.CarbonServerExtension] - Fail to start carbon server 
org.wso2.carbon.automation.engine.exceptions.AutomationFrameworkException: Unable to start carbon server on port 9763 : Port already in use
	at org.wso2.carbon.automation.extensions.servers.carbonserver.CarbonServerManager.checkPortAvailability(CarbonServerManager.java:150)
	at org.wso2.carbon.automation.extensions.servers.carbonserver.CarbonServerManager.startServerUsingCarbonHome(CarbonServerManager.java:73)
	at org.wso2.carbon.automation.extensions.servers.carbonserver.TestServerManager.startServer(TestServerManager.java:116)
	at org.wso2.carbon.automation.extensions.servers.carbonserver.CarbonServerExtension.onExecutionStart(CarbonServerExtension.java:50)
	at sun.reflect.NativeMethodAccessorImpl.invoke0(Native Method)
	at sun.reflect.NativeMethodAccessorImpl.invoke(NativeMethodAccessorImpl.java:57)
	at sun.reflect.DelegatingMethodAccessorImpl.invoke(DelegatingMethodAccessorImpl.java:43)
	at java.lang.reflect.Method.invoke(Method.java:606)
	at org.wso2.carbon.automation.engine.extensions.TestNGExtensionExecutor.executeExtensible(TestNGExtensionExecutor.java:75)
	at org.wso2.carbon.automation.engine.testlisteners.TestExecutionListener.onExecutionStart(TestExecutionListener.java:47)
	at org.testng.TestNG.runExecutionListeners(TestNG.java:1094)
	at org.testng.TestNG.run(TestNG.java:1041)
	at org.apache.maven.surefire.testng.TestNGExecutor.run(TestNGExecutor.java:177)
	at org.apache.maven.surefire.testng.TestNGXmlTestSuite.execute(TestNGXmlTestSuite.java:92)
	at org.apache.maven.surefire.testng.TestNGProvider.invoke(TestNGProvider.java:105)
	at sun.reflect.NativeMethodAccessorImpl.invoke0(Native Method)
	at sun.reflect.NativeMethodAccessorImpl.invoke(NativeMethodAccessorImpl.java:57)
	at sun.reflect.DelegatingMethodAccessorImpl.invoke(DelegatingMethodAccessorImpl.java:43)
	at java.lang.reflect.Method.invoke(Method.java:606)
	at org.apache.maven.surefire.util.ReflectionUtils.invokeMethodWithArray(ReflectionUtils.java:189)
	at org.apache.maven.surefire.booter.ProviderFactory$ProviderProxy.invoke(ProviderFactory.java:165)
	at org.apache.maven.surefire.booter.ProviderFactory.invokeProvider(ProviderFactory.java:85)
	at org.apache.maven.surefire.booter.ForkedBooter.runSuitesInProcess(ForkedBooter.java:103)
	at org.apache.maven.surefire.booter.ForkedBooter.main(ForkedBooter.java:74)
ERROR [org.wso2.carbon.automation.engine.testlisteners.TestExecutionListener] - Execution error occurred in TestExecutionListener:-
java.lang.reflect.InvocationTargetException
	at sun.reflect.NativeMethodAccessorImpl.invoke0(Native Method)
	at sun.reflect.NativeMethodAccessorImpl.invoke(NativeMethodAccessorImpl.java:57)
	at sun.reflect.DelegatingMethodAccessorImpl.invoke(DelegatingMethodAccessorImpl.java:43)
	at java.lang.reflect.Method.invoke(Method.java:606)
	at org.wso2.carbon.automation.engine.extensions.TestNGExtensionExecutor.executeExtensible(TestNGExtensionExecutor.java:75)
	at org.wso2.carbon.automation.engine.testlisteners.TestExecutionListener.onExecutionStart(TestExecutionListener.java:47)
	at org.testng.TestNG.runExecutionListeners(TestNG.java:1094)
	at org.testng.TestNG.run(TestNG.java:1041)
	at org.apache.maven.surefire.testng.TestNGExecutor.run(TestNGExecutor.java:177)
	at org.apache.maven.surefire.testng.TestNGXmlTestSuite.execute(TestNGXmlTestSuite.java:92)
	at org.apache.maven.surefire.testng.TestNGProvider.invoke(TestNGProvider.java:105)
	at sun.reflect.NativeMethodAccessorImpl.invoke0(Native Method)
	at sun.reflect.NativeMethodAccessorImpl.invoke(NativeMethodAccessorImpl.java:57)
	at sun.reflect.DelegatingMethodAccessorImpl.invoke(DelegatingMethodAccessorImpl.java:43)
	at java.lang.reflect.Method.invoke(Method.java:606)
	at org.apache.maven.surefire.util.ReflectionUtils.invokeMethodWithArray(ReflectionUtils.java:189)
	at org.apache.maven.surefire.booter.ProviderFactory$ProviderProxy.invoke(ProviderFactory.java:165)
	at org.apache.maven.surefire.booter.ProviderFactory.invokeProvider(ProviderFactory.java:85)
	at org.apache.maven.surefire.booter.ForkedBooter.runSuitesInProcess(ForkedBooter.java:103)
	at org.apache.maven.surefire.booter.ForkedBooter.main(ForkedBooter.java:74)
Caused by: java.lang.RuntimeException: Fail to start carbon server 
	at org.wso2.carbon.automation.extensions.servers.carbonserver.CarbonServerExtension.handleException(CarbonServerExtension.java:70)
	at org.wso2.carbon.automation.extensions.servers.carbonserver.CarbonServerExtension.onExecutionStart(CarbonServerExtension.java:54)
	... 20 more
Caused by: org.wso2.carbon.automation.engine.exceptions.AutomationFrameworkException: Unable to start carbon server on port 9763 : Port already in use
	at org.wso2.carbon.automation.extensions.servers.carbonserver.CarbonServerManager.checkPortAvailability(CarbonServerManager.java:150)
	at org.wso2.carbon.automation.extensions.servers.carbonserver.CarbonServerManager.startServerUsingCarbonHome(CarbonServerManager.java:73)
	at org.wso2.carbon.automation.extensions.servers.carbonserver.TestServerManager.startServer(TestServerManager.java:116)
	at org.wso2.carbon.automation.extensions.servers.carbonserver.CarbonServerExtension.onExecutionStart(CarbonServerExtension.java:50)
	... 20 more
org.apache.maven.surefire.util.SurefireReflectionException: java.lang.reflect.InvocationTargetException; nested exception is java.lang.reflect.InvocationTargetException: null
java.lang.reflect.InvocationTargetException
	at sun.reflect.NativeMethodAccessorImpl.invoke0(Native Method)
	at sun.reflect.NativeMethodAccessorImpl.invoke(NativeMethodAccessorImpl.java:57)
	at sun.reflect.DelegatingMethodAccessorImpl.invoke(DelegatingMethodAccessorImpl.java:43)
	at java.lang.reflect.Method.invoke(Method.java:606)
	at org.apache.maven.surefire.util.ReflectionUtils.invokeMethodWithArray(ReflectionUtils.java:189)
	at org.apache.maven.surefire.booter.ProviderFactory$ProviderProxy.invoke(ProviderFactory.java:165)
	at org.apache.maven.surefire.booter.ProviderFactory.invokeProvider(ProviderFactory.java:85)
	at org.apache.maven.surefire.booter.ForkedBooter.runSuitesInProcess(ForkedBooter.java:103)
	at org.apache.maven.surefire.booter.ForkedBooter.main(ForkedBooter.java:74)
Caused by: java.lang.RuntimeException: Error on initializing test environment 
	at org.wso2.carbon.automation.engine.testlisteners.TestExecutionListener.handleException(TestExecutionListener.java:71)
	at org.wso2.carbon.automation.engine.testlisteners.TestExecutionListener.onExecutionStart(TestExecutionListener.java:52)
	at org.testng.TestNG.runExecutionListeners(TestNG.java:1094)
	at org.testng.TestNG.run(TestNG.java:1041)
	at org.apache.maven.surefire.testng.TestNGExecutor.run(TestNGExecutor.java:177)
	at org.apache.maven.surefire.testng.TestNGXmlTestSuite.execute(TestNGXmlTestSuite.java:92)
	at org.apache.maven.surefire.testng.TestNGProvider.invoke(TestNGProvider.java:105)
	... 9 more
Caused by: java.lang.reflect.InvocationTargetException
	at sun.reflect.NativeMethodAccessorImpl.invoke0(Native Method)
	at sun.reflect.NativeMethodAccessorImpl.invoke(NativeMethodAccessorImpl.java:57)
	at sun.reflect.DelegatingMethodAccessorImpl.invoke(DelegatingMethodAccessorImpl.java:43)
	at java.lang.reflect.Method.invoke(Method.java:606)
	at org.wso2.carbon.automation.engine.extensions.TestNGExtensionExecutor.executeExtensible(TestNGExtensionExecutor.java:75)
	at org.wso2.carbon.automation.engine.testlisteners.TestExecutionListener.onExecutionStart(TestExecutionListener.java:47)
	... 14 more
Caused by: java.lang.RuntimeException: Fail to start carbon server 
	at org.wso2.carbon.automation.extensions.servers.carbonserver.CarbonServerExtension.handleException(CarbonServerExtension.java:70)
	at org.wso2.carbon.automation.extensions.servers.carbonserver.CarbonServerExtension.onExecutionStart(CarbonServerExtension.java:54)
	... 20 more
Caused by: org.wso2.carbon.automation.engine.exceptions.AutomationFrameworkException: Unable to start carbon server on port 9763 : Port already in use
	at org.wso2.carbon.automation.extensions.servers.carbonserver.CarbonServerManager.checkPortAvailability(CarbonServerManager.java:150)
	at org.wso2.carbon.automation.extensions.servers.carbonserver.CarbonServerManager.startServerUsingCarbonHome(CarbonServerManager.java:73)
	at org.wso2.carbon.automation.extensions.servers.carbonserver.TestServerManager.startServer(TestServerManager.java:116)
	at org.wso2.carbon.automation.extensions.servers.carbonserver.CarbonServerExtension.onExecutionStart(CarbonServerExtension.java:50)
	... 20 more

Results :

Tests run: 0, Failures: 0, Errors: 0, Skipped: 0

[JENKINS] Recording test results
[INFO] ------------------------------------------------------------------------
[INFO] Reactor Summary:
[INFO] 
[INFO] WSO2 Enterprise Store ............................. SUCCESS [9.308s]
[INFO] WSO2 Enterprise Store - UI styles ................. SUCCESS [6.969s]
[INFO] WSO2 Enterprise Store Features .................... SUCCESS [1.623s]
[INFO] WSO2 Enterprise Store Styles Feature .............. SUCCESS [2.337s]
[INFO] wso2es-profile-gen ................................ SUCCESS [1:42.931s]
[INFO] WSO2 Enterprise Store - Distribution .............. SUCCESS [40.883s]
[INFO] wso2es-integration ................................ SUCCESS [1.085s]
[INFO] WSO2 ES Integration Test Common ................... SUCCESS [1.610s]
[INFO] admin-clients ..................................... SUCCESS [7.224s]
[INFO] ES Integration Test UI Pages ...................... SUCCESS [4.080s]
[INFO] integration-test-utils ............................ SUCCESS [1:54.241s]
[INFO] WSO2 ES Integration Test .......................... SUCCESS [1.154s]
[INFO] org.wso2.es.integration.test ...................... FAILURE [21.393s]
[INFO] WSO2 ES UI Integration Test ....................... SKIPPED
[INFO] ui-test-utils ..................................... SKIPPED
[INFO] WSO2 ES UI Integration Test - Extension ........... SKIPPED
[INFO] WSO2 ES UI Integration Test - Default Pages ....... SKIPPED
[INFO] es-platform-tests ................................. SKIPPED
[INFO] org.wso2.store.platform.tests ..................... SKIPPED
[INFO] ------------------------------------------------------------------------
[INFO] BUILD FAILURE
[INFO] ------------------------------------------------------------------------
[INFO] Total time: 9:07.625s
[INFO] Finished at: Thu Aug 20 16:39:44 EDT 2015
[INFO] Final Memory: 66M/422M
[INFO] ------------------------------------------------------------------------
Waiting for Jenkins to finish collecting data
[ERROR] Failed to execute goal org.apache.maven.plugins:maven-surefire-plugin:2.12:test (default-test) on project org.wso2.es.integration.test: Error occurred in starting fork, check output in log -> [Help 1]
[ERROR] 
[ERROR] To see the full stack trace of the errors, re-run Maven with the -e switch.
[ERROR] Re-run Maven using the -X switch to enable full debug logging.
[ERROR] 
[ERROR] For more information about the errors and possible solutions, please read the following articles:
[ERROR] [Help 1] http://cwiki.apache.org/confluence/display/MAVEN/MojoExecutionException
[ERROR] 
[ERROR] After correcting the problems, you can resume the build with the command
[ERROR]   mvn <goals> -rf :org.wso2.es.integration.test
[JENKINS] Archiving /home/wso2/jenwoker2/workspace/product-es/modules/integration/tests-integration/tests/pom.xml to org.wso2.es/org.wso2.es.integration.test/2.0.0-SNAPSHOT/org.wso2.es.integration.test-2.0.0-SNAPSHOT.pom
[JENKINS] Archiving /home/wso2/jenwoker2/workspace/product-es/modules/integration/tests-ui-integration/tests-ui-extension/pom.xml to org.wso2.es/tests-ui-extension/2.0.0-SNAPSHOT/tests-ui-extension-2.0.0-SNAPSHOT.pom
[JENKINS] Archiving /home/wso2/jenwoker2/workspace/product-es/modules/integration/tests-ui-integration/pom.xml to org.wso2.es/es-ui-integration-tests/2.0.0-SNAPSHOT/es-ui-integration-tests-2.0.0-SNAPSHOT.pom
[JENKINS] Archiving /home/wso2/jenwoker2/workspace/product-es/modules/integration/tests-ui-integration/tests-ui/pom.xml to org.wso2.es/test-ui/2.0.0-SNAPSHOT/test-ui-2.0.0-SNAPSHOT.pom
[JENKINS] Archiving /home/wso2/jenwoker2/workspace/product-es/modules/components/store-admin/pom.xml to org.wso2.es/org.wso2.store.admin.styles/2.0.0-SNAPSHOT/org.wso2.store.admin.styles-2.0.0-SNAPSHOT.pom
[JENKINS] Archiving /home/wso2/jenwoker2/workspace/product-es/modules/components/store-admin/target/org.wso2.store.admin.styles-2.0.0-SNAPSHOT.jar to org.wso2.es/org.wso2.store.admin.styles/2.0.0-SNAPSHOT/org.wso2.store.admin.styles-2.0.0-SNAPSHOT.jar
[JENKINS] Archiving /home/wso2/jenwoker2/workspace/product-es/pom.xml to org.wso2.es/wso2es-parent/2.0.0-SNAPSHOT/wso2es-parent-2.0.0-SNAPSHOT.pom
[JENKINS] Archiving /home/wso2/jenwoker2/workspace/product-es/modules/integration/tests-platform/tests/pom.xml to org.wso2.es/org.wso2.store.platform.tests/2.0.0-SNAPSHOT/org.wso2.store.platform.tests-2.0.0-SNAPSHOT.pom
[JENKINS] Archiving /home/wso2/jenwoker2/workspace/product-es/modules/integration/pom.xml to org.wso2.es/wso2es-integration/2.0.0-SNAPSHOT/wso2es-integration-2.0.0-SNAPSHOT.pom
[JENKINS] Archiving /home/wso2/jenwoker2/workspace/product-es/modules/integration/tests-integration/pom.xml to org.wso2.es/es-integration-tests/2.0.0-SNAPSHOT/es-integration-tests-2.0.0-SNAPSHOT.pom
[JENKINS] Archiving /home/wso2/jenwoker2/workspace/product-es/modules/p2-profile-gen/pom.xml to org.wso2.es/wso2es-profile-gen/2.0.0-SNAPSHOT/wso2es-profile-gen-2.0.0-SNAPSHOT.pom
[JENKINS] Archiving /home/wso2/jenwoker2/workspace/product-es/modules/features/org.wso2.store.styles.feature/target/org.wso2.store.styles.feature-2.0.0-SNAPSHOT.zip to org.wso2.es/org.wso2.store.styles.feature/2.0.0-SNAPSHOT/org.wso2.store.styles.feature-2.0.0-SNAPSHOT.pom
[JENKINS] Archiving /home/wso2/jenwoker2/workspace/product-es/modules/features/org.wso2.store.styles.feature/target/org.wso2.store.styles.feature-2.0.0-SNAPSHOT.zip to org.wso2.es/org.wso2.store.styles.feature/2.0.0-SNAPSHOT/org.wso2.store.styles.feature-2.0.0-SNAPSHOT.zip
[JENKINS] Archiving /home/wso2/jenwoker2/workspace/product-es/modules/integration/tests-ui-integration/ui-test-utils/pom.xml to org.wso2.es/ui-test-utils/2.0.0-SNAPSHOT/ui-test-utils-2.0.0-SNAPSHOT.pom
[JENKINS] Archiving /home/wso2/jenwoker2/workspace/product-es/modules/features/pom.xml to org.wso2.es/wso2es-features/2.0.0-SNAPSHOT/wso2es-features-2.0.0-SNAPSHOT.pom
[JENKINS] Archiving /home/wso2/jenwoker2/workspace/product-es/modules/integration/tests-common/admin-clients/pom.xml to org.wso2.es/org.wso2.es.integration.common.clients/2.0.0-SNAPSHOT/org.wso2.es.integration.common.clients-2.0.0-SNAPSHOT.pom
[JENKINS] Archiving /home/wso2/jenwoker2/workspace/product-es/modules/integration/tests-common/admin-clients/target/org.wso2.es.integration.common.clients-2.0.0-SNAPSHOT.jar to org.wso2.es/org.wso2.es.integration.common.clients/2.0.0-SNAPSHOT/org.wso2.es.integration.common.clients-2.0.0-SNAPSHOT.jar
[JENKINS] Archiving /home/wso2/jenwoker2/workspace/product-es/modules/distribution/pom.xml to org.wso2.es/wso2es/2.0.0-SNAPSHOT/wso2es-2.0.0-SNAPSHOT.pom
[JENKINS] Archiving /home/wso2/jenwoker2/workspace/product-es/modules/distribution/target/wso2es-2.0.0-SNAPSHOT.zip to org.wso2.es/wso2es/2.0.0-SNAPSHOT/wso2es-2.0.0-SNAPSHOT.zip
[JENKINS] Archiving /home/wso2/jenwoker2/workspace/product-es/modules/integration/tests-common/ui-pages/pom.xml to org.wso2.es/ui-pages/2.0.0-SNAPSHOT/ui-pages-2.0.0-SNAPSHOT.pom
[JENKINS] Archiving /home/wso2/jenwoker2/workspace/product-es/modules/integration/tests-common/ui-pages/target/ui-pages-2.0.0-SNAPSHOT.jar to org.wso2.es/ui-pages/2.0.0-SNAPSHOT/ui-pages-2.0.0-SNAPSHOT.jar
[JENKINS] Archiving /home/wso2/jenwoker2/workspace/product-es/modules/integration/tests-common/integration-test-utils/pom.xml to org.wso2.es/org.wso2.es.integration.common.utils/2.0.0-SNAPSHOT/org.wso2.es.integration.common.utils-2.0.0-SNAPSHOT.pom
[JENKINS] Archiving /home/wso2/jenwoker2/workspace/product-es/modules/integration/tests-common/integration-test-utils/target/org.wso2.es.integration.common.utils-2.0.0-SNAPSHOT.jar to org.wso2.es/org.wso2.es.integration.common.utils/2.0.0-SNAPSHOT/org.wso2.es.integration.common.utils-2.0.0-SNAPSHOT.jar
[JENKINS] Archiving /home/wso2/jenwoker2/workspace/product-es/modules/integration/tests-common/pom.xml to org.wso2.es/es-integration-tests-common/2.0.0-SNAPSHOT/es-integration-tests-common-2.0.0-SNAPSHOT.pom
[JENKINS] Archiving /home/wso2/jenwoker2/workspace/product-es/modules/integration/tests-platform/pom.xml to org.wso2.es/es-platform-tests/2.0.0-SNAPSHOT/es-platform-tests-2.0.0-SNAPSHOT.pom
Sending e-mails to: [email protected] [email protected] [email protected] [email protected] [email protected] [email protected] [email protected] [email protected] [email protected] [email protected] [email protected] [email protected]
channel stopped
executing script 'Script - Kill Carbon Servers'
[product-es] $ /bin/bash /tmp/build_step_template5674300936812611795.sh
Killing all carbon servers......
kill: invalid option -- '9'

Usage:
 kill [options] <pid> [...]

Options:
 <pid> [...]            send signal to every <pid> listed
 -<signal>, -s, --signal <signal>
                        specify the <signal> to be sent
 -l, --list=[<signal>]  list all signal names, or convert one to a name
 -L, --table            list all signal names in a nice table

 -h, --help     display this help and exit
 -V, --version  output version information and exit

For more details see kill(1).
Sending e-mails to: [email protected] [email protected] [email protected] [email protected] [email protected] [email protected] [email protected] [email protected] [email protected] [email protected] [email protected] [email protected]
Finished: FAILURE