FailedConsole Output

Skipping 62 KB.. Full Log
 (default-test) @ ui-pages ---
[INFO] Surefire report directory: /build/jenworker/workspace/product-es/modules/integration/tests-common/ui-pages/target/surefire-reports

-------------------------------------------------------
 T E S T S
-------------------------------------------------------

Results :

Tests run: 0, Failures: 0, Errors: 0, Skipped: 0

[JENKINS] Recording test results
[INFO] 
[INFO] --- maven-jar-plugin:2.5:jar (default-jar) @ ui-pages ---
[INFO] Building jar: /build/jenworker/workspace/product-es/modules/integration/tests-common/ui-pages/target/ui-pages-2.0.0-SNAPSHOT.jar
[INFO] 
[INFO] --- maven-install-plugin:2.5.2:install (default-install) @ ui-pages ---
[INFO] Installing /build/jenworker/workspace/product-es/modules/integration/tests-common/ui-pages/target/ui-pages-2.0.0-SNAPSHOT.jar to /build/jenworker/workspace/product-es/.repository/org/wso2/es/ui-pages/2.0.0-SNAPSHOT/ui-pages-2.0.0-SNAPSHOT.jar
[INFO] Installing /build/jenworker/workspace/product-es/modules/integration/tests-common/ui-pages/pom.xml to /build/jenworker/workspace/product-es/.repository/org/wso2/es/ui-pages/2.0.0-SNAPSHOT/ui-pages-2.0.0-SNAPSHOT.pom
[INFO]                                                                         
[INFO] ------------------------------------------------------------------------
[INFO] Building integration-test-utils 2.0.0-SNAPSHOT
[INFO] ------------------------------------------------------------------------
[INFO] 
[INFO] --- maven-clean-plugin:2.6.1:clean (default-clean) @ org.wso2.es.integration.common.utils ---
[INFO] Deleting /build/jenworker/workspace/product-es/modules/integration/tests-common/integration-test-utils/target
[INFO] 
[INFO] --- maven-remote-resources-plugin:1.5:process (default) @ org.wso2.es.integration.common.utils ---
Downloading: http://maven.wso2.org/nexus/content/groups/wso2-public/com/saucelabs/selenium/selenium-client-factory/2.6/selenium-client-factory-2.6.pom
Downloading: http://maven.wso2.org/nexus/content/repositories/releases/com/saucelabs/selenium/selenium-client-factory/2.6/selenium-client-factory-2.6.pom
Downloading: http://repo.maven.apache.org/maven2/com/saucelabs/selenium/selenium-client-factory/2.6/selenium-client-factory-2.6.pom
Downloading: http://maven.wso2.org/nexus/content/groups/wso2-public/com/saucelabs/selenium/sauce-ondemand-driver/2.6/sauce-ondemand-driver-2.6.pom
Downloading: http://maven.wso2.org/nexus/content/repositories/releases/com/saucelabs/selenium/sauce-ondemand-driver/2.6/sauce-ondemand-driver-2.6.pom
Downloading: http://repo.maven.apache.org/maven2/com/saucelabs/selenium/sauce-ondemand-driver/2.6/sauce-ondemand-driver-2.6.pom
[INFO] 
[INFO] --- maven-resources-plugin:2.5:resources (default-resources) @ org.wso2.es.integration.common.utils ---
[debug] execute contextualize
[INFO] Using 'UTF-8' encoding to copy filtered resources.
[INFO] skip non existing resourceDirectory /build/jenworker/workspace/product-es/modules/integration/tests-common/integration-test-utils/src/main/resources
[INFO] Copying 3 resources
[INFO] 
[INFO] --- maven-compiler-plugin:3.1:compile (default-compile) @ org.wso2.es.integration.common.utils ---
[INFO] Changes detected - recompiling the module!
[INFO] Compiling 13 source files to /build/jenworker/workspace/product-es/modules/integration/tests-common/integration-test-utils/target/classes
[INFO] 
[INFO] --- maven-resources-plugin:2.5:testResources (default-testResources) @ org.wso2.es.integration.common.utils ---
[debug] execute contextualize
[INFO] Using 'UTF-8' encoding to copy filtered resources.
[INFO] skip non existing resourceDirectory /build/jenworker/workspace/product-es/modules/integration/tests-common/integration-test-utils/src/test/resources
[INFO] Copying 3 resources
[INFO] 
[INFO] --- maven-compiler-plugin:3.1:testCompile (default-testCompile) @ org.wso2.es.integration.common.utils ---
[INFO] No sources to compile
[INFO] 
[INFO] --- maven-surefire-plugin:2.12:test (default-test) @ org.wso2.es.integration.common.utils ---
[INFO] Surefire report directory: /build/jenworker/workspace/product-es/modules/integration/tests-common/integration-test-utils/target/surefire-reports

-------------------------------------------------------
 T E S T S
-------------------------------------------------------

Results :

Tests run: 0, Failures: 0, Errors: 0, Skipped: 0

[JENKINS] Recording test results
[INFO] 
[INFO] --- maven-jar-plugin:2.5:jar (default-jar) @ org.wso2.es.integration.common.utils ---
[INFO] Building jar: /build/jenworker/workspace/product-es/modules/integration/tests-common/integration-test-utils/target/org.wso2.es.integration.common.utils-2.0.0-SNAPSHOT.jar
[INFO] 
[INFO] --- maven-install-plugin:2.5.2:install (default-install) @ org.wso2.es.integration.common.utils ---
[INFO] Installing /build/jenworker/workspace/product-es/modules/integration/tests-common/integration-test-utils/target/org.wso2.es.integration.common.utils-2.0.0-SNAPSHOT.jar to /build/jenworker/workspace/product-es/.repository/org/wso2/es/org.wso2.es.integration.common.utils/2.0.0-SNAPSHOT/org.wso2.es.integration.common.utils-2.0.0-SNAPSHOT.jar
[INFO] Installing /build/jenworker/workspace/product-es/modules/integration/tests-common/integration-test-utils/pom.xml to /build/jenworker/workspace/product-es/.repository/org/wso2/es/org.wso2.es.integration.common.utils/2.0.0-SNAPSHOT/org.wso2.es.integration.common.utils-2.0.0-SNAPSHOT.pom
[INFO]                                                                         
[INFO] ------------------------------------------------------------------------
[INFO] Building WSO2 ES Integration Test 2.0.0-SNAPSHOT
[INFO] ------------------------------------------------------------------------
[INFO] 
[INFO] --- maven-clean-plugin:2.6.1:clean (default-clean) @ es-integration-tests ---
[INFO] Deleting /build/jenworker/workspace/product-es/modules/integration/tests-integration/target
[INFO] 
[INFO] --- maven-remote-resources-plugin:1.5:process (default) @ es-integration-tests ---
[INFO] 
[INFO] --- maven-install-plugin:2.5.2:install (default-install) @ es-integration-tests ---
[INFO] Installing /build/jenworker/workspace/product-es/modules/integration/tests-integration/pom.xml to /build/jenworker/workspace/product-es/.repository/org/wso2/es/es-integration-tests/2.0.0-SNAPSHOT/es-integration-tests-2.0.0-SNAPSHOT.pom
[INFO]                                                                         
[INFO] ------------------------------------------------------------------------
[INFO] Building org.wso2.es.integration.test 2.0.0-SNAPSHOT
[INFO] ------------------------------------------------------------------------
[INFO] 
[INFO] --- maven-clean-plugin:2.6.1:clean (default-clean) @ org.wso2.es.integration.test ---
[INFO] Deleting /build/jenworker/workspace/product-es/modules/integration/tests-integration/tests/target
[INFO] Deleting /build/jenworker/workspace/product-es/modules/integration/tests-integration/tests/src/test/resources/client/modules (includes = [**/*.mar], excludes = [])
[INFO] 
[INFO] --- maven-remote-resources-plugin:1.5:process (default) @ org.wso2.es.integration.test ---
[INFO] 
[INFO] --- maven-resources-plugin:2.5:resources (default-resources) @ org.wso2.es.integration.test ---
[debug] execute contextualize
[INFO] Using 'UTF-8' encoding to copy filtered resources.
[INFO] skip non existing resourceDirectory /build/jenworker/workspace/product-es/modules/integration/tests-integration/tests/src/main/resources
[INFO] Copying 3 resources
[INFO] 
[INFO] --- maven-compiler-plugin:3.1:compile (default-compile) @ org.wso2.es.integration.test ---
[INFO] No sources to compile
[INFO] 
[INFO] --- maven-dependency-plugin:2.8:copy-dependencies (copy-emma-dependencies) @ org.wso2.es.integration.test ---
[INFO] Copying emma-2.1.5320.jar to /build/jenworker/workspace/product-es/modules/integration/tests-integration/tests/target/emma/emma-2.1.5320.jar
[INFO] 
[INFO] --- maven-dependency-plugin:2.8:copy-dependencies (copy-jar-dependencies) @ org.wso2.es.integration.test ---
[INFO] 
[INFO] --- maven-dependency-plugin:2.8:copy-dependencies (copy-secVerifier) @ org.wso2.es.integration.test ---
[INFO] 
[INFO] --- maven-dependency-plugin:2.8:unpack (unpack-mar-jks) @ org.wso2.es.integration.test ---
[INFO] Configured Artifact: org.wso2.es:wso2es:2.0.0-SNAPSHOT:zip
[INFO] Unpacking /build/jenworker/workspace/product-es/modules/distribution/target/wso2es-2.0.0-SNAPSHOT.zip to /build/jenworker/workspace/product-es/modules/integration/tests-integration/tests/target/tobeCopied with includes "**/*.jks,**/*.mar" and excludes ""
[INFO] 
[INFO] --- maven-resources-plugin:2.5:copy-resources (copy-resources-jks) @ org.wso2.es.integration.test ---
[debug] execute contextualize
[INFO] Using 'UTF-8' encoding to copy filtered resources.
[INFO] Copying 2 resources
[INFO] 
[INFO] --- maven-resources-plugin:2.5:copy-resources (copy-resources-mar) @ org.wso2.es.integration.test ---
[debug] execute contextualize
[INFO] Using 'UTF-8' encoding to copy filtered resources.
[INFO] Copying 1 resource
[INFO] 
[INFO] --- maven-resources-plugin:2.5:testResources (default-testResources) @ org.wso2.es.integration.test ---
[debug] execute contextualize
[INFO] Using 'UTF-8' encoding to copy filtered resources.
[INFO] Copying 28 resources
[INFO] Copying 3 resources
[INFO] 
[INFO] --- maven-compiler-plugin:3.1:testCompile (default-testCompile) @ org.wso2.es.integration.test ---
[INFO] Changes detected - recompiling the module!
[INFO] Compiling 2 source files to /build/jenworker/workspace/product-es/modules/integration/tests-integration/tests/target/test-classes
[INFO] 
[INFO] --- maven-surefire-plugin:2.12:test (default-test) @ org.wso2.es.integration.test ---
[INFO] Surefire report directory: /build/jenworker/workspace/product-es/modules/integration/tests-integration/tests/target/surefire-reports

-------------------------------------------------------
 T E S T S
-------------------------------------------------------
Running TestSuite
INFO  [org.wso2.es.integration.common.utils.ESServerExtensionForWait] - Initializing Testing Enterprise Store Jaggery-APPs
INFO  [org.wso2.carbon.integration.common.extensions.carbonserver.CarbonServerManager] - Extracting carbon zip file.. 
INFO  [org.wso2.carbon.integration.common.extensions.carbonserver.TestServerManager] - Carbon Home - /build/jenworker/workspace/product-es/modules/integration/tests-integration/tests/target/carbontmp1427543796717/wso2es-2.0.0-SNAPSHOT
INFO  [org.wso2.carbon.integration.common.extensions.carbonserver.CarbonServerManager] - Starting server............. 
INFO  [org.wso2.carbon.integration.common.extensions.utils.ServerLogReader] - JAVA_HOME environment variable is set to /build/software/java/jdk1.6.0_33
INFO  [org.wso2.carbon.integration.common.extensions.utils.ServerLogReader] - CARBON_HOME environment variable is set to /build/jenworker/workspace/product-es/modules/integration/tests-integration/tests/target/carbontmp1427543796717/wso2es-2.0.0-SNAPSHOT
INFO  [org.wso2.carbon.integration.common.extensions.utils.ServerLogReader] - [2015-03-28 11:56:42,327]  INFO {org.wso2.carbon.core.internal.CarbonCoreActivator} -  Starting WSO2 Carbon...
INFO  [org.wso2.carbon.integration.common.extensions.utils.ServerLogReader] - [2015-03-28 11:56:42,328]  INFO {org.wso2.carbon.core.internal.CarbonCoreActivator} -  Operating System : Linux 3.13.0-24-generic, amd64
INFO  [org.wso2.carbon.integration.common.extensions.utils.ServerLogReader] - [2015-03-28 11:56:42,328]  INFO {org.wso2.carbon.core.internal.CarbonCoreActivator} -  Java Home        : /build/software/java/jdk1.6.0_33/jre
INFO  [org.wso2.carbon.integration.common.extensions.utils.ServerLogReader] - [2015-03-28 11:56:42,328]  INFO {org.wso2.carbon.core.internal.CarbonCoreActivator} -  Java Version     : 1.6.0_33
INFO  [org.wso2.carbon.integration.common.extensions.utils.ServerLogReader] - [2015-03-28 11:56:42,328]  INFO {org.wso2.carbon.core.internal.CarbonCoreActivator} -  Java VM          : Java HotSpot(TM) 64-Bit Server VM 20.8-b03,Sun Microsystems Inc.
INFO  [org.wso2.carbon.integration.common.extensions.utils.ServerLogReader] - [2015-03-28 11:56:42,329]  INFO {org.wso2.carbon.core.internal.CarbonCoreActivator} -  Carbon Home      : /build/jenworker/workspace/product-es/modules/integration/tests-integration/tests/target/carbontmp1427543796717/wso2es-2.0.0-SNAPSHOT
INFO  [org.wso2.carbon.integration.common.extensions.utils.ServerLogReader] - [2015-03-28 11:56:42,329]  INFO {org.wso2.carbon.core.internal.CarbonCoreActivator} -  Java Temp Dir    : /build/jenworker/workspace/product-es/modules/integration/tests-integration/tests/target/carbontmp1427543796717/wso2es-2.0.0-SNAPSHOT/tmp
INFO  [org.wso2.carbon.integration.common.extensions.utils.ServerLogReader] - [2015-03-28 11:56:42,329]  INFO {org.wso2.carbon.core.internal.CarbonCoreActivator} -  User             : wso2, en-US, Etc/UTC
INFO  [org.wso2.carbon.integration.common.extensions.utils.ServerLogReader] - [2015-03-28 11:56:42,426]  WARN {org.wso2.carbon.core.bootup.validator.util.ValidationResultPrinter} -  Carbon is configured to use the default keystore (wso2carbon.jks). To maximize security when deploying to a production environment, configure a new keystore with a unique password in the production server profile.
INFO  [org.wso2.carbon.integration.common.extensions.utils.ServerLogReader] - [2015-03-28 11:56:42,426]  WARN {org.wso2.carbon.core.bootup.validator.util.ValidationResultPrinter} -  Swap Memory size (MB): 0 of the system is below the recommended minimum size :2047
INFO  [org.wso2.carbon.integration.common.extensions.utils.ServerLogReader] - [2015-03-28 11:56:42,433]  INFO {org.wso2.carbon.databridge.agent.thrift.AgentHolder} -  Agent created !
INFO  [org.wso2.carbon.integration.common.extensions.utils.ServerLogReader] - [2015-03-28 11:56:42,454]  INFO {org.wso2.carbon.databridge.agent.thrift.internal.AgentDS} -  Successfully deployed Agent Client
INFO  [org.wso2.carbon.integration.common.extensions.utils.ServerLogReader] - [2015-03-28 11:56:42,857]  INFO {org.wso2.jaggery.scxml.Activator} -  Activating org.wso2.jaggery.scxml with RealmService enabled
INFO  [org.wso2.carbon.integration.common.extensions.utils.ServerLogReader] - [2015-03-28 11:56:44,064]  INFO {org.wso2.carbon.registry.core.jdbc.EmbeddedRegistryService} -  Configured Registry in 109ms
INFO  [org.wso2.carbon.integration.common.extensions.utils.ServerLogReader] - [2015-03-28 11:56:44,398]  INFO {org.wso2.carbon.registry.core.internal.RegistryCoreServiceComponent} -  Registry Mode    : READ-WRITE
INFO  [org.wso2.carbon.integration.common.extensions.utils.ServerLogReader] - [2015-03-28 11:56:45,958]  INFO {org.wso2.carbon.social.sql.SocialDBInitilizer} -  DB structure not found executing
INFO  [org.wso2.carbon.integration.common.extensions.utils.ServerLogReader] - [2015-03-28 11:56:45,959]  INFO {org.wso2.carbon.social.sql.SocialDBInitilizer} -  Executing DB script for :h2
INFO  [org.wso2.carbon.integration.common.extensions.utils.ServerLogReader] - [2015-03-28 11:56:45,970]  INFO {org.wso2.carbon.social.sql.SocialDBInitilizer} -  SOCIAL DB tables created successfully.
INFO  [org.wso2.carbon.integration.common.extensions.utils.ServerLogReader] - [2015-03-28 11:56:46,082]  INFO {org.wso2.carbon.user.core.internal.UserStoreMgtDSComponent} -  Carbon UserStoreMgtDSComponent activated successfully.
INFO  [org.wso2.carbon.integration.common.extensions.utils.ServerLogReader] - [2015-03-28 11:56:51,163]  INFO {org.apache.catalina.startup.TaglibUriRule} -  TLD skipped. URI: http://tiles.apache.org/tags-tiles is already defined
INFO  [org.wso2.carbon.integration.common.extensions.utils.ServerLogReader] - [2015-03-28 11:56:51,193]  INFO {org.apache.tomcat.websocket.server.WsSci} -  JSR 356 WebSocket (Java WebSocket 1.0) support is not available when running on Java 6. To suppress this message, run Tomcat on Java 7, remove the WebSocket JARs from $CATALINA_HOME/lib or add the WebSocketJARs to the tomcat.util.scan.DefaultJarScanner.jarsToSkip property in $CATALINA_BASE/conf/catalina.properties. Note that the deprecated Tomcat 7 WebSocket API will be available. 
INFO  [org.wso2.carbon.integration.common.extensions.utils.ServerLogReader] - [2015-03-28 11:56:51,682]  INFO {org.wso2.carbon.identity.user.store.configuration.deployer.UserStoreConfigurationDeployer} -  User Store Configuration Deployer initiated.
INFO  [org.wso2.carbon.integration.common.extensions.utils.ServerLogReader] - [2015-03-28 11:56:52,293]  INFO {org.wso2.carbon.core.deployment.DeploymentInterceptor} -  Deploying Axis2 service: AccountCredentialMgtConfigService {super-tenant}
INFO  [org.wso2.carbon.integration.common.extensions.utils.ServerLogReader] - [2015-03-28 11:56:52,293]  INFO {org.wso2.carbon.core.deployment.DeploymentInterceptor} -  Deploying Axis2 service: UserInformationRecoveryService {super-tenant}
INFO  [org.wso2.carbon.integration.common.extensions.utils.ServerLogReader] - [2015-03-28 11:56:52,293]  INFO {org.wso2.carbon.core.deployment.DeploymentInterceptor} -  Deploying Axis2 service: UserIdentityManagementAdminService {super-tenant}
INFO  [org.wso2.carbon.integration.common.extensions.utils.ServerLogReader] - [2015-03-28 11:56:52,974]  INFO {org.wso2.carbon.core.init.CarbonServerManager} -  Repository       : /build/jenworker/workspace/product-es/modules/integration/tests-integration/tests/target/carbontmp1427543796717/wso2es-2.0.0-SNAPSHOT/repository/deployment/server/
INFO  [org.wso2.carbon.integration.common.extensions.utils.ServerLogReader] - [2015-03-28 11:56:53,055]  INFO {org.wso2.carbon.core.internal.permission.update.PermissionUpdater} -  Permission cache updated for tenant -1234
INFO  [org.wso2.carbon.integration.common.extensions.utils.ServerLogReader] - [2015-03-28 11:56:53,147]  INFO {org.wso2.carbon.identity.application.mgt.internal.ApplicationManagementServiceComponent} -  Identity ApplicationManagementComponent bundle is activated
INFO  [org.wso2.carbon.integration.common.extensions.utils.ServerLogReader] - [2015-03-28 11:56:53,153]  INFO {org.wso2.carbon.identity.application.mgt.ui.internal.ApplicationMgtUIServiceComponent} -  Application Management UI bundle acticated!
INFO  [org.wso2.carbon.integration.common.extensions.utils.ServerLogReader] - [2015-03-28 11:56:53,178]  INFO {org.wso2.carbon.identity.sso.saml.admin.FileBasedConfigManager} -  A SSO Service Provider is registered for : store
INFO  [org.wso2.carbon.integration.common.extensions.utils.ServerLogReader] - [2015-03-28 11:56:53,179]  INFO {org.wso2.carbon.identity.sso.saml.admin.FileBasedConfigManager} -  A SSO Service Provider is registered for : social
INFO  [org.wso2.carbon.integration.common.extensions.utils.ServerLogReader] - [2015-03-28 11:56:53,179]  INFO {org.wso2.carbon.identity.sso.saml.admin.FileBasedConfigManager} -  A SSO Service Provider is registered for : publisher
INFO  [org.wso2.carbon.integration.common.extensions.utils.ServerLogReader] - [2015-03-28 11:56:53,193]  INFO {org.wso2.carbon.idp.mgt.internal.IdPManagementServiceComponent} -  Identity Application Management Database initialization not attempted since 'setup' variable was not provided during startup
INFO  [org.wso2.carbon.integration.common.extensions.utils.ServerLogReader] - [2015-03-28 11:56:53,230]  INFO {org.wso2.carbon.identity.core.internal.IdentityCoreServiceComponent} -  Identity Database schema initialization check was skipped since 'setup' variable was not given during startup
INFO  [org.wso2.carbon.integration.common.extensions.utils.ServerLogReader] - [2015-03-28 11:56:53,322]  INFO {org.wso2.carbon.core.transports.http.HttpsTransportListener} -  HTTPS port       : 9443
INFO  [org.wso2.carbon.integration.common.extensions.utils.ServerLogReader] - [2015-03-28 11:56:53,322]  INFO {org.wso2.carbon.core.transports.http.HttpTransportListener} -  HTTP port        : 9763
INFO  [org.wso2.carbon.integration.common.extensions.utils.ServerLogReader] - [2015-03-28 11:56:53,413]  INFO {org.wso2.carbon.core.deployment.DeploymentInterceptor} -  Deploying Axis2 service: echo {super-tenant}
INFO  [org.wso2.carbon.integration.common.extensions.utils.ServerLogReader] - [2015-03-28 11:56:53,476]  INFO {org.wso2.carbon.core.deployment.DeploymentInterceptor} -  Deploying Axis2 service: Version {super-tenant}
INFO  [org.wso2.carbon.integration.common.extensions.utils.ServerLogReader] - [2015-03-28 11:56:56,148]  INFO {net.sf.ehcache.pool.impl.DefaultSizeOfEngine} -  Using user supplied filter @ jar:file:/build/jenworker/workspace/product-es/modules/integration/tests-integration/tests/target/carbontmp1427543796717/wso2es-2.0.0-SNAPSHOT/repository/deployment/server/webapps/SHINDIG/WEB-INF/lib/shindig-common-2.5.0-beta5.jar!/org/apache/shindig/common/cache/ehcache/SizeOfFilter.txt
INFO  [org.wso2.carbon.integration.common.extensions.utils.ServerLogReader] - [2015-03-28 11:56:56,160]  INFO {net.sf.ehcache.pool.sizeof.JvmInformation} -  Detected JVM data model settings of: 64-Bit HotSpot JVM with Compressed OOPs
INFO  [org.wso2.carbon.integration.common.extensions.utils.ServerLogReader] - [2015-03-28 11:56:56,392]  INFO {net.sf.ehcache.pool.sizeof.AgentLoader} -  Extracted agent jar to temporary file /build/jenworker/workspace/product-es/modules/integration/tests-integration/tests/target/carbontmp1427543796717/wso2es-2.0.0-SNAPSHOT/tmp/ehcache-sizeof-agent1268892762918848419.jar
INFO  [org.wso2.carbon.integration.common.extensions.utils.ServerLogReader] - [2015-03-28 11:56:56,392]  INFO {net.sf.ehcache.pool.sizeof.AgentLoader} -  Trying to load agent @ /build/jenworker/workspace/product-es/modules/integration/tests-integration/tests/target/carbontmp1427543796717/wso2es-2.0.0-SNAPSHOT/tmp/ehcache-sizeof-agent1268892762918848419.jar
INFO  [org.wso2.carbon.integration.common.extensions.utils.ServerLogReader] - [2015-03-28 11:56:56,396]  INFO {net.sf.ehcache.pool.impl.DefaultSizeOfEngine} -  using Agent sizeof engine
INFO  [org.wso2.carbon.integration.common.extensions.utils.ServerLogReader] - [2015-03-28 11:56:56,470]  INFO {net.sf.ehcache.pool.impl.DefaultSizeOfEngine} -  using Agent sizeof engine
INFO  [org.wso2.carbon.integration.common.extensions.utils.ServerLogReader] - [2015-03-28 11:56:56,493]  INFO {org.apache.shindig.gadgets.features.FeatureRegistry} -  Resources from res:features/features.txt are loading.
INFO  [org.wso2.carbon.integration.common.extensions.utils.ServerLogReader] - [2015-03-28 11:56:56,500]  INFO {org.apache.shindig.common.xml.XmlUtil} -  The XML processor being used does not support secure parsing.
INFO  [org.wso2.carbon.integration.common.extensions.utils.ServerLogReader] - [2015-03-28 11:56:56,501]  INFO {org.apache.shindig.common.xml.XmlUtil} -  Document builders are being reused.
INFO  [org.wso2.carbon.integration.common.extensions.utils.ServerLogReader] - [2015-03-28 11:56:56,673]  INFO {org.apache.shindig.gadgets.features.FeatureRegistry} -  Resources from res:features-extras/features.txt are loading.
INFO  [org.wso2.carbon.integration.common.extensions.utils.ServerLogReader] - [2015-03-28 11:56:56,959]  INFO {org.apache.shindig.config.JsonContainerConfigLoader} -  Resources from containers/default/container.js are loading.
INFO  [org.wso2.carbon.integration.common.extensions.utils.ServerLogReader] - [2015-03-28 11:56:56,959]  INFO {org.apache.shindig.config.JsonContainerConfigLoader} -  Container configuration containers/default/container.js is being read.
INFO  [org.wso2.carbon.integration.common.extensions.utils.ServerLogReader] - [2015-03-28 11:56:57,032]  WARN {org.apache.shindig.auth.BasicSecurityTokenCodec} -  Token TTL for container "default" was 0 and will be ignored.
INFO  [org.wso2.carbon.integration.common.extensions.utils.ServerLogReader] - [2015-03-28 11:56:57,033]  WARN {org.apache.shindig.auth.BasicSecurityTokenCodec} -  Token TTL for container "accel" was 0 and will be ignored.
INFO  [org.wso2.carbon.integration.common.extensions.utils.ServerLogReader] - [2015-03-28 11:56:57,217]  INFO {org.apache.shindig.gadgets.oauth2.logger.FilteredLogger} -  Using random key for OAuth2 client-side state encryption
INFO  [org.wso2.carbon.integration.common.extensions.utils.ServerLogReader] - [2015-03-28 11:56:57,218]  INFO {org.apache.shindig.gadgets.oauth2.logger.FilteredLogger} -  OAuth2CrypterProvider constructor
INFO  [org.wso2.carbon.integration.common.extensions.utils.ServerLogReader] - [2015-03-28 11:56:57,226]  INFO {org.apache.shindig.gadgets.oauth.OAuthModule$OAuthCrypterProvider} -  Using random key for OAuth client-side state encryption
INFO  [org.wso2.carbon.integration.common.extensions.utils.ServerLogReader] - [2015-03-28 11:56:57,226]  INFO {org.apache.shindig.gadgets.oauth.OAuthModule} -  A random key for OAuth client-side state encryption is being used.
INFO  [org.wso2.carbon.integration.common.extensions.utils.ServerLogReader] - [2015-03-28 11:56:57,227]  WARN {org.apache.shindig.gadgets.oauth.OAuthModule} -  The OAuth signing key did not load correctly. To create a key: 
INFO  [org.wso2.carbon.integration.common.extensions.utils.ServerLogReader] -  1. Run the following command: 
INFO  [org.wso2.carbon.integration.common.extensions.utils.ServerLogReader] -  openssl req -newkey rsa:1024 -days 365 -nodes -x509 -keyout testkey.pem \
INFO  [org.wso2.carbon.integration.common.extensions.utils.ServerLogReader] -  -out testkey.pem -subj /CN=mytestkey
INFO  [org.wso2.carbon.integration.common.extensions.utils.ServerLogReader] -  openssl pkcs8 -in testkey.pem -out oauthkey.pem -topk8 -nocrypt -outform PEM
INFO  [org.wso2.carbon.integration.common.extensions.utils.ServerLogReader] - 
INFO  [org.wso2.carbon.integration.common.extensions.utils.ServerLogReader] - . 2. Edit the shindig.properties file by adding these lines: 
INFO  [org.wso2.carbon.integration.common.extensions.utils.ServerLogReader] - shindig.signing.key-file =<path-to-oauthkey.pem>
INFO  [org.wso2.carbon.integration.common.extensions.utils.ServerLogReader] -  shindig.signing.key-name =mykey
INFO  [org.wso2.carbon.integration.common.extensions.utils.ServerLogReader] - .
INFO  [org.wso2.carbon.integration.common.extensions.utils.ServerLogReader] - [2015-03-28 11:56:57,356]  INFO {org.wso2.carbon.webapp.mgt.TomcatGenericWebappsDeployer} -  Deployed webapp: StandardEngine[Catalina].StandardHost[localhost].StandardContext[/SHINDIG].File[/build/jenworker/workspace/product-es/modules/integration/tests-integration/tests/target/carbontmp1427543796717/wso2es-2.0.0-SNAPSHOT/repository/deployment/server/webapps/SHINDIG]
INFO  [org.wso2.carbon.integration.common.extensions.utils.ServerLogReader] - [2015-03-28 11:57:01,672]  INFO {app-core} -  Disabled assets: ["ebook", "api", "wsdl", "service", "policy", "proxy", "schema", "sequence", "servicex", "uri", "wadl", "endpoint"]
INFO  [org.wso2.carbon.integration.common.extensions.utils.ServerLogReader] - [2015-03-28 11:57:02,188]  INFO {org.wso2.carbon.registry.core.jdbc.EmbeddedRegistryService} -  Configured Registry in 0ms
INFO  [org.wso2.carbon.integration.common.extensions.utils.ServerLogReader] - [2015-03-28 11:57:06,683]  INFO {org.jaggeryjs.jaggery.app.mgt.TomcatJaggeryWebappsDeployer} -  Deployed webapp: StandardEngine[Catalina].StandardHost[localhost].StandardContext[/publisher].File[/build/jenworker/workspace/product-es/modules/integration/tests-integration/tests/target/carbontmp1427543796717/wso2es-2.0.0-SNAPSHOT/repository/deployment/server/jaggeryapps/publisher]
INFO  [org.wso2.carbon.integration.common.extensions.utils.ServerLogReader] - [2015-03-28 11:57:06,851]  INFO {org.jaggeryjs.jaggery.app.mgt.TomcatJaggeryWebappsDeployer} -  Deployed webapp: StandardEngine[Catalina].StandardHost[localhost].StandardContext[/social].File[/build/jenworker/workspace/product-es/modules/integration/tests-integration/tests/target/carbontmp1427543796717/wso2es-2.0.0-SNAPSHOT/repository/deployment/server/jaggeryapps/social]
INFO  [org.wso2.carbon.integration.common.extensions.utils.ServerLogReader] - [2015-03-28 11:57:07,121]  INFO {org.jaggeryjs.jaggery.app.mgt.TomcatJaggeryWebappsDeployer} -  Deployed webapp: StandardEngine[Catalina].StandardHost[localhost].StandardContext[/sso].File[/build/jenworker/workspace/product-es/modules/integration/tests-integration/tests/target/carbontmp1427543796717/wso2es-2.0.0-SNAPSHOT/repository/deployment/server/jaggeryapps/sso]
INFO  [org.wso2.carbon.integration.common.extensions.utils.ServerLogReader] - [2015-03-28 11:57:07,635]  INFO {app-core} -  Disabled assets: ["ebook", "api", "wsdl", "service", "policy", "proxy", "schema", "sequence", "servicex", "uri", "wadl", "endpoint"]
INFO  [org.wso2.carbon.integration.common.extensions.utils.ServerLogReader] - [2015-03-28 11:57:07,713]  INFO {org.jaggeryjs.jaggery.app.mgt.TomcatJaggeryWebappsDeployer} -  Deployed webapp: StandardEngine[Catalina].StandardHost[localhost].StandardContext[/store].File[/build/jenworker/workspace/product-es/modules/integration/tests-integration/tests/target/carbontmp1427543796717/wso2es-2.0.0-SNAPSHOT/repository/deployment/server/jaggeryapps/store]
INFO  [org.wso2.carbon.integration.common.extensions.utils.ServerLogReader] - [2015-03-28 11:57:07,736]  INFO {org.jaggeryjs.jaggery.app.mgt.TomcatJaggeryWebappsDeployer} -  Deployed webapp: StandardEngine[Catalina].StandardHost[localhost].StandardContext[/store-admin].File[/build/jenworker/workspace/product-es/modules/integration/tests-integration/tests/target/carbontmp1427543796717/wso2es-2.0.0-SNAPSHOT/repository/deployment/server/jaggeryapps/store-admin]
INFO  [org.wso2.carbon.integration.common.extensions.utils.ServerLogReader] - [2015-03-28 11:57:07,750]  INFO {org.apache.tomcat.util.net.NioSelectorPool} -  Using a shared selector for servlet write/read
INFO  [org.wso2.carbon.integration.common.extensions.utils.ServerLogReader] - [2015-03-28 11:57:08,333]  INFO {org.apache.tomcat.util.net.NioSelectorPool} -  Using a shared selector for servlet write/read
INFO  [org.wso2.carbon.integration.common.extensions.utils.ServerLogReader] - [2015-03-28 11:57:08,356]  INFO {org.wso2.carbon.registry.eventing.internal.RegistryEventingServiceComponent} -  Successfully Initialized Eventing on Registry
INFO  [org.wso2.carbon.integration.common.extensions.utils.ServerLogReader] - [2015-03-28 11:57:08,372]  INFO {org.wso2.carbon.store.notifications.management.ComponentManager} -  Store event types successfully registered
INFO  [org.wso2.carbon.integration.common.extensions.utils.ServerLogReader] - [2015-03-28 11:57:08,372]  INFO {org.wso2.carbon.store.notifications.internal.StoreNotificationsComponent} -  Store Notification service is activated
INFO  [org.wso2.carbon.integration.common.extensions.utils.ServerLogReader] - [2015-03-28 11:57:08,420]  INFO {org.wso2.carbon.core.init.JMXServerManager} -  JMX Service URL  : service:jmx:rmi://localhost:11111/jndi/rmi://localhost:9999/jmxrmi
INFO  [org.wso2.carbon.integration.common.extensions.utils.ServerLogReader] - [2015-03-28 11:57:08,420]  INFO {org.wso2.carbon.core.internal.StartupFinalizerServiceComponent} -  Server           :  WSO2 Enterprise Store-2.0.0-SNAPSHOT
INFO  [org.wso2.carbon.integration.common.extensions.utils.ServerLogReader] - [2015-03-28 11:57:08,421]  INFO {org.wso2.carbon.core.internal.StartupFinalizerServiceComponent} -  WSO2 Carbon started in 29 sec
INFO  [org.wso2.carbon.integration.common.extensions.utils.ServerLogReader] - [2015-03-28 11:57:08,631]  INFO {org.wso2.carbon.ui.internal.CarbonUIServiceComponent} -  Mgt Console URL  : https://172.19.1.133:9443/carbon/
INFO  [org.wso2.carbon.integration.common.utils.ClientConnectionUtil] - Waiting to login  user...
WARN  [org.apache.axiom.util.stax.dialect.StAXDialectDetector] - Unable to determine dialect of the StAX implementation at jar:file:/build/jenworker/workspace/product-es/.repository/org/apache/ws/commons/axiom/wso2/axiom/1.2.11.wso2v5/axiom-1.2.11.wso2v5.jar!/
INFO  [org.wso2.carbon.integration.common.extensions.utils.ServerLogReader] - [2015-03-28 11:57:09,664]  INFO {org.wso2.carbon.core.services.util.CarbonAuthenticationUtil} -  '[email protected] [-1234]' logged in at [2015-03-28 11:57:09,663+0000]
INFO  [org.wso2.carbon.integration.common.admin.client.AuthenticatorClient] - Login Successful
INFO  [org.wso2.carbon.integration.common.extensions.carbonserver.CarbonServerManager] - Server started successfully.
INFO  [org.wso2.es.integration.common.utils.ESServerExtensionForWait] - Waiting till Jaggery-Apps get initialized
INFO  [org.wso2.carbon.integration.common.extensions.utils.ServerLogReader] - [2015-03-28 11:57:09,823]  INFO {org.wso2.carbon.core.services.util.CarbonAuthenticationUtil} -  '[email protected] [-1234]' logged in at [2015-03-28 11:57:09,823+0000]
INFO  [org.wso2.carbon.integration.common.admin.client.AuthenticatorClient] - Login Successful
INFO  [org.wso2.es.integration.common.utils.AssetsRESTClient] - Indexing is not completed yet
INFO  [org.wso2.carbon.integration.common.extensions.utils.ServerLogReader] - [2015-03-28 11:57:13,683]  INFO {JAGGERY.app-scripts.init-scripts.app:js} -  Publisher URL : http://localhost:9763/publisher
INFO  [org.wso2.carbon.integration.common.extensions.utils.ServerLogReader] - [2015-03-28 11:57:14,712]  INFO {JAGGERY.app-scripts.init-scripts.app:js} -  Store URL : http://localhost:9763/store
INFO  [org.wso2.es.integration.common.utils.AssetsRESTClient] - Indexing is not completed yet
INFO  [org.wso2.es.integration.common.utils.AssetsRESTClient] - Indexing is not completed yet
INFO  [org.wso2.es.integration.common.utils.AssetsRESTClient] - Indexing is not completed yet
INFO  [org.wso2.es.integration.common.utils.AssetsRESTClient] - Indexing is not completed yet
INFO  [org.wso2.es.integration.common.utils.AssetsRESTClient] - Indexing is not completed yet
INFO  [org.wso2.es.integration.common.utils.AssetsRESTClient] - Indexing is not completed yet
INFO  [org.wso2.es.integration.common.utils.AssetsRESTClient] - Indexing is not completed yet
INFO  [org.wso2.es.integration.common.utils.AssetsRESTClient] - Completed Indexing
INFO  [org.wso2.es.integration.common.utils.ESServerExtensionForWait] - Done Waiting till Jaggery-Apps get initialized
INFO  [org.wso2.carbon.automation.engine.testlisteners.TestExecutionListener] - Inside Test Execution Listener - On Execution
INFO  [org.wso2.carbon.automation.engine.testlisteners.TestTransformerListener] - Started Test method Transform manager for testRunJaggeryTests
INFO  [org.wso2.carbon.automation.engine.testlisteners.TestTransformerListener] - Started Test method Transform manager for publisherTest
INFO  [org.wso2.carbon.automation.engine.testlisteners.TestTransformerListener] - Started Configuration Transform manager  init
INFO  [org.wso2.carbon.automation.engine.testlisteners.TestTransformerListener] - Started Configuration Transform manager  destroy
INFO  [org.wso2.carbon.automation.engine.testlisteners.TestTransformerListener] - Started Configuration Transform manager  init
INFO  [org.wso2.carbon.automation.engine.testlisteners.TestSuiteListener] - Inside Test Suite Listener - On Start
INFO  [org.wso2.carbon.integration.common.extensions.utils.ServerLogReader] - [2015-03-28 11:57:38,265]  INFO {org.wso2.carbon.core.services.util.CarbonAuthenticationUtil} -  '[email protected] [-1234]' logged in at [2015-03-28 11:57:38,265+0000]
INFO  [org.wso2.carbon.integration.common.admin.client.AuthenticatorClient] - Login Successful
INFO  [org.wso2.carbon.integration.common.tests.JaggeryServerTest] - found url: Authentication%20End%20Point%20-%20Publisher%20API%20Test%20valid%20username%3Apassword.
INFO  [org.wso2.carbon.integration.common.tests.JaggeryServerTest] - found url: Authentication%20End%20Point%20-%20Publisher%20API%20Test%20valid%20username%3Apassword%20response%20data.
INFO  [org.wso2.carbon.integration.common.tests.JaggeryServerTest] - found url: Authentication%20End%20Point%20-%20Publisher%20API%20Test%20invalid%20Username.
INFO  [org.wso2.carbon.integration.common.tests.JaggeryServerTest] - found url: Authentication%20End%20Point%20-%20Publisher%20API%20Test%20invalid%20password.
INFO  [org.wso2.carbon.integration.common.tests.JaggeryServerTest] - found url: Authentication%20End%20Point%20-%20Publisher%20API%20Test%20invalid%20username%3Apassword.
INFO  [org.wso2.carbon.integration.common.tests.JaggeryServerTest] - found url: Authentication%20End%20Point%20-%20Publisher%20API%20Test%20empty%20username%3Apassword.
INFO  [org.wso2.carbon.integration.common.tests.JaggeryServerTest] - found url: Lifecycle%20GET%20-%20Publisher%20API%20Test%20get%20lifecycle%20list.
INFO  [org.wso2.carbon.integration.common.tests.JaggeryServerTest] - found url: Lifecycle%20GET%20-%20Publisher%20API%20Test%20get%20lifecycle%20definition%20by%20name.
INFO  [org.wso2.carbon.integration.common.tests.JaggeryServerTest] - found url: Lifecycle%20GET%20-%20Publisher%20API%20Test%20get%20lifecycle%20state%20details%20by%20lifecyclestate%20name.
INFO  [org.wso2.carbon.integration.common.tests.JaggeryServerTest] - found url: Assets%20POST%20-%20Publisher%20API%20Test%20add%20asset.
INFO  [org.wso2.carbon.integration.common.tests.JaggeryServerTest] - found url: Assets%20POST%20-%20Publisher%20API%20Test%20invoke%20lifecycle%20action%20by%20id.
INFO  [org.wso2.carbon.integration.common.tests.JaggeryServerTest] - found url: Assets%20POST%20-%20Publisher%20API%20Test%20invoke%20lifecycle%20action%20by%20id%20without%20comment.
INFO  [org.wso2.carbon.integration.common.tests.JaggeryServerTest] - found url: Assets%20POST%20-%20Publisher%20API%20Test%20invoke%20lifecycle%20action%20by%20non-exsiting%20id.
INFO  [org.wso2.carbon.integration.common.tests.JaggeryServerTest] - found url: Assets%20POST%20-%20Publisher%20API%20Test%20invoke%20lifecycle%20action%20without%20nextState.
INFO  [org.wso2.carbon.integration.common.tests.JaggeryServerTest] - found url: Assets%20POST%20-%20Publisher%20API%20Test%20update%20assets%20by%20id.
INFO  [org.wso2.carbon.integration.common.tests.JaggeryServerTest] - found url: Assets%20POST%20-%20Publisher%20API%20Test%20add%20comments.
INFO  [org.wso2.carbon.integration.common.tests.JaggeryServerTest] - found url: Assets%20POST%20-%20Publisher%20API%20Test%20add%20asset%20version%20by%20id.
INFO  [org.wso2.carbon.integration.common.tests.JaggeryServerTest] - found url: Assets%20POST%20-%20Publisher%20API%20Test%20post%20lifecycle%20comments.
INFO  [org.wso2.carbon.integration.common.tests.JaggeryServerTest] - found url: Assets%20POST%20-%20Publisher%20API%20Test%20post%20tags.
INFO  [org.wso2.carbon.integration.common.tests.JaggeryServerTest] - found url: Assets%20GET%20-%20Publisher%20API%20Test%20get%20asset%20by%20id.
INFO  [org.wso2.carbon.integration.common.tests.JaggeryServerTest] - found url: Assets%20GET%20-%20Publisher%20API%20Test%20get%20assets%20by%20type%2C%20without%20pagination.
INFO  [org.wso2.carbon.integration.common.tests.JaggeryServerTest] - found url: Assets%20GET%20-%20Publisher%20API%20Test%20get%20assets%20by%20type%2C%20with%20pagination.
INFO  [org.wso2.carbon.integration.common.tests.JaggeryServerTest] - found url: Assets%20GET%20-%20Publisher%20API%20Test%20get%20assets%20by%20type%2C%20with%20field%20expansion%20for%20attributes.
INFO  [org.wso2.carbon.integration.common.tests.JaggeryServerTest] - found url: Assets%20GET%20-%20Publisher%20API%20Test%20get%20assets%20by%20type%2C%20with%20field%20expansion%20for%20outer%20fields.
INFO  [org.wso2.carbon.integration.common.tests.JaggeryServerTest] - found url: Assets%20GET%20-%20Publisher%20API%20Test%20get%20assets%20by%20type%2C%20with%20field%20expansion%20for%20outer%20fields%20and%20attributes.
INFO  [org.wso2.carbon.integration.common.tests.JaggeryServerTest] - found url: Assets%20GET%20-%20Publisher%20API%20Test%20get%20assets%20by%20type%2C%20with%20field%20expansion%20for%20outer%20fields%20with%20not%20available%20fields.
INFO  [org.wso2.carbon.integration.common.tests.JaggeryServerTest] - found url: Assets%20GET%20-%20Publisher%20API%20Test%20get%20assets%20by%20type%2C%20with%20field%20expansion%20for%20outer%20fields%20and%20attributes%20not%20available.
INFO  [org.wso2.carbon.integration.common.tests.JaggeryServerTest] - found url: Assets%20GET%20-%20Publisher%20API%20Test%20get%20assets%20by%20type%2C%20sort%20%2Boverview_name.
INFO  [org.wso2.carbon.integration.common.tests.JaggeryServerTest] - found url: Assets%20GET%20-%20Publisher%20API%20Test%20get%20assets%20by%20type%2C%20sort%20-overview_name.
INFO  [org.wso2.carbon.integration.common.tests.JaggeryServerTest] - found url: Assets%20GET%20-%20Publisher%20API%20Test%20get%20assets%20by%20type%2C%20search%20by%20overview_version.
INFO  [org.wso2.carbon.integration.common.tests.JaggeryServerTest] - found url: Assets%20DELETE%20-%20Publisher%20API%20Test%20delete%20asset%20by%20id.
INFO  [org.wso2.carbon.integration.common.tests.JaggeryServerTest] - found url: Logout%20END%20Point%20-%20Publisher%20API%20Test%20logout%20with%20valid%20SessionId.
INFO  [org.wso2.carbon.integration.common.tests.JaggeryServerTest] - found url: Logout%20END%20Point%20-%20Publisher%20API%20Test%20logout%20valid%20SessionId%3A%20response%20data.
INFO  [org.wso2.carbon.integration.common.tests.JaggeryServerTest] - found url: Logout%20END%20Point%20-%20Publisher%20API%20Test%20logout%20invalid%20SessionId.
INFO  [org.wso2.carbon.automation.engine.testlisteners.TestManagerListener] - Running the test method --- org.wso2.carbon.integration.common.tests.JaggeryServerTest.testRunJaggeryTests ----
INFO  [org.wso2.carbon.integration.common.extensions.utils.ServerLogReader] - [2015-03-28 11:57:38,734]  INFO {jsonReporter} -  Exiting with  1 test suite with passing 
INFO  [org.wso2.carbon.integration.common.tests.JaggeryServerTest] - End point : Authentication%20End%20Point%20-%20Publisher%20API%20Test%20valid%20username%3Apassword.
INFO  [org.wso2.carbon.automation.engine.testlisteners.TestManagerListener] - On test success...
INFO  [org.wso2.carbon.automation.engine.testlisteners.TestManagerListener] - Running the test method --- org.wso2.carbon.integration.common.tests.JaggeryServerTest.testRunJaggeryTests ----
INFO  [org.wso2.carbon.integration.common.extensions.utils.ServerLogReader] - [2015-03-28 11:57:38,766]  INFO {jsonReporter} -  Exiting with  1 test suite with passing 
INFO  [org.wso2.carbon.integration.common.tests.JaggeryServerTest] - End point : Authentication%20End%20Point%20-%20Publisher%20API%20Test%20valid%20username%3Apassword%20response%20data.
INFO  [org.wso2.carbon.automation.engine.testlisteners.TestManagerListener] - On test success...
INFO  [org.wso2.carbon.automation.engine.testlisteners.TestManagerListener] - Running the test method --- org.wso2.carbon.integration.common.tests.JaggeryServerTest.testRunJaggeryTests ----
INFO  [org.wso2.carbon.integration.common.extensions.utils.ServerLogReader] - [2015-03-28 11:57:38,797]  INFO {jsonReporter} -  Exiting with  1 test suite with passing 
INFO  [org.wso2.carbon.integration.common.tests.JaggeryServerTest] - End point : Authentication%20End%20Point%20-%20Publisher%20API%20Test%20invalid%20Username.
INFO  [org.wso2.carbon.automation.engine.testlisteners.TestManagerListener] - On test success...
INFO  [org.wso2.carbon.automation.engine.testlisteners.TestManagerListener] - Running the test method --- org.wso2.carbon.integration.common.tests.JaggeryServerTest.testRunJaggeryTests ----
INFO  [org.wso2.carbon.integration.common.extensions.utils.ServerLogReader] - [2015-03-28 11:57:38,837]  INFO {jsonReporter} -  Exiting with  1 test suite with passing 
INFO  [org.wso2.carbon.integration.common.tests.JaggeryServerTest] - End point : Authentication%20End%20Point%20-%20Publisher%20API%20Test%20invalid%20password.
INFO  [org.wso2.carbon.automation.engine.testlisteners.TestManagerListener] - On test success...
INFO  [org.wso2.carbon.automation.engine.testlisteners.TestManagerListener] - Running the test method --- org.wso2.carbon.integration.common.tests.JaggeryServerTest.testRunJaggeryTests ----
INFO  [org.wso2.carbon.integration.common.extensions.utils.ServerLogReader] - [2015-03-28 11:57:38,867]  INFO {jsonReporter} -  Exiting with  1 test suite with passing 
INFO  [org.wso2.carbon.integration.common.tests.JaggeryServerTest] - End point : Authentication%20End%20Point%20-%20Publisher%20API%20Test%20invalid%20username%3Apassword.
INFO  [org.wso2.carbon.automation.engine.testlisteners.TestManagerListener] - On test success...
INFO  [org.wso2.carbon.automation.engine.testlisteners.TestManagerListener] - Running the test method --- org.wso2.carbon.integration.common.tests.JaggeryServerTest.testRunJaggeryTests ----
INFO  [org.wso2.carbon.integration.common.extensions.utils.ServerLogReader] - [2015-03-28 11:57:38,891]  INFO {jsonReporter} -  Exiting with  1 test suite with passing 
INFO  [org.wso2.carbon.integration.common.tests.JaggeryServerTest] - End point : Authentication%20End%20Point%20-%20Publisher%20API%20Test%20empty%20username%3Apassword.
INFO  [org.wso2.carbon.automation.engine.testlisteners.TestManagerListener] - On test success...
INFO  [org.wso2.carbon.automation.engine.testlisteners.TestManagerListener] - Running the test method --- org.wso2.carbon.integration.common.tests.JaggeryServerTest.testRunJaggeryTests ----
INFO  [org.wso2.carbon.integration.common.extensions.utils.ServerLogReader] - [2015-03-28 11:57:38,950]  INFO {jsonReporter} -  Exiting with  1 test suite with passing 
INFO  [org.wso2.carbon.integration.common.tests.JaggeryServerTest] - End point : Lifecycle%20GET%20-%20Publisher%20API%20Test%20get%20lifecycle%20list.
INFO  [org.wso2.carbon.automation.engine.testlisteners.TestManagerListener] - On test success...
INFO  [org.wso2.carbon.automation.engine.testlisteners.TestManagerListener] - Running the test method --- org.wso2.carbon.integration.common.tests.JaggeryServerTest.testRunJaggeryTests ----
INFO  [org.wso2.carbon.integration.common.extensions.utils.ServerLogReader] - [2015-03-28 11:57:39,021]  INFO {jsonReporter} -  Exiting with  1 test suite with passing 
INFO  [org.wso2.carbon.integration.common.tests.JaggeryServerTest] - End point : Lifecycle%20GET%20-%20Publisher%20API%20Test%20get%20lifecycle%20definition%20by%20name.
INFO  [org.wso2.carbon.automation.engine.testlisteners.TestManagerListener] - On test success...
INFO  [org.wso2.carbon.automation.engine.testlisteners.TestManagerListener] - Running the test method --- org.wso2.carbon.integration.common.tests.JaggeryServerTest.testRunJaggeryTests ----
INFO  [org.wso2.carbon.integration.common.extensions.utils.ServerLogReader] - [2015-03-28 11:57:39,070]  INFO {jsonReporter} -  Exiting with  1 test suite with passing 
INFO  [org.wso2.carbon.integration.common.tests.JaggeryServerTest] - End point : Lifecycle%20GET%20-%20Publisher%20API%20Test%20get%20lifecycle%20state%20details%20by%20lifecyclestate%20name.
INFO  [org.wso2.carbon.automation.engine.testlisteners.TestManagerListener] - On test success...
INFO  [org.wso2.carbon.automation.engine.testlisteners.TestManagerListener] - Running the test method --- org.wso2.carbon.integration.common.tests.JaggeryServerTest.testRunJaggeryTests ----
INFO  [org.wso2.carbon.integration.common.extensions.utils.ServerLogReader] - [2015-03-28 11:57:39,418]  INFO {jsonReporter} -  Exiting with  1 test suite with passing 
INFO  [org.wso2.carbon.integration.common.tests.JaggeryServerTest] - End point : Assets%20POST%20-%20Publisher%20API%20Test%20add%20asset.
INFO  [org.wso2.carbon.automation.engine.testlisteners.TestManagerListener] - On test success...
INFO  [org.wso2.carbon.automation.engine.testlisteners.TestManagerListener] - Running the test method --- org.wso2.carbon.integration.common.tests.JaggeryServerTest.testRunJaggeryTests ----
INFO  [org.wso2.carbon.integration.common.extensions.utils.ServerLogReader] - [2015-03-28 11:57:39,741]  INFO {jsonReporter} -  Exiting with  1 test suite with passing 
INFO  [org.wso2.carbon.integration.common.tests.JaggeryServerTest] - End point : Assets%20POST%20-%20Publisher%20API%20Test%20invoke%20lifecycle%20action%20by%20id.
INFO  [org.wso2.carbon.automation.engine.testlisteners.TestManagerListener] - On test success...
INFO  [org.wso2.carbon.automation.engine.testlisteners.TestManagerListener] - Running the test method --- org.wso2.carbon.integration.common.tests.JaggeryServerTest.testRunJaggeryTests ----
INFO  [org.wso2.carbon.integration.common.extensions.utils.ServerLogReader] - [2015-03-28 11:57:39,956] ERROR {asset_api_endpoints} -   Please provide a comment for this state transition!
INFO  [org.wso2.carbon.integration.common.extensions.utils.ServerLogReader] - [2015-03-28 11:57:40,064]  INFO {jsonReporter} -  Exiting with  1 test suite with passing 
INFO  [org.wso2.carbon.integration.common.tests.JaggeryServerTest] - End point : Assets%20POST%20-%20Publisher%20API%20Test%20invoke%20lifecycle%20action%20by%20id%20without%20comment.
INFO  [org.wso2.carbon.automation.engine.testlisteners.TestManagerListener] - On test success...
INFO  [org.wso2.carbon.automation.engine.testlisteners.TestManagerListener] - Running the test method --- org.wso2.carbon.integration.common.tests.JaggeryServerTest.testRunJaggeryTests ----
INFO  [org.wso2.carbon.integration.common.extensions.utils.ServerLogReader] - [2015-03-28 11:57:40,101] ERROR {lifecycle_api} -  Unable to locate the asset with id: none-exixting-asset
INFO  [org.wso2.carbon.integration.common.extensions.utils.ServerLogReader] - [2015-03-28 11:57:40,103] ERROR {asset_api_endpoints} -  Unable to locate the asset with id: none-exixting-asset
INFO  [org.wso2.carbon.integration.common.extensions.utils.ServerLogReader] - [2015-03-28 11:57:40,117]  INFO {jsonReporter} -  Exiting with  1 test suite with passing 
INFO  [org.wso2.carbon.integration.common.tests.JaggeryServerTest] - End point : Assets%20POST%20-%20Publisher%20API%20Test%20invoke%20lifecycle%20action%20by%20non-exsiting%20id.
INFO  [org.wso2.carbon.automation.engine.testlisteners.TestManagerListener] - On test success...
INFO  [org.wso2.carbon.automation.engine.testlisteners.TestManagerListener] - Running the test method --- org.wso2.carbon.integration.common.tests.JaggeryServerTest.testRunJaggeryTests ----
INFO  [org.wso2.carbon.integration.common.extensions.utils.ServerLogReader] - [2015-03-28 11:57:40,316] ERROR {asset_api_endpoints} -  Checklist items or next state is not provided!
INFO  [org.wso2.carbon.integration.common.extensions.utils.ServerLogReader] - [2015-03-28 11:57:40,390]  INFO {jsonReporter} -  Exiting with  1 test suite with passing 
INFO  [org.wso2.carbon.integration.common.tests.JaggeryServerTest] - End point : Assets%20POST%20-%20Publisher%20API%20Test%20invoke%20lifecycle%20action%20without%20nextState.
INFO  [org.wso2.carbon.automation.engine.testlisteners.TestManagerListener] - On test success...
INFO  [org.wso2.carbon.automation.engine.testlisteners.TestManagerListener] - Running the test method --- org.wso2.carbon.integration.common.tests.JaggeryServerTest.testRunJaggeryTests ----
INFO  [org.wso2.carbon.integration.common.extensions.utils.ServerLogReader] - [2015-03-28 11:57:40,607]  WARN {rxt.asset} -  Unable to locate nameAttribute: overview_name in asset: {"attributes" : {"overview_category" : "Template", "overview_description" : "Test rest api testing update"}}
INFO  [org.wso2.carbon.integration.common.extensions.utils.ServerLogReader] - [2015-03-28 11:57:40,744]  INFO {jsonReporter} -  Exiting with  1 test suite with passing 
INFO  [org.wso2.carbon.integration.common.tests.JaggeryServerTest] - End point : Assets%20POST%20-%20Publisher%20API%20Test%20update%20assets%20by%20id.
INFO  [org.wso2.carbon.automation.engine.testlisteners.TestManagerListener] - On test success...
INFO  [org.wso2.carbon.automation.engine.testlisteners.TestManagerListener] - Running the test method --- org.wso2.carbon.integration.common.tests.JaggeryServerTest.testRunJaggeryTests ----
INFO  [org.wso2.carbon.integration.common.extensions.utils.ServerLogReader] - [2015-03-28 11:57:40,755]  INFO {jsonReporter} -  Exiting with  1 test suite with passing 
INFO  [org.wso2.carbon.integration.common.tests.JaggeryServerTest] - End point : Assets%20POST%20-%20Publisher%20API%20Test%20add%20comments.
INFO  [org.wso2.carbon.automation.engine.testlisteners.TestManagerListener] - On test success...
INFO  [org.wso2.carbon.automation.engine.testlisteners.TestManagerListener] - Running the test method --- org.wso2.carbon.integration.common.tests.JaggeryServerTest.testRunJaggeryTests ----
INFO  [org.wso2.carbon.integration.common.extensions.utils.ServerLogReader] - [2015-03-28 11:57:40,765]  INFO {jsonReporter} -  Exiting with  1 test suite with passing 
INFO  [org.wso2.carbon.integration.common.tests.JaggeryServerTest] - End point : Assets%20POST%20-%20Publisher%20API%20Test%20add%20asset%20version%20by%20id.
INFO  [org.wso2.carbon.automation.engine.testlisteners.TestManagerListener] - On test success...
INFO  [org.wso2.carbon.automation.engine.testlisteners.TestManagerListener] - Running the test method --- org.wso2.carbon.integration.common.tests.JaggeryServerTest.testRunJaggeryTests ----
INFO  [org.wso2.carbon.integration.common.extensions.utils.ServerLogReader] - [2015-03-28 11:57:40,775]  INFO {jsonReporter} -  Exiting with  1 test suite with passing 
INFO  [org.wso2.carbon.integration.common.tests.JaggeryServerTest] - End point : Assets%20POST%20-%20Publisher%20API%20Test%20post%20lifecycle%20comments.
INFO  [org.wso2.carbon.automation.engine.testlisteners.TestManagerListener] - On test success...
INFO  [org.wso2.carbon.automation.engine.testlisteners.TestManagerListener] - Running the test method --- org.wso2.carbon.integration.common.tests.JaggeryServerTest.testRunJaggeryTests ----
INFO  [org.wso2.carbon.integration.common.extensions.utils.ServerLogReader] - [2015-03-28 11:57:40,783]  INFO {jsonReporter} -  Exiting with  1 test suite with passing 
INFO  [org.wso2.carbon.integration.common.tests.JaggeryServerTest] - End point : Assets%20POST%20-%20Publisher%20API%20Test%20post%20tags.
INFO  [org.wso2.carbon.automation.engine.testlisteners.TestManagerListener] - On test success...
INFO  [org.wso2.carbon.automation.engine.testlisteners.TestManagerListener] - Running the test method --- org.wso2.carbon.integration.common.tests.JaggeryServerTest.testRunJaggeryTests ----
INFO  [org.wso2.carbon.integration.common.extensions.utils.ServerLogReader] - [2015-03-28 11:57:41,024]  INFO {jsonReporter} -  Exiting with  1 test suite with passing 
INFO  [org.wso2.carbon.integration.common.tests.JaggeryServerTest] - End point : Assets%20GET%20-%20Publisher%20API%20Test%20get%20asset%20by%20id.
INFO  [org.wso2.carbon.automation.engine.testlisteners.TestManagerListener] - On test success...
INFO  [org.wso2.carbon.automation.engine.testlisteners.TestManagerListener] - Running the test method --- org.wso2.carbon.integration.common.tests.JaggeryServerTest.testRunJaggeryTests ----
INFO  [org.wso2.carbon.integration.common.extensions.utils.ServerLogReader] - [2015-03-28 11:57:41,109]  INFO {jsonReporter} -  Exiting with  1 test suite with passing 
INFO  [org.wso2.carbon.integration.common.tests.JaggeryServerTest] - End point : Assets%20GET%20-%20Publisher%20API%20Test%20get%20assets%20by%20type%2C%20without%20pagination.
INFO  [org.wso2.carbon.automation.engine.testlisteners.TestManagerListener] - On test success...
INFO  [org.wso2.carbon.automation.engine.testlisteners.TestManagerListener] - Running the test method --- org.wso2.carbon.integration.common.tests.JaggeryServerTest.testRunJaggeryTests ----
INFO  [org.wso2.carbon.integration.common.extensions.utils.ServerLogReader] - [2015-03-28 11:57:41,168]  INFO {jsonReporter} -  Exiting with  1 test suite with passing 
INFO  [org.wso2.carbon.integration.common.tests.JaggeryServerTest] - End point : Assets%20GET%20-%20Publisher%20API%20Test%20get%20assets%20by%20type%2C%20with%20pagination.
INFO  [org.wso2.carbon.automation.engine.testlisteners.TestManagerListener] - On test success...
INFO  [org.wso2.carbon.automation.engine.testlisteners.TestManagerListener] - Running the test method --- org.wso2.carbon.integration.common.tests.JaggeryServerTest.testRunJaggeryTests ----
INFO  [org.wso2.carbon.integration.common.extensions.utils.ServerLogReader] - [2015-03-28 11:57:41,501]  INFO {jsonReporter} -  Exiting with  1 test suite with passing 
INFO  [org.wso2.carbon.integration.common.tests.JaggeryServerTest] - End point : Assets%20GET%20-%20Publisher%20API%20Test%20get%20assets%20by%20type%2C%20with%20field%20expansion%20for%20attributes.
INFO  [org.wso2.carbon.automation.engine.testlisteners.TestManagerListener] - On test success...
INFO  [org.wso2.carbon.automation.engine.testlisteners.TestManagerListener] - Running the test method --- org.wso2.carbon.integration.common.tests.JaggeryServerTest.testRunJaggeryTests ----
INFO  [org.wso2.carbon.integration.common.extensions.utils.ServerLogReader] - [2015-03-28 11:57:41,820]  INFO {jsonReporter} -  Exiting with  1 test suite with passing 
INFO  [org.wso2.carbon.integration.common.tests.JaggeryServerTest] - End point : Assets%20GET%20-%20Publisher%20API%20Test%20get%20assets%20by%20type%2C%20with%20field%20expansion%20for%20outer%20fields.
INFO  [org.wso2.carbon.automation.engine.testlisteners.TestManagerListener] - On test success...
INFO  [org.wso2.carbon.automation.engine.testlisteners.TestManagerListener] - Running the test method --- org.wso2.carbon.integration.common.tests.JaggeryServerTest.testRunJaggeryTests ----
INFO  [org.wso2.carbon.integration.common.extensions.utils.ServerLogReader] - [2015-03-28 11:57:42,038]  INFO {jsonReporter} -  Exiting with  1 test suite with passing 
INFO  [org.wso2.carbon.integration.common.tests.JaggeryServerTest] - End point : Assets%20GET%20-%20Publisher%20API%20Test%20get%20assets%20by%20type%2C%20with%20field%20expansion%20for%20outer%20fields%20and%20attributes.
INFO  [org.wso2.carbon.automation.engine.testlisteners.TestManagerListener] - On test success...
INFO  [org.wso2.carbon.automation.engine.testlisteners.TestManagerListener] - Running the test method --- org.wso2.carbon.integration.common.tests.JaggeryServerTest.testRunJaggeryTests ----
INFO  [org.wso2.carbon.integration.common.extensions.utils.ServerLogReader] - [2015-03-28 11:57:42,289]  INFO {jsonReporter} -  Exiting with  1 test suite with passing 
INFO  [org.wso2.carbon.integration.common.tests.JaggeryServerTest] - End point : Assets%20GET%20-%20Publisher%20API%20Test%20get%20assets%20by%20type%2C%20with%20field%20expansion%20for%20outer%20fields%20with%20not%20available%20fields.
INFO  [org.wso2.carbon.automation.engine.testlisteners.TestManagerListener] - On test success...
INFO  [org.wso2.carbon.automation.engine.testlisteners.TestManagerListener] - Running the test method --- org.wso2.carbon.integration.common.tests.JaggeryServerTest.testRunJaggeryTests ----
INFO  [org.wso2.carbon.integration.common.extensions.utils.ServerLogReader] - [2015-03-28 11:57:42,503]  INFO {jsonReporter} -  Exiting with  1 test suite with passing 
INFO  [org.wso2.carbon.integration.common.tests.JaggeryServerTest] - End point : Assets%20GET%20-%20Publisher%20API%20Test%20get%20assets%20by%20type%2C%20with%20field%20expansion%20for%20outer%20fields%20and%20attributes%20not%20available.
INFO  [org.wso2.carbon.automation.engine.testlisteners.TestManagerListener] - On test success...
INFO  [org.wso2.carbon.automation.engine.testlisteners.TestManagerListener] - Running the test method --- org.wso2.carbon.integration.common.tests.JaggeryServerTest.testRunJaggeryTests ----
INFO  [org.wso2.carbon.integration.common.extensions.utils.ServerLogReader] - [2015-03-28 11:57:42,624]  INFO {jsonReporter} -  Exiting with  1 test suite with passing 
INFO  [org.wso2.carbon.integration.common.tests.JaggeryServerTest] - End point : Assets%20GET%20-%20Publisher%20API%20Test%20get%20assets%20by%20type%2C%20sort%20%2Boverview_name.
INFO  [org.wso2.carbon.automation.engine.testlisteners.TestManagerListener] - On test success...
INFO  [org.wso2.carbon.automation.engine.testlisteners.TestManagerListener] - Running the test method --- org.wso2.carbon.integration.common.tests.JaggeryServerTest.testRunJaggeryTests ----
INFO  [org.wso2.carbon.integration.common.extensions.utils.ServerLogReader] - [2015-03-28 11:57:42,680]  INFO {jsonReporter} -  Exiting with  1 test suite with passing 
INFO  [org.wso2.carbon.integration.common.tests.JaggeryServerTest] - End point : Assets%20GET%20-%20Publisher%20API%20Test%20get%20assets%20by%20type%2C%20sort%20-overview_name.
INFO  [org.wso2.carbon.automation.engine.testlisteners.TestManagerListener] - On test success...
INFO  [org.wso2.carbon.automation.engine.testlisteners.TestManagerListener] - Running the test method --- org.wso2.carbon.integration.common.tests.JaggeryServerTest.testRunJaggeryTests ----
INFO  [org.wso2.carbon.integration.common.extensions.utils.ServerLogReader] - [2015-03-28 11:57:42,751]  INFO {jsonReporter} -  Exiting with  1 test suite with passing 
INFO  [org.wso2.carbon.integration.common.tests.JaggeryServerTest] - End point : Assets%20GET%20-%20Publisher%20API%20Test%20get%20assets%20by%20type%2C%20search%20by%20overview_version.
INFO  [org.wso2.carbon.automation.engine.testlisteners.TestManagerListener] - On test success...
INFO  [org.wso2.carbon.automation.engine.testlisteners.TestManagerListener] - Running the test method --- org.wso2.carbon.integration.common.tests.JaggeryServerTest.testRunJaggeryTests ----
INFO  [org.wso2.carbon.integration.common.extensions.utils.ServerLogReader] - [2015-03-28 11:57:42,922]  INFO {jsonReporter} -  Exiting with  1 test suite with passing 
INFO  [org.wso2.carbon.integration.common.tests.JaggeryServerTest] - End point : Assets%20DELETE%20-%20Publisher%20API%20Test%20delete%20asset%20by%20id.
INFO  [org.wso2.carbon.automation.engine.testlisteners.TestManagerListener] - On test success...
INFO  [org.wso2.carbon.automation.engine.testlisteners.TestManagerListener] - Running the test method --- org.wso2.carbon.integration.common.tests.JaggeryServerTest.testRunJaggeryTests ----
INFO  [org.wso2.carbon.integration.common.extensions.utils.ServerLogReader] - [2015-03-28 11:57:42,943]  INFO {jsonReporter} -  Exiting with  1 test suite with passing 
INFO  [org.wso2.carbon.integration.common.tests.JaggeryServerTest] - End point : Logout%20END%20Point%20-%20Publisher%20API%20Test%20logout%20with%20valid%20SessionId.
INFO  [org.wso2.carbon.automation.engine.testlisteners.TestManagerListener] - On test success...
INFO  [org.wso2.carbon.automation.engine.testlisteners.TestManagerListener] - Running the test method --- org.wso2.carbon.integration.common.tests.JaggeryServerTest.testRunJaggeryTests ----
INFO  [org.wso2.carbon.integration.common.extensions.utils.ServerLogReader] - [2015-03-28 11:57:42,962]  INFO {jsonReporter} -  Exiting with  1 test suite with passing 
INFO  [org.wso2.carbon.integration.common.tests.JaggeryServerTest] - End point : Logout%20END%20Point%20-%20Publisher%20API%20Test%20logout%20valid%20SessionId%3A%20response%20data.
INFO  [org.wso2.carbon.automation.engine.testlisteners.TestManagerListener] - On test success...
INFO  [org.wso2.carbon.automation.engine.testlisteners.TestManagerListener] - Running the test method --- org.wso2.carbon.integration.common.tests.JaggeryServerTest.testRunJaggeryTests ----
INFO  [org.wso2.carbon.integration.common.extensions.utils.ServerLogReader] - [2015-03-28 11:57:42,991]  INFO {jsonReporter} -  Exiting with  1 test suite with passing 
INFO  [org.wso2.carbon.integration.common.tests.JaggeryServerTest] - End point : Logout%20END%20Point%20-%20Publisher%20API%20Test%20logout%20invalid%20SessionId.
INFO  [org.wso2.carbon.automation.engine.testlisteners.TestManagerListener] - On test success...
INFO  [org.wso2.carbon.integration.common.tests.JaggeryServerTest] - Jaggery Tests Execution Completed.
INFO  [org.wso2.carbon.integration.common.extensions.utils.ServerLogReader] - [2015-03-28 11:57:43,092]  INFO {org.wso2.carbon.core.services.util.CarbonAuthenticationUtil} -  '[email protected] [-1234]' logged in at [2015-03-28 11:57:43,092+0000]
INFO  [org.wso2.carbon.integration.common.admin.client.AuthenticatorClient] - Login Successful
INFO  [org.wso2.carbon.automation.engine.testlisteners.TestManagerListener] - Running the test method --- org.wso2.es.integration.ArtifactUploadClientTestCase.publisherTest ----
INFO  [org.wso2.carbon.integration.common.extensions.utils.ServerLogReader] - [2015-03-28 11:57:43,966]  WARN {rxt.core} -  The rxt definition for policy does not have any tables.
INFO  [org.wso2.carbon.integration.common.extensions.utils.ServerLogReader] - [2015-03-28 11:57:43,982]  WARN {rxt.core} -  The rxt definition for schema does not have any tables.
INFO  [org.wso2.carbon.integration.common.extensions.utils.ServerLogReader] - [2015-03-28 11:57:44,040]  WARN {rxt.core} -  The rxt definition for wadl does not have any tables.
INFO  [org.wso2.carbon.integration.common.extensions.utils.ServerLogReader] - [2015-03-28 11:57:44,048]  WARN {rxt.core} -  The rxt definition for wsdl does not have any tables.
INFO  [org.wso2.es.integration.ArtifactUploadClientTestCase] - 2015-03-28 11:57:44 INFO  ArtifactPublisher:336 - Asset sample gadget uploaded successfully

INFO  [org.wso2.carbon.automation.engine.testlisteners.TestManagerListener] - On test success...
INFO  [org.wso2.carbon.automation.engine.testlisteners.TestSuiteListener] - Inside Test Suite Listener - On Finish
INFO  [org.wso2.carbon.automation.engine.testlisteners.TestExecutionListener] - Inside Test Execution Listener - On Finish
INFO  [org.wso2.es.integration.common.utils.ESServerExtensionForWait] - Completed executing test cases for testing Jaggery-Apps
INFO  [org.wso2.carbon.integration.common.extensions.carbonserver.CarbonServerManager] - Shutting down server..
INFO  [org.wso2.carbon.integration.common.utils.ClientConnectionUtil] - Successfully connected to the server on port 9443
INFO  [org.wso2.carbon.integration.common.extensions.utils.ServerLogReader] - [2015-03-28 11:57:44,340]  INFO {org.wso2.carbon.core.services.util.CarbonAuthenticationUtil} -  '[email protected] [-1234]' logged in at [2015-03-28 11:57:44,339+0000]
INFO  [org.wso2.carbon.integration.common.extensions.utils.ServerLogReader] - [2015-03-28 11:57:45,341]  INFO {org.wso2.carbon.core.init.CarbonServerManager} -  Shutting down WSO2 Enterprise Store...
INFO  [org.wso2.carbon.integration.common.extensions.utils.ServerLogReader] - [2015-03-28 11:57:45,342]  INFO {org.wso2.carbon.core.init.CarbonServerManager} -  Shutting down OSGi framework...
INFO  [org.wso2.carbon.integration.common.extensions.utils.ServerLogReader] - [2015-03-28 11:57:45,371]  INFO {org.wso2.carbon.identity.application.mgt.ui.internal.ApplicationMgtUIServiceComponent} -  Application Management UI bundle is deactivated
INFO  [org.wso2.carbon.integration.common.extensions.utils.ServerLogReader] - [2015-03-28 11:57:47,419] ERROR {org.apache.catalina.core.ContainerBase} -  A child container failed during stop
INFO  [org.wso2.carbon.integration.common.extensions.utils.ServerLogReader] - java.util.concurrent.ExecutionException: org.apache.catalina.LifecycleException: Failed to stop component [StandardEngine[Catalina].StandardHost[localhost].StandardContext[/SHINDIG]]
INFO  [org.wso2.carbon.integration.common.extensions.utils.ServerLogReader] - 	at java.util.concurrent.FutureTask$Sync.innerGet(FutureTask.java:222)
INFO  [org.wso2.carbon.integration.common.extensions.utils.ServerLogReader] - 	at java.util.concurrent.FutureTask.get(FutureTask.java:83)
INFO  [org.wso2.carbon.integration.common.extensions.utils.ServerLogReader] - 	at org.apache.catalina.core.ContainerBase.stopInternal(ContainerBase.java:1179)
INFO  [org.wso2.carbon.integration.common.extensions.utils.ServerLogReader] - 	at org.apache.catalina.util.LifecycleBase.stop(LifecycleBase.java:232)
INFO  [org.wso2.carbon.integration.common.extensions.utils.ServerLogReader] - 	at org.apache.catalina.core.ContainerBase$StopChild.call(ContainerBase.java:1575)
INFO  [org.wso2.carbon.integration.common.extensions.utils.ServerLogReader] - 	at org.apache.catalina.core.ContainerBase$StopChild.call(ContainerBase.java:1564)
INFO  [org.wso2.carbon.integration.common.extensions.utils.ServerLogReader] - 	at java.util.concurrent.FutureTask$Sync.innerRun(FutureTask.java:303)
INFO  [org.wso2.carbon.integration.common.extensions.utils.ServerLogReader] - 	at java.util.concurrent.FutureTask.run(FutureTask.java:138)
INFO  [org.wso2.carbon.integration.common.extensions.utils.ServerLogReader] - 	at java.util.concurrent.ThreadPoolExecutor$Worker.runTask(ThreadPoolExecutor.java:886)
INFO  [org.wso2.carbon.integration.common.extensions.utils.ServerLogReader] - 	at java.util.concurrent.ThreadPoolExecutor$Worker.run(ThreadPoolExecutor.java:908)
INFO  [org.wso2.carbon.integration.common.extensions.utils.ServerLogReader] - 	at java.lang.Thread.run(Thread.java:662)
INFO  [org.wso2.carbon.integration.common.extensions.utils.ServerLogReader] - Caused by: org.apache.catalina.LifecycleException: Failed to stop component [StandardEngine[Catalina].StandardHost[localhost].StandardContext[/SHINDIG]]
INFO  [org.wso2.carbon.integration.common.extensions.utils.ServerLogReader] - 	at org.apache.catalina.util.LifecycleBase.stop(LifecycleBase.java:236)
INFO  [org.wso2.carbon.integration.common.extensions.utils.ServerLogReader] - 	... 7 more
INFO  [org.wso2.carbon.integration.common.extensions.utils.ServerLogReader] - Caused by: org.apache.catalina.LifecycleException: Failed to stop component [org.wso2.carbon.webapp.mgt.CarbonTomcatSessionManager[/SHINDIG]]
INFO  [org.wso2.carbon.integration.common.extensions.utils.ServerLogReader] - 	at org.apache.catalina.util.LifecycleBase.stop(LifecycleBase.java:236)
INFO  [org.wso2.carbon.integration.common.extensions.utils.ServerLogReader] - 	at org.apache.catalina.core.StandardContext.stopInternal(StandardContext.java:5655)
INFO  [org.wso2.carbon.integration.common.extensions.utils.ServerLogReader] - 	at org.apache.catalina.util.LifecycleBase.stop(LifecycleBase.java:232)
INFO  [org.wso2.carbon.integration.common.extensions.utils.ServerLogReader] - 	... 7 more
INFO  [org.wso2.carbon.integration.common.extensions.utils.ServerLogReader] - Caused by: java.lang.SecurityException: Illegal access attempt by  tenant[-1] to sessions owned by tenant[-1234]
INFO  [org.wso2.carbon.integration.common.extensions.utils.ServerLogReader] - 	at org.wso2.carbon.webapp.mgt.CarbonTomcatSessionManager.checkAccess(CarbonTomcatSessionManager.java:135)
INFO  [org.wso2.carbon.integration.common.extensions.utils.ServerLogReader] - 	at org.wso2.carbon.webapp.mgt.CarbonTomcatSessionManager.findSessions(CarbonTomcatSessionManager.java:87)
INFO  [org.wso2.carbon.integration.common.extensions.utils.ServerLogReader] - 	at org.apache.catalina.session.StandardManager.stopInternal(StandardManager.java:523)
INFO  [org.wso2.carbon.integration.common.extensions.utils.ServerLogReader] - 	at org.apache.catalina.util.LifecycleBase.stop(LifecycleBase.java:232)
INFO  [org.wso2.carbon.integration.common.extensions.utils.ServerLogReader] - 	... 9 more
INFO  [org.wso2.carbon.integration.common.extensions.utils.ServerLogReader] - [2015-03-28 11:57:47,429] ERROR {org.apache.catalina.core.ContainerBase} -  A child container failed during stop
INFO  [org.wso2.carbon.integration.common.extensions.utils.ServerLogReader] - java.util.concurrent.ExecutionException: org.apache.catalina.LifecycleException: Failed to stop component [StandardEngine[Catalina].StandardHost[localhost].StandardContext[/publisher]]
INFO  [org.wso2.carbon.integration.common.extensions.utils.ServerLogReader] - 	at java.util.concurrent.FutureTask$Sync.innerGet(FutureTask.java:222)
INFO  [org.wso2.carbon.integration.common.extensions.utils.ServerLogReader] - 	at java.util.concurrent.FutureTask.get(FutureTask.java:83)
INFO  [org.wso2.carbon.integration.common.extensions.utils.ServerLogReader] - 	at org.apache.catalina.core.ContainerBase.stopInternal(ContainerBase.java:1179)
INFO  [org.wso2.carbon.integration.common.extensions.utils.ServerLogReader] - 	at org.apache.catalina.util.LifecycleBase.stop(LifecycleBase.java:232)
INFO  [org.wso2.carbon.integration.common.extensions.utils.ServerLogReader] - 	at org.apache.catalina.core.ContainerBase$StopChild.call(ContainerBase.java:1575)
INFO  [org.wso2.carbon.integration.common.extensions.utils.ServerLogReader] - 	at org.apache.catalina.core.ContainerBase$StopChild.call(ContainerBase.java:1564)
INFO  [org.wso2.carbon.integration.common.extensions.utils.ServerLogReader] - 	at java.util.concurrent.FutureTask$Sync.innerRun(FutureTask.java:303)
INFO  [org.wso2.carbon.integration.common.extensions.utils.ServerLogReader] - 	at java.util.concurrent.FutureTask.run(FutureTask.java:138)
INFO  [org.wso2.carbon.integration.common.extensions.utils.ServerLogReader] - 	at java.util.concurrent.ThreadPoolExecutor$Worker.runTask(ThreadPoolExecutor.java:886)
INFO  [org.wso2.carbon.integration.common.extensions.utils.ServerLogReader] - 	at java.util.concurrent.ThreadPoolExecutor$Worker.run(ThreadPoolExecutor.java:908)
INFO  [org.wso2.carbon.integration.common.extensions.utils.ServerLogReader] - 	at java.lang.Thread.run(Thread.java:662)
INFO  [org.wso2.carbon.integration.common.extensions.utils.ServerLogReader] - Caused by: org.apache.catalina.LifecycleException: Failed to stop component [StandardEngine[Catalina].StandardHost[localhost].StandardContext[/publisher]]
INFO  [org.wso2.carbon.integration.common.extensions.utils.ServerLogReader] - 	at org.apache.catalina.util.LifecycleBase.stop(LifecycleBase.java:236)
INFO  [org.wso2.carbon.integration.common.extensions.utils.ServerLogReader] - 	... 7 more
INFO  [org.wso2.carbon.integration.common.extensions.utils.ServerLogReader] - Caused by: org.apache.catalina.LifecycleException: Failed to stop component [org.wso2.carbon.webapp.mgt.CarbonTomcatSessionManager[/publisher]]
INFO  [org.wso2.carbon.integration.common.extensions.utils.ServerLogReader] - 	at org.apache.catalina.util.LifecycleBase.stop(LifecycleBase.java:236)
INFO  [org.wso2.carbon.integration.common.extensions.utils.ServerLogReader] - 	at org.apache.catalina.core.StandardContext.stopInternal(StandardContext.java:5655)
INFO  [org.wso2.carbon.integration.common.extensions.utils.ServerLogReader] - 	at org.apache.catalina.util.LifecycleBase.stop(LifecycleBase.java:232)
INFO  [org.wso2.carbon.integration.common.extensions.utils.ServerLogReader] - 	... 7 more
INFO  [org.wso2.carbon.integration.common.extensions.utils.ServerLogReader] - Caused by: java.lang.SecurityException: Illegal access attempt by  tenant[-1] to sessions owned by tenant[-1234]
INFO  [org.wso2.carbon.integration.common.extensions.utils.ServerLogReader] - 	at org.wso2.carbon.webapp.mgt.CarbonTomcatSessionManager.checkAccess(CarbonTomcatSessionManager.java:135)
INFO  [org.wso2.carbon.integration.common.extensions.utils.ServerLogReader] - 	at org.wso2.carbon.webapp.mgt.CarbonTomcatSessionManager.findSessions(CarbonTomcatSessionManager.java:87)
INFO  [org.wso2.carbon.integration.common.extensions.utils.ServerLogReader] - 	at org.apache.catalina.session.StandardManager.stopInternal(StandardManager.java:523)
INFO  [org.wso2.carbon.integration.common.extensions.utils.ServerLogReader] - 	at org.apache.catalina.util.LifecycleBase.stop(LifecycleBase.java:232)
INFO  [org.wso2.carbon.integration.common.extensions.utils.ServerLogReader] - 	... 9 more
INFO  [org.wso2.carbon.integration.common.extensions.utils.ServerLogReader] - [2015-03-28 11:57:47,430] ERROR {org.apache.catalina.core.ContainerBase} -  A child container failed during stop
INFO  [org.wso2.carbon.integration.common.extensions.utils.ServerLogReader] - java.util.concurrent.ExecutionException: org.apache.catalina.LifecycleException: Failed to stop component [StandardEngine[Catalina].StandardHost[localhost].StandardContext[/store-admin]]
INFO  [org.wso2.carbon.integration.common.extensions.utils.ServerLogReader] - 	at java.util.concurrent.FutureTask$Sync.innerGet(FutureTask.java:222)
INFO  [org.wso2.carbon.integration.common.extensions.utils.ServerLogReader] - 	at java.util.concurrent.FutureTask.get(FutureTask.java:83)
INFO  [org.wso2.carbon.integration.common.extensions.utils.ServerLogReader] - 	at org.apache.catalina.core.ContainerBase.stopInternal(ContainerBase.java:1179)
INFO  [org.wso2.carbon.integration.common.extensions.utils.ServerLogReader] - 	at org.apache.catalina.util.LifecycleBase.stop(LifecycleBase.java:232)
INFO  [org.wso2.carbon.integration.common.extensions.utils.ServerLogReader] - 	at org.apache.catalina.core.ContainerBase$StopChild.call(ContainerBase.java:1575)
INFO  [org.wso2.carbon.integration.common.extensions.utils.ServerLogReader] - 	at org.apache.catalina.core.ContainerBase$StopChild.call(ContainerBase.java:1564)
INFO  [org.wso2.carbon.integration.common.extensions.utils.ServerLogReader] - 	at java.util.concurrent.FutureTask$Sync.innerRun(FutureTask.java:303)
INFO  [org.wso2.carbon.integration.common.extensions.utils.ServerLogReader] - 	at java.util.concurrent.FutureTask.run(FutureTask.java:138)
INFO  [org.wso2.carbon.integration.common.extensions.utils.ServerLogReader] - 	at java.util.concurrent.ThreadPoolExecutor$Worker.runTask(ThreadPoolExecutor.java:886)
INFO  [org.wso2.carbon.integration.common.extensions.utils.ServerLogReader] - 	at java.util.concurrent.ThreadPoolExecutor$Worker.run(ThreadPoolExecutor.java:908)
INFO  [org.wso2.carbon.integration.common.extensions.utils.ServerLogReader] - 	at java.lang.Thread.run(Thread.java:662)
INFO  [org.wso2.carbon.integration.common.extensions.utils.ServerLogReader] - Caused by: org.apache.catalina.LifecycleException: Failed to stop component [StandardEngine[Catalina].StandardHost[localhost].StandardContext[/store-admin]]
INFO  [org.wso2.carbon.integration.common.extensions.utils.ServerLogReader] - 	at org.apache.catalina.util.LifecycleBase.stop(LifecycleBase.java:236)
INFO  [org.wso2.carbon.integration.common.extensions.utils.ServerLogReader] - 	... 7 more
INFO  [org.wso2.carbon.integration.common.extensions.utils.ServerLogReader] - Caused by: org.apache.catalina.LifecycleException: Failed to stop component [org.wso2.carbon.webapp.mgt.CarbonTomcatSessionManager[/store-admin]]
INFO  [org.wso2.carbon.integration.common.extensions.utils.ServerLogReader] - 	at org.apache.catalina.util.LifecycleBase.stop(LifecycleBase.java:236)
INFO  [org.wso2.carbon.integration.common.extensions.utils.ServerLogReader] - 	at org.apache.catalina.core.StandardContext.stopInternal(StandardContext.java:5655)
INFO  [org.wso2.carbon.integration.common.extensions.utils.ServerLogReader] - 	at org.apache.catalina.util.LifecycleBase.stop(LifecycleBase.java:232)
INFO  [org.wso2.carbon.integration.common.extensions.utils.ServerLogReader] - 	... 7 more
INFO  [org.wso2.carbon.integration.common.extensions.utils.ServerLogReader] - Caused by: java.lang.SecurityException: Illegal access attempt by  tenant[-1] to sessions owned by tenant[-1234]
INFO  [org.wso2.carbon.integration.common.extensions.utils.ServerLogReader] - 	at org.wso2.carbon.webapp.mgt.CarbonTomcatSessionManager.checkAccess(CarbonTomcatSessionManager.java:135)
INFO  [org.wso2.carbon.integration.common.extensions.utils.ServerLogReader] - 	at org.wso2.carbon.webapp.mgt.CarbonTomcatSessionManager.findSessions(CarbonTomcatSessionManager.java:87)
INFO  [org.wso2.carbon.integration.common.extensions.utils.ServerLogReader] - 	at org.apache.catalina.session.StandardManager.stopInternal(StandardManager.java:523)
INFO  [org.wso2.carbon.integration.common.extensions.utils.ServerLogReader] - 	at org.apache.catalina.util.LifecycleBase.stop(LifecycleBase.java:232)
INFO  [org.wso2.carbon.integration.common.extensions.utils.ServerLogReader] - 	... 9 more
INFO  [org.wso2.carbon.integration.common.extensions.utils.ServerLogReader] - [2015-03-28 11:57:47,433] ERROR {org.apache.catalina.core.ContainerBase} -  A child container failed during stop
INFO  [org.wso2.carbon.integration.common.extensions.utils.ServerLogReader] - java.util.concurrent.ExecutionException: org.apache.catalina.LifecycleException: Failed to stop component [StandardEngine[Catalina].StandardHost[localhost].StandardContext[/store]]
INFO  [org.wso2.carbon.integration.common.extensions.utils.ServerLogReader] - 	at java.util.concurrent.FutureTask$Sync.innerGet(FutureTask.java:222)
INFO  [org.wso2.carbon.integration.common.extensions.utils.ServerLogReader] - 	at java.util.concurrent.FutureTask.get(FutureTask.java:83)
INFO  [org.wso2.carbon.integration.common.extensions.utils.ServerLogReader] - 	at org.apache.catalina.core.ContainerBase.stopInternal(ContainerBase.java:1179)
INFO  [org.wso2.carbon.integration.common.extensions.utils.ServerLogReader] - 	at org.apache.catalina.util.LifecycleBase.stop(LifecycleBase.java:232)
INFO  [org.wso2.carbon.integration.common.extensions.utils.ServerLogReader] - 	at org.apache.catalina.core.ContainerBase$StopChild.call(ContainerBase.java:1575)
INFO  [org.wso2.carbon.integration.common.extensions.utils.ServerLogReader] - 	at org.apache.catalina.core.ContainerBase$StopChild.call(ContainerBase.java:1564)
INFO  [org.wso2.carbon.integration.common.extensions.utils.ServerLogReader] - 	at java.util.concurrent.FutureTask$Sync.innerRun(FutureTask.java:303)
INFO  [org.wso2.carbon.integration.common.extensions.utils.ServerLogReader] - 	at java.util.concurrent.FutureTask.run(FutureTask.java:138)
INFO  [org.wso2.carbon.integration.common.extensions.utils.ServerLogReader] - 	at java.util.concurrent.ThreadPoolExecutor$Worker.runTask(ThreadPoolExecutor.java:886)
INFO  [org.wso2.carbon.integration.common.extensions.utils.ServerLogReader] - 	at java.util.concurrent.ThreadPoolExecutor$Worker.run(ThreadPoolExecutor.java:908)
INFO  [org.wso2.carbon.integration.common.extensions.utils.ServerLogReader] - 	at java.lang.Thread.run(Thread.java:662)
INFO  [org.wso2.carbon.integration.common.extensions.utils.ServerLogReader] - Caused by: org.apache.catalina.LifecycleException: Failed to stop component [StandardEngine[Catalina].StandardHost[localhost].StandardContext[/store]]
INFO  [org.wso2.carbon.integration.common.extensions.utils.ServerLogReader] - 	at org.apache.catalina.util.LifecycleBase.stop(LifecycleBase.java:236)
INFO  [org.wso2.carbon.integration.common.extensions.utils.ServerLogReader] - 	... 7 more
INFO  [org.wso2.carbon.integration.common.extensions.utils.ServerLogReader] - Caused by: org.apache.catalina.LifecycleException: Failed to stop component [org.wso2.carbon.webapp.mgt.CarbonTomcatSessionManager[/store]]
INFO  [org.wso2.carbon.integration.common.extensions.utils.ServerLogReader] - 	at org.apache.catalina.util.LifecycleBase.stop(LifecycleBase.java:236)
INFO  [org.wso2.carbon.integration.common.extensions.utils.ServerLogReader] - 	at org.apache.catalina.core.StandardContext.stopInternal(StandardContext.java:5655)
INFO  [org.wso2.carbon.integration.common.extensions.utils.ServerLogReader] - 	at org.apache.catalina.util.LifecycleBase.stop(LifecycleBase.java:232)
INFO  [org.wso2.carbon.integration.common.extensions.utils.ServerLogReader] - 	... 7 more
INFO  [org.wso2.carbon.integration.common.extensions.utils.ServerLogReader] - Caused by: java.lang.SecurityException: Illegal access attempt by  tenant[-1] to sessions owned by tenant[-1234]
INFO  [org.wso2.carbon.integration.common.extensions.utils.ServerLogReader] - 	at org.wso2.carbon.webapp.mgt.CarbonTomcatSessionManager.checkAccess(CarbonTomcatSessionManager.java:135)
INFO  [org.wso2.carbon.integration.common.extensions.utils.ServerLogReader] - 	at org.wso2.carbon.webapp.mgt.CarbonTomcatSessionManager.findSessions(CarbonTomcatSessionManager.java:87)
INFO  [org.wso2.carbon.integration.common.extensions.utils.ServerLogReader] - 	at org.apache.catalina.session.StandardManager.stopInternal(StandardManager.java:523)
INFO  [org.wso2.carbon.integration.common.extensions.utils.ServerLogReader] - 	at org.apache.catalina.util.LifecycleBase.stop(LifecycleBase.java:232)
INFO  [org.wso2.carbon.integration.common.extensions.utils.ServerLogReader] - 	... 9 more
INFO  [org.wso2.carbon.integration.common.extensions.utils.ServerLogReader] - [2015-03-28 11:57:47,435]  INFO {org.wso2.carbon.core.init.CarbonServerManager} -  Stopping CarbonServerManager...
INFO  [org.wso2.carbon.integration.common.extensions.utils.ServerLogReader] - [2015-03-28 11:57:47,435] ERROR {org.apache.catalina.core.ContainerBase} -  A child container failed during stop
INFO  [org.wso2.carbon.integration.common.extensions.utils.ServerLogReader] - java.util.concurrent.ExecutionException: org.apache.catalina.LifecycleException: Failed to stop component [StandardEngine[Catalina].StandardHost[localhost].StandardContext[/sso]]
INFO  [org.wso2.carbon.integration.common.extensions.utils.ServerLogReader] - 	at java.util.concurrent.FutureTask$Sync.innerGet(FutureTask.java:222)
INFO  [org.wso2.carbon.integration.common.extensions.utils.ServerLogReader] - 	at java.util.concurrent.FutureTask.get(FutureTask.java:83)
INFO  [org.wso2.carbon.integration.common.extensions.utils.ServerLogReader] - 	at org.apache.catalina.core.ContainerBase.stopInternal(ContainerBase.java:1179)
INFO  [org.wso2.carbon.integration.common.extensions.utils.ServerLogReader] - 	at org.apache.catalina.util.LifecycleBase.stop(LifecycleBase.java:232)
INFO  [org.wso2.carbon.integration.common.extensions.utils.ServerLogReader] - 	at org.apache.catalina.core.ContainerBase$StopChild.call(ContainerBase.java:1575)
INFO  [org.wso2.carbon.integration.common.extensions.utils.ServerLogReader] - 	at org.apache.catalina.core.ContainerBase$StopChild.call(ContainerBase.java:1564)
INFO  [org.wso2.carbon.integration.common.extensions.utils.ServerLogReader] - 	at java.util.concurrent.FutureTask$Sync.innerRun(FutureTask.java:303)
INFO  [org.wso2.carbon.integration.common.extensions.utils.ServerLogReader] - 	at java.util.concurrent.FutureTask.run(FutureTask.java:138)
INFO  [org.wso2.carbon.integration.common.extensions.utils.ServerLogReader] - 	at java.util.concurrent.ThreadPoolExecutor$Worker.runTask(ThreadPoolExecutor.java:886)
INFO  [org.wso2.carbon.integration.common.extensions.utils.ServerLogReader] - 	at java.util.concurrent.ThreadPoolExecutor$Worker.run(ThreadPoolExecutor.java:908)
INFO  [org.wso2.carbon.integration.common.extensions.utils.ServerLogReader] - 	at java.lang.Thread.run(Thread.java:662)
INFO  [org.wso2.carbon.integration.common.extensions.utils.ServerLogReader] - Caused by: org.apache.catalina.LifecycleException: Failed to stop component [StandardEngine[Catalina].StandardHost[localhost].StandardContext[/sso]]
INFO  [org.wso2.carbon.integration.common.extensions.utils.ServerLogReader] - 	at org.apache.catalina.util.LifecycleBase.stop(LifecycleBase.java:236)
INFO  [org.wso2.carbon.integration.common.extensions.utils.ServerLogReader] - 	... 7 more
INFO  [org.wso2.carbon.integration.common.extensions.utils.ServerLogReader] - Caused by: org.apache.catalina.LifecycleException: Failed to stop component [org.wso2.carbon.webapp.mgt.CarbonTomcatSessionManager[/sso]]
INFO  [org.wso2.carbon.integration.common.extensions.utils.ServerLogReader] - 	at org.apache.catalina.util.LifecycleBase.stop(LifecycleBase.java:236)
INFO  [org.wso2.carbon.integration.common.extensions.utils.ServerLogReader] - 	at org.apache.catalina.core.StandardContext.stopInternal(StandardContext.java:5655)
INFO  [org.wso2.carbon.integration.common.extensions.utils.ServerLogReader] - 	at org.apache.catalina.util.LifecycleBase.stop(LifecycleBase.java:232)
INFO  [org.wso2.carbon.integration.common.extensions.utils.ServerLogReader] - 	... 7 more
INFO  [org.wso2.carbon.integration.common.extensions.utils.ServerLogReader] - Caused by: java.lang.SecurityException: Illegal access attempt by  tenant[-1] to sessions owned by tenant[-1234]
INFO  [org.wso2.carbon.integration.common.extensions.utils.ServerLogReader] - 	at org.wso2.carbon.webapp.mgt.CarbonTomcatSessionManager.checkAccess(CarbonTomcatSessionManager.java:135)
INFO  [org.wso2.carbon.integration.common.extensions.utils.ServerLogReader] - 	at org.wso2.carbon.webapp.mgt.CarbonTomcatSessionManager.findSessions(CarbonTomcatSessionManager.java:87)
INFO  [org.wso2.carbon.integration.common.extensions.utils.ServerLogReader] - 	at org.apache.catalina.session.StandardManager.stopInternal(StandardManager.java:523)
INFO  [org.wso2.carbon.integration.common.extensions.utils.ServerLogReader] - 	at org.apache.catalina.util.LifecycleBase.stop(LifecycleBase.java:232)
INFO  [org.wso2.carbon.integration.common.extensions.utils.ServerLogReader] - 	... 9 more
INFO  [org.wso2.carbon.integration.common.extensions.utils.ServerLogReader] - [2015-03-28 11:57:47,497] ERROR {org.apache.catalina.core.ContainerBase} -  A child container failed during stop
INFO  [org.wso2.carbon.integration.common.extensions.utils.ServerLogReader] - java.util.concurrent.ExecutionException: org.apache.catalina.LifecycleException: Failed to stop component [StandardEngine[Catalina].StandardHost[localhost]]
INFO  [org.wso2.carbon.integration.common.extensions.utils.ServerLogReader] - 	at java.util.concurrent.FutureTask$Sync.innerGet(FutureTask.java:222)
INFO  [org.wso2.carbon.integration.common.extensions.utils.ServerLogReader] - 	at java.util.concurrent.FutureTask.get(FutureTask.java:83)
INFO  [org.wso2.carbon.integration.common.extensions.utils.ServerLogReader] - 	at org.apache.catalina.core.ContainerBase.stopInternal(ContainerBase.java:1179)
INFO  [org.wso2.carbon.integration.common.extensions.utils.ServerLogReader] - 	at org.apache.catalina.util.LifecycleBase.stop(LifecycleBase.java:232)
INFO  [org.wso2.carbon.integration.common.extensions.utils.ServerLogReader] - 	at org.apache.catalina.core.StandardService.stopInternal(StandardService.java:502)
INFO  [org.wso2.carbon.integration.common.extensions.utils.ServerLogReader] - 	at org.apache.catalina.util.LifecycleBase.stop(LifecycleBase.java:232)
INFO  [org.wso2.carbon.integration.common.extensions.utils.ServerLogReader] - 	at org.apache.catalina.core.StandardServer.stopInternal(StandardServer.java:752)
INFO  [org.wso2.carbon.integration.common.extensions.utils.ServerLogReader] - 	at org.apache.catalina.util.LifecycleBase.stop(LifecycleBase.java:232)
INFO  [org.wso2.carbon.integration.common.extensions.utils.ServerLogReader] - 	at org.apache.catalina.startup.Tomcat.stop(Tomcat.java:351)
INFO  [org.wso2.carbon.integration.common.extensions.utils.ServerLogReader] - 	at org.wso2.carbon.tomcat.internal.ServerManager.stop(ServerManager.java:113)
INFO  [org.wso2.carbon.integration.common.extensions.utils.ServerLogReader] - 	at org.wso2.carbon.tomcat.internal.TomcatBundleActivator.stop(TomcatBundleActivator.java:65)
INFO  [org.wso2.carbon.integration.common.extensions.utils.ServerLogReader] - 	at org.eclipse.osgi.framework.internal.core.BundleContextImpl$2.run(BundleContextImpl.java:771)
INFO  [org.wso2.carbon.integration.common.extensions.utils.ServerLogReader] - 	at java.security.AccessController.doPrivileged(Native Method)
INFO  [org.wso2.carbon.integration.common.extensions.utils.ServerLogReader] - 	at org.eclipse.osgi.framework.internal.core.BundleContextImpl.stop(BundleContextImpl.java:764)
INFO  [org.wso2.carbon.integration.common.extensions.utils.ServerLogReader] - 	at org.eclipse.osgi.framework.internal.core.BundleHost.stopWorker(BundleHost.java:510)
INFO  [org.wso2.carbon.integration.common.extensions.utils.ServerLogReader] - 	at org.eclipse.osgi.framework.internal.core.AbstractBundle.suspend(AbstractBundle.java:566)
INFO  [org.wso2.carbon.integration.common.extensions.utils.ServerLogReader] - 	at org.eclipse.osgi.framework.internal.core.Framework.suspendBundle(Framework.java:1206)
INFO  [org.wso2.carbon.integration.common.extensions.utils.ServerLogReader] - 	at org.eclipse.osgi.framework.internal.core.StartLevelManager.decFWSL(StartLevelManager.java:592)
INFO  [org.wso2.carbon.integration.common.extensions.utils.ServerLogReader] - 	at org.eclipse.osgi.framework.internal.core.StartLevelManager.doSetStartLevel(StartLevelManager.java:257)
INFO  [org.wso2.carbon.integration.common.extensions.utils.ServerLogReader] - 	at org.eclipse.osgi.framework.internal.core.StartLevelManager.shutdown(StartLevelManager.java:215)
INFO  [org.wso2.carbon.integration.common.extensions.utils.ServerLogReader] - 	at org.eclipse.osgi.framework.internal.core.InternalSystemBundle.suspend(InternalSystemBundle.java:284)
INFO  [org.wso2.carbon.integration.common.extensions.utils.ServerLogReader] - 	at org.eclipse.osgi.framework.internal.core.Framework.shutdown(Framework.java:692)
INFO  [org.wso2.carbon.integration.common.extensions.utils.ServerLogReader] - 	at org.eclipse.osgi.framework.internal.core.Framework.close(Framework.java:600)
INFO  [org.wso2.carbon.integration.common.extensions.utils.ServerLogReader] - 	at org.eclipse.core.runtime.adaptor.EclipseStarter.shutdown(EclipseStarter.java:399)
INFO  [org.wso2.carbon.integration.common.extensions.utils.ServerLogReader] - 	at org.wso2.carbon.core.init.CarbonServerManager.shutdown(CarbonServerManager.java:849)
INFO  [org.wso2.carbon.integration.common.extensions.utils.ServerLogReader] - 	at org.wso2.carbon.server.admin.service.ServerAdmin$3.run(ServerAdmin.java:244)
INFO  [org.wso2.carbon.integration.common.extensions.utils.ServerLogReader] - Caused by: org.apache.catalina.LifecycleException: Failed to stop component [StandardEngine[Catalina].StandardHost[localhost]]
INFO  [org.wso2.carbon.integration.common.extensions.utils.ServerLogReader] - 	at org.apache.catalina.util.LifecycleBase.stop(LifecycleBase.java:236)
INFO  [org.wso2.carbon.integration.common.extensions.utils.ServerLogReader] - 	at org.apache.catalina.core.ContainerBase$StopChild.call(ContainerBase.java:1575)
INFO  [org.wso2.carbon.integration.common.extensions.utils.ServerLogReader] - 	at org.apache.catalina.core.ContainerBase$StopChild.call(ContainerBase.java:1564)
INFO  [org.wso2.carbon.integration.common.extensions.utils.ServerLogReader] - 	at java.util.concurrent.FutureTask$Sync.innerRun(FutureTask.java:303)
INFO  [org.wso2.carbon.integration.common.extensions.utils.ServerLogReader] - 	at java.util.concurrent.FutureTask.run(FutureTask.java:138)
INFO  [org.wso2.carbon.integration.common.extensions.utils.ServerLogReader] - 	at java.util.concurrent.ThreadPoolExecutor$Worker.runTask(ThreadPoolExecutor.java:886)
INFO  [org.wso2.carbon.integration.common.extensions.utils.ServerLogReader] - 	at java.util.concurrent.ThreadPoolExecutor$Worker.run(ThreadPoolExecutor.java:908)
INFO  [org.wso2.carbon.integration.common.extensions.utils.ServerLogReader] - 	at java.lang.Thread.run(Thread.java:662)
INFO  [org.wso2.carbon.integration.common.extensions.utils.ServerLogReader] - Caused by: org.apache.catalina.LifecycleException: A child container failed during stop
INFO  [org.wso2.carbon.integration.common.extensions.utils.ServerLogReader] - 	at org.apache.catalina.core.ContainerBase.stopInternal(ContainerBase.java:1186)
INFO  [org.wso2.carbon.integration.common.extensions.utils.ServerLogReader] - 	at org.apache.catalina.util.LifecycleBase.stop(LifecycleBase.java:232)
INFO  [org.wso2.carbon.integration.common.extensions.utils.ServerLogReader] - 	... 7 more
INFO  [org.wso2.carbon.integration.common.extensions.utils.ServerLogReader] - [2015-03-28 11:57:47,499] ERROR {org.wso2.carbon.tomcat.internal.ServerManager} -  Error while stopping tomcat
INFO  [org.wso2.carbon.integration.common.extensions.utils.ServerLogReader] - org.apache.catalina.LifecycleException: Failed to stop component [StandardServer[8005]]
INFO  [org.wso2.carbon.integration.common.extensions.utils.ServerLogReader] - 	at org.apache.catalina.util.LifecycleBase.stop(LifecycleBase.java:236)
INFO  [org.wso2.carbon.integration.common.extensions.utils.ServerLogReader] - 	at org.apache.catalina.startup.Tomcat.stop(Tomcat.java:351)
INFO  [org.wso2.carbon.integration.common.extensions.utils.ServerLogReader] - 	at org.wso2.carbon.tomcat.internal.ServerManager.stop(ServerManager.java:113)
INFO  [org.wso2.carbon.integration.common.extensions.utils.ServerLogReader] - 	at org.wso2.carbon.tomcat.internal.TomcatBundleActivator.stop(TomcatBundleActivator.java:65)
INFO  [org.wso2.carbon.integration.common.extensions.utils.ServerLogReader] - 	at org.eclipse.osgi.framework.internal.core.BundleContextImpl$2.run(BundleContextImpl.java:771)
INFO  [org.wso2.carbon.integration.common.extensions.utils.ServerLogReader] - 	at java.security.AccessController.doPrivileged(Native Method)
INFO  [org.wso2.carbon.integration.common.extensions.utils.ServerLogReader] - 	at org.eclipse.osgi.framework.internal.core.BundleContextImpl.stop(BundleContextImpl.java:764)
INFO  [org.wso2.carbon.integration.common.extensions.utils.ServerLogReader] - 	at org.eclipse.osgi.framework.internal.core.BundleHost.stopWorker(BundleHost.java:510)
INFO  [org.wso2.carbon.integration.common.extensions.utils.ServerLogReader] - 	at org.eclipse.osgi.framework.internal.core.AbstractBundle.suspend(AbstractBundle.java:566)
INFO  [org.wso2.carbon.integration.common.extensions.utils.ServerLogReader] - 	at org.eclipse.osgi.framework.internal.core.Framework.suspendBundle(Framework.java:1206)
INFO  [org.wso2.carbon.integration.common.extensions.utils.ServerLogReader] - 	at org.eclipse.osgi.framework.internal.core.StartLevelManager.decFWSL(StartLevelManager.java:592)
INFO  [org.wso2.carbon.integration.common.extensions.utils.ServerLogReader] - 	at org.eclipse.osgi.framework.internal.core.StartLevelManager.doSetStartLevel(StartLevelManager.java:257)
INFO  [org.wso2.carbon.integration.common.extensions.utils.ServerLogReader] - 	at org.eclipse.osgi.framework.internal.core.StartLevelManager.shutdown(StartLevelManager.java:215)
INFO  [org.wso2.carbon.integration.common.extensions.utils.ServerLogReader] - 	at org.eclipse.osgi.framework.internal.core.InternalSystemBundle.suspend(InternalSystemBundle.java:284)
INFO  [org.wso2.carbon.integration.common.extensions.utils.ServerLogReader] - 	at org.eclipse.osgi.framework.internal.core.Framework.shutdown(Framework.java:692)
INFO  [org.wso2.carbon.integration.common.extensions.utils.ServerLogReader] - 	at org.eclipse.osgi.framework.internal.core.Framework.close(Framework.java:600)
INFO  [org.wso2.carbon.integration.common.extensions.utils.ServerLogReader] - 	at org.eclipse.core.runtime.adaptor.EclipseStarter.shutdown(EclipseStarter.java:399)
INFO  [org.wso2.carbon.integration.common.extensions.utils.ServerLogReader] - 	at org.wso2.carbon.core.init.CarbonServerManager.shutdown(CarbonServerManager.java:849)
INFO  [org.wso2.carbon.integration.common.extensions.utils.ServerLogReader] - 	at org.wso2.carbon.server.admin.service.ServerAdmin$3.run(ServerAdmin.java:244)
INFO  [org.wso2.carbon.integration.common.extensions.utils.ServerLogReader] - Caused by: org.apache.catalina.LifecycleException: Failed to stop component [StandardService[Catalina]]
INFO  [org.wso2.carbon.integration.common.extensions.utils.ServerLogReader] - 	at org.apache.catalina.util.LifecycleBase.stop(LifecycleBase.java:236)
INFO  [org.wso2.carbon.integration.common.extensions.utils.ServerLogReader] - 	at org.apache.catalina.core.StandardServer.stopInternal(StandardServer.java:752)
INFO  [org.wso2.carbon.integration.common.extensions.utils.ServerLogReader] - 	at org.apache.catalina.util.LifecycleBase.stop(LifecycleBase.java:232)
INFO  [org.wso2.carbon.integration.common.extensions.utils.ServerLogReader] - 	... 18 more
INFO  [org.wso2.carbon.integration.common.extensions.utils.ServerLogReader] - Caused by: org.apache.catalina.LifecycleException: Failed to stop component [StandardEngine[Catalina]]
INFO  [org.wso2.carbon.integration.common.extensions.utils.ServerLogReader] - 	at org.apache.catalina.util.LifecycleBase.stop(LifecycleBase.java:236)
INFO  [org.wso2.carbon.integration.common.extensions.utils.ServerLogReader] - 	at org.apache.catalina.core.StandardService.stopInternal(StandardService.java:502)
INFO  [org.wso2.carbon.integration.common.extensions.utils.ServerLogReader] - 	at org.apache.catalina.util.LifecycleBase.stop(LifecycleBase.java:232)
INFO  [org.wso2.carbon.integration.common.extensions.utils.ServerLogReader] - 	... 20 more
INFO  [org.wso2.carbon.integration.common.extensions.utils.ServerLogReader] - Caused by: org.apache.catalina.LifecycleException: A child container failed during stop
INFO  [org.wso2.carbon.integration.common.extensions.utils.ServerLogReader] - 	at org.apache.catalina.core.ContainerBase.stopInternal(ContainerBase.java:1186)
INFO  [org.wso2.carbon.integration.common.extensions.utils.ServerLogReader] - 	at org.apache.catalina.util.LifecycleBase.stop(LifecycleBase.java:232)
INFO  [org.wso2.carbon.integration.common.extensions.utils.ServerLogReader] - 	... 22 more
INFO  [org.wso2.carbon.integration.common.extensions.utils.ServerLogReader] - [2015-03-28 11:57:47,501]  INFO {org.wso2.carbon.tomcat.ext.internal.CarbonTomcatServiceComponent} -  Stopping the carbon web-app registered under : /
INFO  [org.wso2.carbon.integration.common.extensions.utils.ServerLogReader] - [2015-03-28 11:57:47,559]  INFO {org.wso2.jaggery.scxml.Activator} -  Stopping org.wso2.jaggery.scxml with RealmService disabled
INFO  [org.wso2.carbon.integration.common.extensions.utils.ServerLogReader] - [2015-03-28 11:57:48,210]  INFO {org.wso2.carbon.core.init.CarbonServerManager} -  Shutdown complete
INFO  [org.wso2.carbon.integration.common.extensions.utils.ServerLogReader] - [2015-03-28 11:57:48,210]  INFO {org.wso2.carbon.core.init.CarbonServerManager} -  Halting JVM
INFO  [org.wso2.carbon.integration.common.extensions.carbonserver.CarbonServerManager] - Server stopped successfully...
Tests run: 35, Failures: 0, Errors: 0, Skipped: 0, Time elapsed: 72.154 sec

Results :

Tests run: 35, Failures: 0, Errors: 0, Skipped: 0

[JENKINS] Recording test results
log4j:WARN No appenders could be found for logger (org.apache.commons.beanutils.converters.BooleanConverter).
log4j:WARN Please initialize the log4j system properly.
[INFO] 
[INFO] --- maven-jar-plugin:2.5:jar (default-jar) @ org.wso2.es.integration.test ---
[INFO] Building jar: /build/jenworker/workspace/product-es/modules/integration/tests-integration/tests/target/org.wso2.es.integration.test-2.0.0-SNAPSHOT.jar
[INFO] 
[INFO] --- maven-jar-plugin:2.5:test-jar (default) @ org.wso2.es.integration.test ---
[INFO] Building jar: /build/jenworker/workspace/product-es/modules/integration/tests-integration/tests/target/org.wso2.es.integration.test-2.0.0-SNAPSHOT-tests.jar
[INFO] 
[INFO] --- maven-install-plugin:2.5.2:install (default-install) @ org.wso2.es.integration.test ---
[INFO] Installing /build/jenworker/workspace/product-es/modules/integration/tests-integration/tests/target/org.wso2.es.integration.test-2.0.0-SNAPSHOT.jar to /build/jenworker/workspace/product-es/.repository/org/wso2/es/org.wso2.es.integration.test/2.0.0-SNAPSHOT/org.wso2.es.integration.test-2.0.0-SNAPSHOT.jar
[INFO] Installing /build/jenworker/workspace/product-es/modules/integration/tests-integration/tests/pom.xml to /build/jenworker/workspace/product-es/.repository/org/wso2/es/org.wso2.es.integration.test/2.0.0-SNAPSHOT/org.wso2.es.integration.test-2.0.0-SNAPSHOT.pom
[INFO] Installing /build/jenworker/workspace/product-es/modules/integration/tests-integration/tests/target/org.wso2.es.integration.test-2.0.0-SNAPSHOT-tests.jar to /build/jenworker/workspace/product-es/.repository/org/wso2/es/org.wso2.es.integration.test/2.0.0-SNAPSHOT/org.wso2.es.integration.test-2.0.0-SNAPSHOT-tests.jar
[INFO]                                                                         
[INFO] ------------------------------------------------------------------------
[INFO] Building WSO2 ES UI Integration Test 2.0.0-SNAPSHOT
[INFO] ------------------------------------------------------------------------
[INFO] 
[INFO] --- maven-clean-plugin:2.6.1:clean (default-clean) @ es-ui-integration-tests ---
[INFO] Deleting /build/jenworker/workspace/product-es/modules/integration/tests-ui-integration/target
[INFO] 
[INFO] --- maven-remote-resources-plugin:1.5:process (default) @ es-ui-integration-tests ---
[INFO] 
[INFO] --- maven-install-plugin:2.5.2:install (default-install) @ es-ui-integration-tests ---
[INFO] Installing /build/jenworker/workspace/product-es/modules/integration/tests-ui-integration/pom.xml to /build/jenworker/workspace/product-es/.repository/org/wso2/es/es-ui-integration-tests/2.0.0-SNAPSHOT/es-ui-integration-tests-2.0.0-SNAPSHOT.pom
[INFO]                                                                         
[INFO] ------------------------------------------------------------------------
[INFO] Building ui-test-utils 2.0.0-SNAPSHOT
[INFO] ------------------------------------------------------------------------
[INFO] 
[INFO] --- maven-clean-plugin:2.6.1:clean (default-clean) @ ui-test-utils ---
[INFO] Deleting /build/jenworker/workspace/product-es/modules/integration/tests-ui-integration/ui-test-utils/target
[INFO] 
[INFO] --- maven-remote-resources-plugin:1.5:process (default) @ ui-test-utils ---
Downloading: http://maven.wso2.org/nexus/content/groups/wso2-public/com/saucelabs/selenium/sauce-ondemand-driver/2.6/sauce-ondemand-driver-2.6.pom
Downloading: http://maven.wso2.org/nexus/content/repositories/releases/com/saucelabs/selenium/sauce-ondemand-driver/2.6/sauce-ondemand-driver-2.6.pom
Downloading: http://repo.maven.apache.org/maven2/com/saucelabs/selenium/sauce-ondemand-driver/2.6/sauce-ondemand-driver-2.6.pom
Downloading: http://maven.wso2.org/nexus/content/groups/wso2-public/com/saucelabs/selenium/selenium-client-factory/2.6/selenium-client-factory-2.6.pom
Downloading: http://maven.wso2.org/nexus/content/repositories/releases/com/saucelabs/selenium/selenium-client-factory/2.6/selenium-client-factory-2.6.pom
Downloading: http://repo.maven.apache.org/maven2/com/saucelabs/selenium/selenium-client-factory/2.6/selenium-client-factory-2.6.pom
[INFO] 
[INFO] --- maven-resources-plugin:2.5:resources (default-resources) @ ui-test-utils ---
[debug] execute contextualize
[INFO] Using 'UTF-8' encoding to copy filtered resources.
[INFO] skip non existing resourceDirectory /build/jenworker/workspace/product-es/modules/integration/tests-ui-integration/ui-test-utils/src/main/resources
[INFO] Copying 3 resources
[INFO] 
[INFO] --- maven-compiler-plugin:3.1:compile (default-compile) @ ui-test-utils ---
[INFO] Changes detected - recompiling the module!
[INFO] Compiling 4 source files to /build/jenworker/workspace/product-es/modules/integration/tests-ui-integration/ui-test-utils/target/classes
[INFO] 
[INFO] --- maven-resources-plugin:2.5:testResources (default-testResources) @ ui-test-utils ---
[debug] execute contextualize
[INFO] Using 'UTF-8' encoding to copy filtered resources.
[INFO] skip non existing resourceDirectory /build/jenworker/workspace/product-es/modules/integration/tests-ui-integration/ui-test-utils/src/test/resources
[INFO] Copying 3 resources
[INFO] 
[INFO] --- maven-compiler-plugin:3.1:testCompile (default-testCompile) @ ui-test-utils ---
[INFO] No sources to compile
[INFO] 
[INFO] --- maven-surefire-plugin:2.12:test (default-test) @ ui-test-utils ---
[INFO] Surefire report directory: /build/jenworker/workspace/product-es/modules/integration/tests-ui-integration/ui-test-utils/target/surefire-reports

-------------------------------------------------------
 T E S T S
-------------------------------------------------------

Results :

Tests run: 0, Failures: 0, Errors: 0, Skipped: 0

[JENKINS] Recording test results
[INFO] 
[INFO] --- maven-jar-plugin:2.5:jar (default-jar) @ ui-test-utils ---
[INFO] Building jar: /build/jenworker/workspace/product-es/modules/integration/tests-ui-integration/ui-test-utils/target/ui-test-utils-2.0.0-SNAPSHOT.jar
[INFO] 
[INFO] --- maven-install-plugin:2.5.2:install (default-install) @ ui-test-utils ---
[INFO] Installing /build/jenworker/workspace/product-es/modules/integration/tests-ui-integration/ui-test-utils/target/ui-test-utils-2.0.0-SNAPSHOT.jar to /build/jenworker/workspace/product-es/.repository/org/wso2/es/ui-test-utils/2.0.0-SNAPSHOT/ui-test-utils-2.0.0-SNAPSHOT.jar
[INFO] Installing /build/jenworker/workspace/product-es/modules/integration/tests-ui-integration/ui-test-utils/pom.xml to /build/jenworker/workspace/product-es/.repository/org/wso2/es/ui-test-utils/2.0.0-SNAPSHOT/ui-test-utils-2.0.0-SNAPSHOT.pom
[INFO]                                                                         
[INFO] ------------------------------------------------------------------------
[INFO] Building WSO2 ES UI Integration Test - Extension 2.0.0-SNAPSHOT
[INFO] ------------------------------------------------------------------------
[INFO] 
[INFO] --- maven-clean-plugin:2.6.1:clean (default-clean) @ tests-ui-extension ---
[INFO] Deleting /build/jenworker/workspace/product-es/modules/integration/tests-ui-integration/tests-ui-extension/target
[INFO] Deleting /build/jenworker/workspace/product-es/modules/integration/tests-ui-integration/tests-ui-extension/src/test/resources/client/modules (includes = [**/*.mar], excludes = [])
[INFO] 
[INFO] --- maven-remote-resources-plugin:1.5:process (default) @ tests-ui-extension ---
[INFO] 
[INFO] --- maven-resources-plugin:2.5:resources (default-resources) @ tests-ui-extension ---
[debug] execute contextualize
[INFO] Using 'UTF-8' encoding to copy filtered resources.
[INFO] skip non existing resourceDirectory /build/jenworker/workspace/product-es/modules/integration/tests-ui-integration/tests-ui-extension/src/main/resources
[INFO] Copying 3 resources
[INFO] 
[INFO] --- maven-compiler-plugin:3.1:compile (default-compile) @ tests-ui-extension ---
[INFO] No sources to compile
[INFO] 
[INFO] --- maven-dependency-plugin:2.8:copy-dependencies (copy-emma-dependencies) @ tests-ui-extension ---
[INFO] Copying emma-2.1.5320.jar to /build/jenworker/workspace/product-es/modules/integration/tests-ui-integration/tests-ui-extension/target/emma/emma-2.1.5320.jar
[INFO] 
[INFO] --- maven-dependency-plugin:2.8:copy-dependencies (copy-jar-dependencies) @ tests-ui-extension ---
[INFO] 
[INFO] --- maven-dependency-plugin:2.8:copy-dependencies (copy-secVerifier) @ tests-ui-extension ---
[INFO] 
[INFO] --- maven-dependency-plugin:2.8:unpack (unpack-mar-jks) @ tests-ui-extension ---
[INFO] Configured Artifact: org.wso2.es:wso2es:2.0.0-SNAPSHOT:zip
[INFO] Unpacking /build/jenworker/workspace/product-es/modules/distribution/target/wso2es-2.0.0-SNAPSHOT.zip to /build/jenworker/workspace/product-es/modules/integration/tests-ui-integration/tests-ui-extension/target/tobeCopied with includes "**/*.jks,**/*.mar" and excludes ""
[INFO] 
[INFO] --- maven-resources-plugin:2.5:copy-resources (copy-resources-jks) @ tests-ui-extension ---
[debug] execute contextualize
[INFO] Using 'UTF-8' encoding to copy filtered resources.
[INFO] Copying 2 resources
[INFO] 
[INFO] --- maven-resources-plugin:2.5:copy-resources (copy-resources-mar) @ tests-ui-extension ---
[debug] execute contextualize
[INFO] Using 'UTF-8' encoding to copy filtered resources.
[INFO] Copying 1 resource
[INFO] 
[INFO] --- maven-resources-plugin:2.5:testResources (default-testResources) @ tests-ui-extension ---
[debug] execute contextualize
[INFO] Using 'UTF-8' encoding to copy filtered resources.
[INFO] Copying 28 resources
[INFO] Copying 3 resources
[INFO] 
[INFO] --- maven-compiler-plugin:3.1:testCompile (default-testCompile) @ tests-ui-extension ---
[INFO] Changes detected - recompiling the module!
[INFO] Compiling 13 source files to /build/jenworker/workspace/product-es/modules/integration/tests-ui-integration/tests-ui-extension/target/test-classes
[INFO] 
[INFO] --- maven-surefire-plugin:2.12:test (default-test) @ tests-ui-extension ---
[INFO] Tests are skipped.
[INFO] 
[INFO] --- maven-jar-plugin:2.5:jar (default-jar) @ tests-ui-extension ---
[INFO] Building jar: /build/jenworker/workspace/product-es/modules/integration/tests-ui-integration/tests-ui-extension/target/tests-ui-extension-2.0.0-SNAPSHOT.jar
[INFO] 
[INFO] --- maven-jar-plugin:2.5:test-jar (default) @ tests-ui-extension ---
[INFO] Building jar: /build/jenworker/workspace/product-es/modules/integration/tests-ui-integration/tests-ui-extension/target/tests-ui-extension-2.0.0-SNAPSHOT-tests.jar
[INFO] 
[INFO] --- maven-install-plugin:2.5.2:install (default-install) @ tests-ui-extension ---
[INFO] Installing /build/jenworker/workspace/product-es/modules/integration/tests-ui-integration/tests-ui-extension/target/tests-ui-extension-2.0.0-SNAPSHOT.jar to /build/jenworker/workspace/product-es/.repository/org/wso2/es/tests-ui-extension/2.0.0-SNAPSHOT/tests-ui-extension-2.0.0-SNAPSHOT.jar
[INFO] Installing /build/jenworker/workspace/product-es/modules/integration/tests-ui-integration/tests-ui-extension/pom.xml to /build/jenworker/workspace/product-es/.repository/org/wso2/es/tests-ui-extension/2.0.0-SNAPSHOT/tests-ui-extension-2.0.0-SNAPSHOT.pom
[INFO] Installing /build/jenworker/workspace/product-es/modules/integration/tests-ui-integration/tests-ui-extension/target/tests-ui-extension-2.0.0-SNAPSHOT-tests.jar to /build/jenworker/workspace/product-es/.repository/org/wso2/es/tests-ui-extension/2.0.0-SNAPSHOT/tests-ui-extension-2.0.0-SNAPSHOT-tests.jar
[INFO]                                                                         
[INFO] ------------------------------------------------------------------------
[INFO] Building WSO2 ES UI Integration Test - Default Pages 2.0.0-SNAPSHOT
[INFO] ------------------------------------------------------------------------
[INFO] 
[INFO] --- maven-clean-plugin:2.6.1:clean (default-clean) @ test-ui ---
[INFO] Deleting /build/jenworker/workspace/product-es/modules/integration/tests-ui-integration/tests-ui/target
[INFO] Deleting /build/jenworker/workspace/product-es/modules/integration/tests-ui-integration/tests-ui/src/test/resources/client/modules (includes = [**/*.mar], excludes = [])
[INFO] 
[INFO] --- maven-remote-resources-plugin:1.5:process (default) @ test-ui ---
[INFO] 
[INFO] --- maven-resources-plugin:2.5:resources (default-resources) @ test-ui ---
[debug] execute contextualize
[INFO] Using 'UTF-8' encoding to copy filtered resources.
[INFO] skip non existing resourceDirectory /build/jenworker/workspace/product-es/modules/integration/tests-ui-integration/tests-ui/src/main/resources
[INFO] Copying 3 resources
[INFO] 
[INFO] --- maven-compiler-plugin:3.1:compile (default-compile) @ test-ui ---
[INFO] No sources to compile
[INFO] 
[INFO] --- maven-dependency-plugin:2.8:copy-dependencies (copy-emma-dependencies) @ test-ui ---
[INFO] Copying emma-2.1.5320.jar to /build/jenworker/workspace/product-es/modules/integration/tests-ui-integration/tests-ui/target/emma/emma-2.1.5320.jar
[INFO] 
[INFO] --- maven-dependency-plugin:2.8:copy-dependencies (copy-jar-dependencies) @ test-ui ---
[INFO] 
[INFO] --- maven-dependency-plugin:2.8:copy-dependencies (copy-secVerifier) @ test-ui ---
[INFO] 
[INFO] --- maven-dependency-plugin:2.8:unpack (unpack-mar-jks) @ test-ui ---
[INFO] Configured Artifact: org.wso2.es:wso2es:2.0.0-SNAPSHOT:zip
[INFO] Unpacking /build/jenworker/workspace/product-es/modules/distribution/target/wso2es-2.0.0-SNAPSHOT.zip to /build/jenworker/workspace/product-es/modules/integration/tests-ui-integration/tests-ui/target/tobeCopied with includes "**/*.jks,**/*.mar" and excludes ""
[INFO] 
[INFO] --- maven-resources-plugin:2.5:copy-resources (copy-resources-jks) @ test-ui ---
[debug] execute contextualize
[INFO] Using 'UTF-8' encoding to copy filtered resources.
[INFO] Copying 2 resources
[INFO] 
[INFO] --- maven-resources-plugin:2.5:copy-resources (copy-resources-mar) @ test-ui ---
[debug] execute contextualize
[INFO] Using 'UTF-8' encoding to copy filtered resources.
[INFO] Copying 1 resource
[INFO] 
[INFO] --- maven-resources-plugin:2.5:testResources (default-testResources) @ test-ui ---
[debug] execute contextualize
[INFO] Using 'UTF-8' encoding to copy filtered resources.
[INFO] Copying 31 resources
[INFO] Copying 3 resources
[INFO] 
[INFO] --- maven-compiler-plugin:3.1:testCompile (default-testCompile) @ test-ui ---
[INFO] Changes detected - recompiling the module!
[INFO] Compiling 29 source files to /build/jenworker/workspace/product-es/modules/integration/tests-ui-integration/tests-ui/target/test-classes
[INFO] 
[INFO] --- maven-surefire-plugin:2.12:test (default-test) @ test-ui ---
[INFO] Tests are skipped.
[INFO] 
[INFO] --- maven-jar-plugin:2.5:jar (default-jar) @ test-ui ---
[INFO] Building jar: /build/jenworker/workspace/product-es/modules/integration/tests-ui-integration/tests-ui/target/test-ui-2.0.0-SNAPSHOT.jar
[INFO] 
[INFO] --- maven-jar-plugin:2.5:test-jar (default) @ test-ui ---
[INFO] Building jar: /build/jenworker/workspace/product-es/modules/integration/tests-ui-integration/tests-ui/target/test-ui-2.0.0-SNAPSHOT-tests.jar
[INFO] 
[INFO] --- maven-install-plugin:2.5.2:install (default-install) @ test-ui ---
[INFO] Installing /build/jenworker/workspace/product-es/modules/integration/tests-ui-integration/tests-ui/target/test-ui-2.0.0-SNAPSHOT.jar to /build/jenworker/workspace/product-es/.repository/org/wso2/es/test-ui/2.0.0-SNAPSHOT/test-ui-2.0.0-SNAPSHOT.jar
[INFO] Installing /build/jenworker/workspace/product-es/modules/integration/tests-ui-integration/tests-ui/pom.xml to /build/jenworker/workspace/product-es/.repository/org/wso2/es/test-ui/2.0.0-SNAPSHOT/test-ui-2.0.0-SNAPSHOT.pom
[INFO] Installing /build/jenworker/workspace/product-es/modules/integration/tests-ui-integration/tests-ui/target/test-ui-2.0.0-SNAPSHOT-tests.jar to /build/jenworker/workspace/product-es/.repository/org/wso2/es/test-ui/2.0.0-SNAPSHOT/test-ui-2.0.0-SNAPSHOT-tests.jar
[INFO]                                                                         
[INFO] ------------------------------------------------------------------------
[INFO] Building es-platform-tests 2.0.0-SNAPSHOT
[INFO] ------------------------------------------------------------------------
[INFO] 
[INFO] --- maven-clean-plugin:2.6.1:clean (default-clean) @ es-platform-tests ---
[INFO] Deleting /build/jenworker/workspace/product-es/modules/integration/tests-platform/target
[INFO] 
[INFO] --- maven-remote-resources-plugin:1.5:process (default) @ es-platform-tests ---
[INFO] 
[INFO] --- maven-install-plugin:2.5.2:install (default-install) @ es-platform-tests ---
[INFO] Installing /build/jenworker/workspace/product-es/modules/integration/tests-platform/pom.xml to /build/jenworker/workspace/product-es/.repository/org/wso2/es/es-platform-tests/2.0.0-SNAPSHOT/es-platform-tests-2.0.0-SNAPSHOT.pom
[INFO]                                                                         
[INFO] ------------------------------------------------------------------------
[INFO] Building org.wso2.store.platform.tests 2.0.0-SNAPSHOT
[INFO] ------------------------------------------------------------------------
[INFO] 
[INFO] --- maven-clean-plugin:2.6.1:clean (default-clean) @ org.wso2.store.platform.tests ---
[INFO] Deleting /build/jenworker/workspace/product-es/modules/integration/tests-platform/tests/target
[INFO] Deleting /build/jenworker/workspace/product-es/modules/integration/tests-platform/tests/src/test/resources/client/modules (includes = [**/*.mar], excludes = [])
[INFO] 
[INFO] --- maven-remote-resources-plugin:1.5:process (default) @ org.wso2.store.platform.tests ---
[INFO] 
[INFO] --- maven-resources-plugin:2.5:resources (default-resources) @ org.wso2.store.platform.tests ---
[debug] execute contextualize
[INFO] Using 'UTF-8' encoding to copy filtered resources.
[INFO] skip non existing resourceDirectory /build/jenworker/workspace/product-es/modules/integration/tests-platform/tests/src/main/resources
[INFO] Copying 3 resources
[INFO] 
[INFO] --- maven-compiler-plugin:3.1:compile (default-compile) @ org.wso2.store.platform.tests ---
[INFO] No sources to compile
[INFO] 
[INFO] --- maven-dependency-plugin:2.8:copy-dependencies (copy-emma-dependencies) @ org.wso2.store.platform.tests ---
[INFO] Copying emma-2.1.5320.jar to /build/jenworker/workspace/product-es/modules/integration/tests-platform/tests/target/emma/emma-2.1.5320.jar
[INFO] 
[INFO] --- maven-dependency-plugin:2.8:copy-dependencies (copy-jar-dependencies) @ org.wso2.store.platform.tests ---
[INFO] 
[INFO] --- maven-dependency-plugin:2.8:copy-dependencies (copy-secVerifier) @ org.wso2.store.platform.tests ---
[INFO] 
[INFO] --- maven-dependency-plugin:2.8:unpack (unpack-mar-jks) @ org.wso2.store.platform.tests ---
[INFO] Configured Artifact: org.wso2.es:wso2es:2.0.0-SNAPSHOT:zip
[INFO] Unpacking /build/jenworker/workspace/product-es/modules/distribution/target/wso2es-2.0.0-SNAPSHOT.zip to /build/jenworker/workspace/product-es/modules/integration/tests-platform/tests/target/tobeCopied with includes "**/*.jks,**/*.mar" and excludes ""
[INFO] 
[INFO] --- maven-resources-plugin:2.5:copy-resources (copy-resources-jks) @ org.wso2.store.platform.tests ---
[debug] execute contextualize
[INFO] Using 'UTF-8' encoding to copy filtered resources.
[INFO] Copying 2 resources
[INFO] 
[INFO] --- maven-resources-plugin:2.5:copy-resources (copy-resources-mar) @ org.wso2.store.platform.tests ---
[debug] execute contextualize
[INFO] Using 'UTF-8' encoding to copy filtered resources.
[INFO] Copying 1 resource
[INFO] 
[INFO] --- maven-resources-plugin:2.5:testResources (default-testResources) @ org.wso2.store.platform.tests ---
[debug] execute contextualize
[INFO] Using 'UTF-8' encoding to copy filtered resources.
[INFO] Copying 31 resources
[INFO] Copying 3 resources
[INFO] 
[INFO] --- maven-compiler-plugin:3.1:testCompile (default-testCompile) @ org.wso2.store.platform.tests ---
[INFO] Changes detected - recompiling the module!
[INFO] Compiling 1 source file to /build/jenworker/workspace/product-es/modules/integration/tests-platform/tests/target/test-classes
[INFO] 
[INFO] --- maven-surefire-plugin:2.12:test (default-test) @ org.wso2.store.platform.tests ---
[INFO] Surefire report directory: /build/jenworker/workspace/product-es/modules/integration/tests-platform/tests/target/surefire-reports

-------------------------------------------------------
 T E S T S
-------------------------------------------------------
Running TestSuite
INFO  [org.wso2.carbon.automation.engine.testlisteners.TestExecutionListener] - Inside Test Execution Listener - On Execution
INFO  [org.wso2.carbon.automation.engine.testlisteners.TestSuiteListener] - Inside Test Suite Listener - On Start
INFO  [org.wso2.carbon.automation.engine.testlisteners.TestSuiteListener] - Inside Test Suite Listener - On Finish
INFO  [org.wso2.carbon.automation.engine.testlisteners.TestExecutionListener] - Inside Test Execution Listener - On Finish
Tests run: 0, Failures: 0, Errors: 0, Skipped: 0, Time elapsed: 0.596 sec

Results :

Tests run: 0, Failures: 0, Errors: 0, Skipped: 0

[JENKINS] Recording test results
[INFO] 
[INFO] --- maven-jar-plugin:2.5:jar (default-jar) @ org.wso2.store.platform.tests ---
[INFO] Building jar: /build/jenworker/workspace/product-es/modules/integration/tests-platform/tests/target/org.wso2.store.platform.tests-2.0.0-SNAPSHOT.jar
[INFO] 
[INFO] --- maven-jar-plugin:2.5:test-jar (default) @ org.wso2.store.platform.tests ---
[INFO] Building jar: /build/jenworker/workspace/product-es/modules/integration/tests-platform/tests/target/org.wso2.store.platform.tests-2.0.0-SNAPSHOT-tests.jar
[INFO] 
[INFO] --- maven-install-plugin:2.5.2:install (default-install) @ org.wso2.store.platform.tests ---
[INFO] Installing /build/jenworker/workspace/product-es/modules/integration/tests-platform/tests/target/org.wso2.store.platform.tests-2.0.0-SNAPSHOT.jar to /build/jenworker/workspace/product-es/.repository/org/wso2/es/org.wso2.store.platform.tests/2.0.0-SNAPSHOT/org.wso2.store.platform.tests-2.0.0-SNAPSHOT.jar
[INFO] Installing /build/jenworker/workspace/product-es/modules/integration/tests-platform/tests/pom.xml to /build/jenworker/workspace/product-es/.repository/org/wso2/es/org.wso2.store.platform.tests/2.0.0-SNAPSHOT/org.wso2.store.platform.tests-2.0.0-SNAPSHOT.pom
[INFO] Installing /build/jenworker/workspace/product-es/modules/integration/tests-platform/tests/target/org.wso2.store.platform.tests-2.0.0-SNAPSHOT-tests.jar to /build/jenworker/workspace/product-es/.repository/org/wso2/es/org.wso2.store.platform.tests/2.0.0-SNAPSHOT/org.wso2.store.platform.tests-2.0.0-SNAPSHOT-tests.jar
[INFO] ------------------------------------------------------------------------
[INFO] Reactor Summary:
[INFO] 
[INFO] WSO2 Enterprise Store ............................. SUCCESS [0.695s]
[INFO] WSO2 Enterprise Store - UI styles ................. SUCCESS [1.353s]
[INFO] WSO2 Enterprise Store Features .................... SUCCESS [0.037s]
[INFO] WSO2 Enterprise Store Styles Feature .............. SUCCESS [0.309s]
[INFO] wso2es-profile-gen ................................ SUCCESS [58.559s]
[INFO] WSO2 Enterprise Store - Distribution .............. SUCCESS [44.127s]
[INFO] wso2es-integration ................................ SUCCESS [0.034s]
[INFO] WSO2 ES Integration Test Common ................... SUCCESS [0.030s]
[INFO] admin-clients ..................................... SUCCESS [1.815s]
[INFO] ES Integration Test UI Pages ...................... SUCCESS [0.788s]
[INFO] integration-test-utils ............................ SUCCESS [22.194s]
[INFO] WSO2 ES Integration Test .......................... SUCCESS [0.096s]
[INFO] org.wso2.es.integration.test ...................... SUCCESS [1:16.464s]
[INFO] WSO2 ES UI Integration Test ....................... SUCCESS [0.030s]
[INFO] ui-test-utils ..................................... SUCCESS [12.424s]
[INFO] WSO2 ES UI Integration Test - Extension ........... SUCCESS [1.901s]
[INFO] WSO2 ES UI Integration Test - Default Pages ....... SUCCESS [1.938s]
[INFO] es-platform-tests ................................. SUCCESS [0.029s]
[INFO] org.wso2.store.platform.tests ..................... SUCCESS [2.577s]
[INFO] ------------------------------------------------------------------------
[INFO] BUILD SUCCESS
[INFO] ------------------------------------------------------------------------
[INFO] Total time: 3:53.114s
[INFO] Finished at: Sat Mar 28 11:58:10 UTC 2015
[INFO] Final Memory: 72M/355M
[INFO] ------------------------------------------------------------------------
Waiting for Jenkins to finish collecting data
[JENKINS] Archiving /build/jenworker/workspace/product-es/modules/integration/tests-integration/tests/pom.xml to org.wso2.es/org.wso2.es.integration.test/2.0.0-SNAPSHOT/org.wso2.es.integration.test-2.0.0-SNAPSHOT.pom
[JENKINS] Archiving /build/jenworker/workspace/product-es/modules/integration/tests-integration/tests/target/org.wso2.es.integration.test-2.0.0-SNAPSHOT.jar to org.wso2.es/org.wso2.es.integration.test/2.0.0-SNAPSHOT/org.wso2.es.integration.test-2.0.0-SNAPSHOT.jar
[JENKINS] Archiving /build/jenworker/workspace/product-es/modules/integration/tests-integration/tests/target/org.wso2.es.integration.test-2.0.0-SNAPSHOT-tests.jar to org.wso2.es/org.wso2.es.integration.test/2.0.0-SNAPSHOT/org.wso2.es.integration.test-2.0.0-SNAPSHOT-tests.jar
[JENKINS] Archiving /build/jenworker/workspace/product-es/modules/integration/tests-ui-integration/tests-ui-extension/pom.xml to org.wso2.es/tests-ui-extension/2.0.0-SNAPSHOT/tests-ui-extension-2.0.0-SNAPSHOT.pom
[JENKINS] Archiving /build/jenworker/workspace/product-es/modules/integration/tests-ui-integration/tests-ui-extension/target/tests-ui-extension-2.0.0-SNAPSHOT.jar to org.wso2.es/tests-ui-extension/2.0.0-SNAPSHOT/tests-ui-extension-2.0.0-SNAPSHOT.jar
[JENKINS] Archiving /build/jenworker/workspace/product-es/modules/integration/tests-ui-integration/tests-ui-extension/target/tests-ui-extension-2.0.0-SNAPSHOT-tests.jar to org.wso2.es/tests-ui-extension/2.0.0-SNAPSHOT/tests-ui-extension-2.0.0-SNAPSHOT-tests.jar
[JENKINS] Archiving /build/jenworker/workspace/product-es/modules/integration/tests-ui-integration/pom.xml to org.wso2.es/es-ui-integration-tests/2.0.0-SNAPSHOT/es-ui-integration-tests-2.0.0-SNAPSHOT.pom
[JENKINS] Archiving /build/jenworker/workspace/product-es/modules/integration/tests-ui-integration/tests-ui/pom.xml to org.wso2.es/test-ui/2.0.0-SNAPSHOT/test-ui-2.0.0-SNAPSHOT.pom
[JENKINS] Archiving /build/jenworker/workspace/product-es/modules/integration/tests-ui-integration/tests-ui/target/test-ui-2.0.0-SNAPSHOT.jar to org.wso2.es/test-ui/2.0.0-SNAPSHOT/test-ui-2.0.0-SNAPSHOT.jar
[JENKINS] Archiving /build/jenworker/workspace/product-es/modules/integration/tests-ui-integration/tests-ui/target/test-ui-2.0.0-SNAPSHOT-tests.jar to org.wso2.es/test-ui/2.0.0-SNAPSHOT/test-ui-2.0.0-SNAPSHOT-tests.jar
[JENKINS] Archiving /build/jenworker/workspace/product-es/modules/components/store-admin/pom.xml to org.wso2.es/org.wso2.store.admin.styles/2.0.0-SNAPSHOT/org.wso2.store.admin.styles-2.0.0-SNAPSHOT.pom
[JENKINS] Archiving /build/jenworker/workspace/product-es/modules/components/store-admin/target/org.wso2.store.admin.styles-2.0.0-SNAPSHOT.jar to org.wso2.es/org.wso2.store.admin.styles/2.0.0-SNAPSHOT/org.wso2.store.admin.styles-2.0.0-SNAPSHOT.jar
[JENKINS] Archiving /build/jenworker/workspace/product-es/pom.xml to org.wso2.es/wso2es-parent/2.0.0-SNAPSHOT/wso2es-parent-2.0.0-SNAPSHOT.pom
[JENKINS] Archiving /build/jenworker/workspace/product-es/modules/integration/tests-platform/tests/pom.xml to org.wso2.es/org.wso2.store.platform.tests/2.0.0-SNAPSHOT/org.wso2.store.platform.tests-2.0.0-SNAPSHOT.pom
[JENKINS] Archiving /build/jenworker/workspace/product-es/modules/integration/tests-platform/tests/target/org.wso2.store.platform.tests-2.0.0-SNAPSHOT.jar to org.wso2.es/org.wso2.store.platform.tests/2.0.0-SNAPSHOT/org.wso2.store.platform.tests-2.0.0-SNAPSHOT.jar
[JENKINS] Archiving /build/jenworker/workspace/product-es/modules/integration/tests-platform/tests/target/org.wso2.store.platform.tests-2.0.0-SNAPSHOT-tests.jar to org.wso2.es/org.wso2.store.platform.tests/2.0.0-SNAPSHOT/org.wso2.store.platform.tests-2.0.0-SNAPSHOT-tests.jar
[JENKINS] Archiving /build/jenworker/workspace/product-es/modules/integration/pom.xml to org.wso2.es/wso2es-integration/2.0.0-SNAPSHOT/wso2es-integration-2.0.0-SNAPSHOT.pom
[JENKINS] Archiving /build/jenworker/workspace/product-es/modules/integration/tests-integration/pom.xml to org.wso2.es/es-integration-tests/2.0.0-SNAPSHOT/es-integration-tests-2.0.0-SNAPSHOT.pom
[JENKINS] Archiving /build/jenworker/workspace/product-es/modules/p2-profile-gen/pom.xml to org.wso2.es/wso2es-profile-gen/2.0.0-SNAPSHOT/wso2es-profile-gen-2.0.0-SNAPSHOT.pom
[JENKINS] Archiving /build/jenworker/workspace/product-es/modules/features/org.wso2.store.styles.feature/target/org.wso2.store.styles.feature-2.0.0-SNAPSHOT.zip to org.wso2.es/org.wso2.store.styles.feature/2.0.0-SNAPSHOT/org.wso2.store.styles.feature-2.0.0-SNAPSHOT.pom
[JENKINS] Archiving /build/jenworker/workspace/product-es/modules/features/org.wso2.store.styles.feature/target/org.wso2.store.styles.feature-2.0.0-SNAPSHOT.zip to org.wso2.es/org.wso2.store.styles.feature/2.0.0-SNAPSHOT/org.wso2.store.styles.feature-2.0.0-SNAPSHOT.zip
[JENKINS] Archiving /build/jenworker/workspace/product-es/modules/integration/tests-ui-integration/ui-test-utils/pom.xml to org.wso2.es/ui-test-utils/2.0.0-SNAPSHOT/ui-test-utils-2.0.0-SNAPSHOT.pom
[JENKINS] Archiving /build/jenworker/workspace/product-es/modules/integration/tests-ui-integration/ui-test-utils/target/ui-test-utils-2.0.0-SNAPSHOT.jar to org.wso2.es/ui-test-utils/2.0.0-SNAPSHOT/ui-test-utils-2.0.0-SNAPSHOT.jar
[JENKINS] Archiving /build/jenworker/workspace/product-es/modules/features/pom.xml to org.wso2.es/wso2es-features/2.0.0-SNAPSHOT/wso2es-features-2.0.0-SNAPSHOT.pom
[JENKINS] Archiving /build/jenworker/workspace/product-es/modules/integration/tests-common/admin-clients/pom.xml to org.wso2.es/org.wso2.es.integration.common.clients/2.0.0-SNAPSHOT/org.wso2.es.integration.common.clients-2.0.0-SNAPSHOT.pom
[JENKINS] Archiving /build/jenworker/workspace/product-es/modules/integration/tests-common/admin-clients/target/org.wso2.es.integration.common.clients-2.0.0-SNAPSHOT.jar to org.wso2.es/org.wso2.es.integration.common.clients/2.0.0-SNAPSHOT/org.wso2.es.integration.common.clients-2.0.0-SNAPSHOT.jar
[JENKINS] Archiving /build/jenworker/workspace/product-es/modules/distribution/pom.xml to org.wso2.es/wso2es/2.0.0-SNAPSHOT/wso2es-2.0.0-SNAPSHOT.pom
[JENKINS] Archiving /build/jenworker/workspace/product-es/modules/distribution/target/wso2es-2.0.0-SNAPSHOT.zip to org.wso2.es/wso2es/2.0.0-SNAPSHOT/wso2es-2.0.0-SNAPSHOT.zip
[JENKINS] Archiving /build/jenworker/workspace/product-es/modules/integration/tests-common/ui-pages/pom.xml to org.wso2.es/ui-pages/2.0.0-SNAPSHOT/ui-pages-2.0.0-SNAPSHOT.pom
[JENKINS] Archiving /build/jenworker/workspace/product-es/modules/integration/tests-common/ui-pages/target/ui-pages-2.0.0-SNAPSHOT.jar to org.wso2.es/ui-pages/2.0.0-SNAPSHOT/ui-pages-2.0.0-SNAPSHOT.jar
[JENKINS] Archiving /build/jenworker/workspace/product-es/modules/integration/tests-common/integration-test-utils/pom.xml to org.wso2.es/org.wso2.es.integration.common.utils/2.0.0-SNAPSHOT/org.wso2.es.integration.common.utils-2.0.0-SNAPSHOT.pom
[JENKINS] Archiving /build/jenworker/workspace/product-es/modules/integration/tests-common/integration-test-utils/target/org.wso2.es.integration.common.utils-2.0.0-SNAPSHOT.jar to org.wso2.es/org.wso2.es.integration.common.utils/2.0.0-SNAPSHOT/org.wso2.es.integration.common.utils-2.0.0-SNAPSHOT.jar
[JENKINS] Archiving /build/jenworker/workspace/product-es/modules/integration/tests-common/pom.xml to org.wso2.es/es-integration-tests-common/2.0.0-SNAPSHOT/es-integration-tests-common-2.0.0-SNAPSHOT.pom
[JENKINS] Archiving /build/jenworker/workspace/product-es/modules/integration/tests-platform/pom.xml to org.wso2.es/es-platform-tests/2.0.0-SNAPSHOT/es-platform-tests-2.0.0-SNAPSHOT.pom
channel stopped
executing script 'Script - Kill Carbon Servers'
[product-es] $ /bin/bash /tmp/build_step_template4158474932327126247.sh
Killing all carbon servers......
Maven RedeployPublisher use remote jenkins-worker2 maven settings from : /build/software/maven/apache-maven-3.0.5/conf/settings.xml
[INFO] Deployment in http://maven.wso2.org/nexus/content/repositories/snapshots/ (id=wso2.snapshots,uniqueVersion=true)
Deploying the main artifact es-integration-tests-2.0.0-SNAPSHOT.pom
Downloading: http://maven.wso2.org/nexus/content/repositories/snapshots/org/wso2/es/es-integration-tests/2.0.0-SNAPSHOT/maven-metadata.xml
Downloaded: http://maven.wso2.org/nexus/content/repositories/snapshots/org/wso2/es/es-integration-tests/2.0.0-SNAPSHOT/maven-metadata.xml (612 B at 4.6 KB/sec)
Uploading: http://maven.wso2.org/nexus/content/repositories/snapshots/org/wso2/es/es-integration-tests/2.0.0-SNAPSHOT/es-integration-tests-2.0.0-20150328.115639-865.pom
ERROR: Failed to deploy artifacts: Could not transfer artifact org.wso2.es:es-integration-tests:pom:2.0.0-20150328.115639-865 from/to wso2.snapshots (http://maven.wso2.org/nexus/content/repositories/snapshots/): Failed to transfer file: http://maven.wso2.org/nexus/content/repositories/snapshots/org/wso2/es/es-integration-tests/2.0.0-SNAPSHOT/es-integration-tests-2.0.0-20150328.115639-865.pom. Return code is: 401, ReasonPhrase: Unauthorized.
org.apache.maven.artifact.deployer.ArtifactDeploymentException: Failed to deploy artifacts: Could not transfer artifact org.wso2.es:es-integration-tests:pom:2.0.0-20150328.115639-865 from/to wso2.snapshots (http://maven.wso2.org/nexus/content/repositories/snapshots/): Failed to transfer file: http://maven.wso2.org/nexus/content/repositories/snapshots/org/wso2/es/es-integration-tests/2.0.0-SNAPSHOT/es-integration-tests-2.0.0-20150328.115639-865.pom. Return code is: 401, ReasonPhrase: Unauthorized.
	at org.apache.maven.artifact.deployer.DefaultArtifactDeployer.deploy(DefaultArtifactDeployer.java:143)
	at hudson.maven.reporters.MavenArtifactRecord.deploy(MavenArtifactRecord.java:193)
	at hudson.maven.RedeployPublisher.perform(RedeployPublisher.java:176)
	at hudson.tasks.BuildStepMonitor$1.perform(BuildStepMonitor.java:20)
	at hudson.model.AbstractBuild$AbstractBuildExecution.perform(AbstractBuild.java:745)
	at hudson.model.AbstractBuild$AbstractBuildExecution.performAllBuildSteps(AbstractBuild.java:709)
	at hudson.maven.MavenModuleSetBuild$MavenModuleSetBuildExecution.post2(MavenModuleSetBuild.java:1036)
	at hudson.model.AbstractBuild$AbstractBuildExecution.post(AbstractBuild.java:658)
	at hudson.model.Run.execute(Run.java:1731)
	at hudson.maven.MavenModuleSetBuild.run(MavenModuleSetBuild.java:525)
	at hudson.model.ResourceController.execute(ResourceController.java:88)
	at hudson.model.Executor.run(Executor.java:231)
Caused by: org.eclipse.aether.deployment.DeploymentException: Failed to deploy artifacts: Could not transfer artifact org.wso2.es:es-integration-tests:pom:2.0.0-20150328.115639-865 from/to wso2.snapshots (http://maven.wso2.org/nexus/content/repositories/snapshots/): Failed to transfer file: http://maven.wso2.org/nexus/content/repositories/snapshots/org/wso2/es/es-integration-tests/2.0.0-SNAPSHOT/es-integration-tests-2.0.0-20150328.115639-865.pom. Return code is: 401, ReasonPhrase: Unauthorized.
	at org.eclipse.aether.internal.impl.DefaultDeployer.deploy(DefaultDeployer.java:341)
	at org.eclipse.aether.internal.impl.DefaultDeployer.deploy(DefaultDeployer.java:269)
	at org.eclipse.aether.internal.impl.DefaultRepositorySystem.deploy(DefaultRepositorySystem.java:413)
	at org.apache.maven.artifact.deployer.DefaultArtifactDeployer.deploy(DefaultArtifactDeployer.java:139)
	... 11 more
Caused by: org.eclipse.aether.transfer.ArtifactTransferException: Could not transfer artifact org.wso2.es:es-integration-tests:pom:2.0.0-20150328.115639-865 from/to wso2.snapshots (http://maven.wso2.org/nexus/content/repositories/snapshots/): Failed to transfer file: http://maven.wso2.org/nexus/content/repositories/snapshots/org/wso2/es/es-integration-tests/2.0.0-SNAPSHOT/es-integration-tests-2.0.0-20150328.115639-865.pom. Return code is: 401, ReasonPhrase: Unauthorized.
	at org.eclipse.aether.connector.wagon.WagonRepositoryConnector$6.wrap(WagonRepositoryConnector.java:1016)
	at org.eclipse.aether.connector.wagon.WagonRepositoryConnector$6.wrap(WagonRepositoryConnector.java:1004)
	at org.eclipse.aether.connector.wagon.WagonRepositoryConnector$PutTask.run(WagonRepositoryConnector.java:895)
	at org.eclipse.aether.connector.wagon.WagonRepositoryConnector.put(WagonRepositoryConnector.java:522)
	at org.eclipse.aether.internal.impl.DefaultDeployer.deploy(DefaultDeployer.java:335)
	... 14 more
Caused by: org.apache.maven.wagon.TransferFailedException: Failed to transfer file: http://maven.wso2.org/nexus/content/repositories/snapshots/org/wso2/es/es-integration-tests/2.0.0-SNAPSHOT/es-integration-tests-2.0.0-20150328.115639-865.pom. Return code is: 401, ReasonPhrase: Unauthorized.
	at org.apache.maven.wagon.shared.http4.AbstractHttpClientWagon.put(AbstractHttpClientWagon.java:626)
	at org.apache.maven.wagon.shared.http4.AbstractHttpClientWagon.put(AbstractHttpClientWagon.java:524)
	at org.apache.maven.wagon.shared.http4.AbstractHttpClientWagon.put(AbstractHttpClientWagon.java:505)
	at org.apache.maven.wagon.shared.http4.AbstractHttpClientWagon.put(AbstractHttpClientWagon.java:485)
	at org.eclipse.aether.connector.wagon.WagonRepositoryConnector$PutTask.run(WagonRepositoryConnector.java:871)
	... 16 more
[INFO] Deployment failed after 0.28 sec
Build step 'Deploy artifacts to Maven repository' changed build result to FAILURE
Sending e-mails to: [email protected] [email protected] [email protected] [email protected] [email protected] [email protected] [email protected] [email protected] [email protected] [email protected] [email protected]
Finished: FAILURE