Started 4 days 14 hr ago
Took 6 hr 5 min on ECS_PRODUCTION-2eb3a7f04e236c

Unstable Build #227 (Jun 30, 2022 7:31:56 PM)

Build Artifacts
update.zip16.23 MB view
wso2ei-6.7.0-SNAPSHOT.zip517.03 MB view
Changes
  1. Update test file (commit: 6b3e594) (details)
  2. Update issue template (commit: 386d619) (details)

Started by timer

Revision: 525dad3dcebe90af89936da1ea06ef9825419930
  • refs/remotes/origin/master
Test Result (5 failures / ±0)Show all failed tests >>>
Jacoco - Overall Coverage Summary
INSTRUCTION0%
BRANCH0%
COMPLEXITY0%
LINE0%
METHOD0%
CLASS0%

Identified problems

testCopyFile

java.lang.AssertionError: expected:<200> but was:<202> at org.testng.Assert.fail(Assert.java:89) at org.testng.Assert.failNotEquals(Assert.java:489) at org.testng.Assert.assertEquals(Assert.java:118) at org.testng.Assert.assertEquals(Assert.java:365) at org.testng.Assert.assertEquals(Assert.java:375) at org.wso2.carbon.ei.tests.connectors.FileConnectorIntegrationTest.testCopyFile(FileConnectorIntegrationTest.java:77)

testMessagesInMessageProcessor

java.lang.AssertionError: Message Processor : mspAdminTestInMemoryMessageProcessor did not de-activate after failed delivery attempts with OUT_ONLY property. expected: but was: at org.testng.Assert.fail(Assert.java:89) at org.testng.Assert.failNotEquals(Assert.java:489) at org.testng.Assert.assertFalse(Assert.java:58) at org.wso2.carbon.esb.message.processor.test.MessageProcessorAdminTestCase.testMessagesInMessageProcessor(MessageProcessorAdminTestCase.java:191)

xsltTransformationFromUrl

org.apache.axis2.AxisFault: org.apache.synapse.SynapseException: Content-Type:text/xml; charset=UTF-8,Host:localhost:8480,SOAPAction:"urn:getQuote", Unexpected error sending message back at org.apache.axis2.util.Utils.getInboundFaultFromMessageContext(Utils.java:531) at org.apache.axis2.description.OutInAxisOperationClient.handleResponse(OutInAxisOperation.java:382) at org.apache.axis2.description.OutInAxisOperationClient.send(OutInAxisOperation.java:457) at org.apache.axis2.description.OutInAxisOperationClient.executeImpl(OutInAxisOperation.java:228) at org.apache.axis2.client.OperationClient.execute(OperationClient.java:149) at org.apache.axis2.client.ServiceClient.sendReceive(ServiceClient.java:554) at org.apache.axis2.client.ServiceClient.sendReceive(ServiceClient.java:530) at org.wso2.esb.integration.common.utils.clients.stockquoteclient.StockQuoteClient.sendCustomQuoteRequest(StockQuoteClient.java:166) at org.wso2.carbon.esb.mediator.test.xslt.XsltTransformationFromUrlTestCase.xsltTransformationFromUrl(XsltTransformationFromUrlTestCase.java:42)

testPreserveContentTypeHeader

java.lang.AssertionError: Response header modified at org.junit.Assert.fail(Assert.java:88) at org.junit.Assert.assertTrue(Assert.java:41) at org.wso2.carbon.esb.passthru.transport.test.PreseveResponseHeaderTestCase.testPreserveContentTypeHeader(PreseveResponseHeaderTestCase.java:57)

testMalformedJSONPayloadInFaultySequence

java.lang.AssertionError: The status code set in the faulty sequence is not received expected:<500> but was:<202> at org.testng.Assert.fail(Assert.java:89) at org.testng.Assert.failNotEquals(Assert.java:489) at org.testng.Assert.assertEquals(Assert.java:118) at org.testng.Assert.assertEquals(Assert.java:365) at org.wso2.carbon.esb.json.EI2757MalformedJSONPayloadFaultyTestCase.testMalformedJSONPayloadInFaultySequence(EI2757MalformedJSONPayloadFaultyTestCase.java:44)

Environment Variables(63)17 different
Slave Information(87)9 different
Project Information(15)0 different

Module Builds

Success EI Integration Test Admin Clients7.2 sec
Success WSO2 Enterprise Integrator - Automation Extensions19 sec
Success WSO2 BPS Samples8 sec
Success DataServices Clients22 sec
Success WSO2 Enterprise Integrator - Data Service Hosting Integration Tests0.46 sec
Success WSO2 DataServices Integration Test0.44 sec
Success WSO2 DataServices Integration Test Common0.47 sec
Success WSO2 DataServices Samples Parent1.3 sec
Success WSO2 Enterprise Integrator - Component Parent0.45 sec
Success WSO2 Enterprise Integrator - P2 Profile Generation1 min 15 sec
Success WSO2 Enterprise Integrator - Samples Parent0.48 sec
Success EI Test Common Module10 sec
Success EI Integration Test Common Utils12 sec
Success WSO2 Enterprise Integrator - Integration Tests0.42 sec
Success WSO2 Enterprise Integrator - Feature Aggregator Module0.44 sec
Success JAX-RS Basic Demo5.1 sec
 WSO2 Enterprise Integrator - Lightweight P2 Profile Generation (didn’t run)
Success Integration Test Module1.5 sec
Success WSO2 MB - Integration Tests3.8 sec
Success WSO2 Enterprise Integrator - Mediation Integration Tests0.46 sec
 WSO2 Enterprise Integrator - micro-integrator P2 Profile Generation (didn’t run)
 WSO2 MSF4J Runtime (didn’t run)
Success WSO2 Business Process Server Integration Tests - HumanTask Coordination10 min
Success Integration Test Reporting13 sec
Success org.wso2.carbon.ei.migration9.4 sec
Unstable EI test Module - Test Connectors1 min 8 sec
Success EI test Module-mediator-127 min
Unstable EI test Module-mediator-215 min
Success EI test Module-Other15 min
Unstable EI test Module - Test Patches19 min
Success EI Test Module - Platform0.46 sec
Success EI test Module - Platform - RabbitMQ Transport3.2 sec
Success EI test Module - Platform - with WSO2MB9.1 sec
Success EI test Module - Sample8 min 41 sec
Success EI test Module-Service18 min
Success EI test Module-Transport27 min
Success EI test Module - UI5.2 sec
 WSO2 Enterprise Integrator - Core Component (didn’t run)
 WSO2 Enterprise Integrator - Core Server Feature (didn’t run)
 WSO2 Enterprise Integrator - Micro Core Component (didn’t run)
 org.wso2.carbon.micro.integrator.security (didn’t run)
 WSO2 Enterprise Integrator - Micro server Component (didn’t run)
 WSO2 Enterprise Integrator - Micro Core Server Feature (didn’t run)
Success WSO2 Carbon - Server Administration UI2.8 sec
Success WSO2 Enterprise Integrator - Admin Console feature1 sec
Success WSO2 Enterprise Integrator - Analytics ELK38 sec
Success WSO2 Enterprise Integrator - Analytics ELK Feature2.4 sec
Success WSO2 Enterprise Integrator - Analytics Feature3 sec
Success WSO2 Enterprise Integrator - Analytics Styles1 sec
Success WSO2 Enterprise Integrator Analytics - Styles Features1.4 sec
Success WSO2 Carbon - BPMN Analytics Core Extension6.2 sec
Success WSO2 ei bpmn Analytics - UDF3.4 sec
Success WSO2 EI Message Broker - Dashboard UI1.8 sec
Success WSO2 EI Broker - Tenant Dashboard UI1.3 sec
Success WSO2 EI Broker Styles1 sec
Success WSO2 EI Broker - Styles Features0.71 sec
Success WSO2 EI Business-Process - Tenant Dashboard UI9.4 sec
Success WSO2 EI Business-Process - Tenant Dashboard UI1.3 sec
Success WSO2 EI Business-Process - UI styles0.98 sec
Success WSO2 EI Business Process - Style Features0.75 sec
Success WSO2 BPS - Integration Test Common Module3.5 sec
Success WSO2 BPS - Integration Test Utils2.7 sec
Success WSO2 Business Process Server Integration Tests - BPS Test Reporting Module1.1 sec
Success WSO2 Business Process Server Integration Tests - BPEL10 min
Success WSO2 Business Process Server Integration Tests - BPMN7 min 24 sec
Success WSO2 Business Process Server Integration Tests - HumanTask6 min 55 sec
Success WSO2 Business Process Server Tests Patches - BPEL58 sec
Success WSO2 BPS - Integration UI Pages4.9 sec
Success admin-clents3.8 sec
Success integration-test-utils4 sec
Success integration-test-ui-pages3.7 sec
Success DataService Integration test UI module3.1 sec
Success org.wso2.ei.integration.test25 min
Success MB AMQP based Test Module2 hr 25 min
Success WSO2 MB - Integration Test Common Module3.7 sec
Success WSO2 MB - Integration Test Common Utils Module4.9 sec
Success UI Integration Test Module4.1 sec
Success MB Patch based Test Module45 sec
Success WSO2 MB - platform Test Common Utils Module4.3 sec
Success WSO2 EI - Samples5.2 sec
Success WSO2 Enterprise Integrator - Samples Features1.2 sec
Success WSO2 Enterprise Integrator - Styles3 sec
Success WSO2 Enterprise Integrator - Styles Features4.2 sec
Success WSO2 Enterprise Integrator - P2 Profile Module0.49 sec
Success WSO2 BPS - Tools24 sec
Success WSO2 BPS - Client for Samples3.5 sec
Success WSO2 BPS - Utilities for Samples3.8 sec
Success WSO2 BPS - Sample Utilities and Jars to use with BPS Testing0.44 sec
Success MB Server Test Module29 sec
Success EI Test Service Module2.8 sec
Success EI Integration Test UI Pages6.6 sec
 WSO2 Enterprise Integrator - Analytics P2 Profile Generation (didn’t run)
Success >WSO2 Enterprise Integrator - Analytics Profile Generation1 min 45 sec
Success WSO2 BPS - Integration Parent0.44 sec
Success WSO2 BPS - Integration Parent0.42 sec
Success WSO2 BPS - Integration Parent0.46 sec
Success WSO2 BPS - Integration Parent0.44 sec
Success WSO2 BPS - P2 Profile Generation35 sec
Success WSO2 BPS - Distribution Parent0.47 sec
Success WSO2 Broker - P2 Profile Generation27 sec
Success WSO2 Enterprise Integrator - Distribution1 min 8 sec
Success WSO2 Enterprise Integrator5.7 sec
Success WSO2 Enterprise Integrator - Web App Samples0.86 sec