Started 1 day 2 hr ago
Took 7 hr 10 min on ECS_PRODUCTION-601f18a313f1ef

Unstable Build #250 (Dec 8, 2022 7:32:17 PM)

Build Artifacts
update.zip16.23 MB view
wso2ei-6.7.0-SNAPSHOT.zip517.03 MB view
No changes.

Started by timer

Revision: 525dad3dcebe90af89936da1ea06ef9825419930
  • refs/remotes/origin/master
Test Result (5 failures / ±0)Show all failed tests >>>
Jacoco - Overall Coverage Summary
INSTRUCTION0%
BRANCH0%
COMPLEXITY0%
LINE0%
METHOD0%
CLASS0%

Identified problems

testCopyFile

java.lang.AssertionError: expected:<200> but was:<202> at org.testng.Assert.fail(Assert.java:89) at org.testng.Assert.failNotEquals(Assert.java:489) at org.testng.Assert.assertEquals(Assert.java:118) at org.testng.Assert.assertEquals(Assert.java:365) at org.testng.Assert.assertEquals(Assert.java:375) at org.wso2.carbon.ei.tests.connectors.FileConnectorIntegrationTest.testCopyFile(FileConnectorIntegrationTest.java:77)

testMessagesInMessageProcessor

java.lang.AssertionError: Message Processor : mspAdminTestInMemoryMessageProcessor did not de-activate after failed delivery attempts with OUT_ONLY property. expected: but was: at org.testng.Assert.fail(Assert.java:89) at org.testng.Assert.failNotEquals(Assert.java:489) at org.testng.Assert.assertFalse(Assert.java:58) at org.wso2.carbon.esb.message.processor.test.MessageProcessorAdminTestCase.testMessagesInMessageProcessor(MessageProcessorAdminTestCase.java:191)

xsltTransformationFromUrl

org.apache.axis2.AxisFault: org.apache.synapse.SynapseException: Content-Type:text/xml; charset=UTF-8,Host:localhost:8480,SOAPAction:"urn:getQuote", Unexpected error sending message back at org.apache.axis2.util.Utils.getInboundFaultFromMessageContext(Utils.java:531) at org.apache.axis2.description.OutInAxisOperationClient.handleResponse(OutInAxisOperation.java:382) at org.apache.axis2.description.OutInAxisOperationClient.send(OutInAxisOperation.java:457) at org.apache.axis2.description.OutInAxisOperationClient.executeImpl(OutInAxisOperation.java:228) at org.apache.axis2.client.OperationClient.execute(OperationClient.java:149) at org.apache.axis2.client.ServiceClient.sendReceive(ServiceClient.java:554) at org.apache.axis2.client.ServiceClient.sendReceive(ServiceClient.java:530) at org.wso2.esb.integration.common.utils.clients.stockquoteclient.StockQuoteClient.sendCustomQuoteRequest(StockQuoteClient.java:166) at org.wso2.carbon.esb.mediator.test.xslt.XsltTransformationFromUrlTestCase.xsltTransformationFromUrl(XsltTransformationFromUrlTestCase.java:42)

testPreserveContentTypeHeader

java.lang.AssertionError: Response header modified at org.junit.Assert.fail(Assert.java:88) at org.junit.Assert.assertTrue(Assert.java:41) at org.wso2.carbon.esb.passthru.transport.test.PreseveResponseHeaderTestCase.testPreserveContentTypeHeader(PreseveResponseHeaderTestCase.java:57)

testMalformedJSONPayloadInFaultySequence

java.lang.AssertionError: The status code set in the faulty sequence is not received expected:<500> but was:<202> at org.testng.Assert.fail(Assert.java:89) at org.testng.Assert.failNotEquals(Assert.java:489) at org.testng.Assert.assertEquals(Assert.java:118) at org.testng.Assert.assertEquals(Assert.java:365) at org.wso2.carbon.esb.json.EI2757MalformedJSONPayloadFaultyTestCase.testMalformedJSONPayloadInFaultySequence(EI2757MalformedJSONPayloadFaultyTestCase.java:44)

Environment Variables(63)16 different
Slave Information(87)10 different
Project Information(15)0 different

Module Builds

Success EI Integration Test Admin Clients16 sec
Success WSO2 Enterprise Integrator - Automation Extensions28 sec
Success WSO2 BPS Samples13 sec
Success DataServices Clients26 sec
Success WSO2 Enterprise Integrator - Data Service Hosting Integration Tests0.48 sec
Success WSO2 DataServices Integration Test0.47 sec
Success WSO2 DataServices Integration Test Common0.43 sec
Success WSO2 DataServices Samples Parent10 sec
Success WSO2 Enterprise Integrator - Component Parent1.1 sec
Success WSO2 Enterprise Integrator - P2 Profile Generation1 min 47 sec
Success WSO2 Enterprise Integrator - Samples Parent0.46 sec
Success EI Test Common Module34 sec
Success EI Integration Test Common Utils14 sec
Success WSO2 Enterprise Integrator - Integration Tests5 sec
Success WSO2 Enterprise Integrator - Feature Aggregator Module0.62 sec
Success JAX-RS Basic Demo6.8 sec
 WSO2 Enterprise Integrator - Lightweight P2 Profile Generation (didn’t run)
Success Integration Test Module1.5 sec
Success WSO2 MB - Integration Tests7.3 sec
Success WSO2 Enterprise Integrator - Mediation Integration Tests0.51 sec
 WSO2 Enterprise Integrator - micro-integrator P2 Profile Generation (didn’t run)
 WSO2 MSF4J Runtime (didn’t run)
Success WSO2 Business Process Server Integration Tests - HumanTask Coordination10 min
Success Integration Test Reporting13 sec
Success org.wso2.carbon.ei.migration18 sec
Unstable EI test Module - Test Connectors1 min 23 sec
Success EI test Module-mediator-127 min
Unstable EI test Module-mediator-215 min
Success EI test Module-Other15 min
Unstable EI test Module - Test Patches19 min
Success EI Test Module - Platform8.8 sec
Success EI test Module - Platform - RabbitMQ Transport3.2 sec
Success EI test Module - Platform - with WSO2MB6.6 sec
Success EI test Module - Sample8 min 41 sec
Success EI test Module-Service19 min
Success EI test Module-Transport27 min
Success EI test Module - UI5.3 sec
 WSO2 Enterprise Integrator - Core Component (didn’t run)
 WSO2 Enterprise Integrator - Core Server Feature (didn’t run)
 WSO2 Enterprise Integrator - Micro Core Component (didn’t run)
 org.wso2.carbon.micro.integrator.security (didn’t run)
 WSO2 Enterprise Integrator - Micro server Component (didn’t run)
 WSO2 Enterprise Integrator - Micro Core Server Feature (didn’t run)
Success WSO2 Carbon - Server Administration UI6.9 sec
Success WSO2 Enterprise Integrator - Admin Console feature1 sec
Success WSO2 Enterprise Integrator - Analytics ELK1 min 8 sec
Success WSO2 Enterprise Integrator - Analytics ELK Feature11 sec
Success WSO2 Enterprise Integrator - Analytics Feature6.1 sec
Success WSO2 Enterprise Integrator - Analytics Styles1 sec
Success WSO2 Enterprise Integrator Analytics - Styles Features1.5 sec
Success WSO2 Carbon - BPMN Analytics Core Extension17 sec
Success WSO2 ei bpmn Analytics - UDF6.2 sec
Success WSO2 EI Message Broker - Dashboard UI1.9 sec
Success WSO2 EI Broker - Tenant Dashboard UI1.4 sec
Success WSO2 EI Broker Styles1 sec
Success WSO2 EI Broker - Styles Features0.72 sec
Success WSO2 EI Business-Process - Tenant Dashboard UI20 sec
Success WSO2 EI Business-Process - Tenant Dashboard UI1.3 sec
Success WSO2 EI Business-Process - UI styles1.1 sec
Success WSO2 EI Business Process - Style Features0.81 sec
Success WSO2 BPS - Integration Test Common Module5.1 sec
Success WSO2 BPS - Integration Test Utils2.7 sec
Success WSO2 Business Process Server Integration Tests - BPS Test Reporting Module1.1 sec
Success WSO2 Business Process Server Integration Tests - BPEL10 min
Success WSO2 Business Process Server Integration Tests - BPMN7 min 24 sec
Success WSO2 Business Process Server Integration Tests - HumanTask6 min 55 sec
Success WSO2 Business Process Server Tests Patches - BPEL58 sec
Success WSO2 BPS - Integration UI Pages6.6 sec
Success admin-clents7 sec
Success integration-test-utils4 sec
Success integration-test-ui-pages3.7 sec
Success DataService Integration test UI module3 sec
Success org.wso2.ei.integration.test24 min
Success MB AMQP based Test Module2 hr 25 min
Success WSO2 MB - Integration Test Common Module3.6 sec
Success WSO2 MB - Integration Test Common Utils Module4.6 sec
Success UI Integration Test Module8 sec
Success MB Patch based Test Module1 min 1 sec
Success WSO2 MB - platform Test Common Utils Module4.2 sec
Success WSO2 EI - Samples15 sec
Success WSO2 Enterprise Integrator - Samples Features1.3 sec
Success WSO2 Enterprise Integrator - Styles11 sec
Success WSO2 Enterprise Integrator - Styles Features13 sec
Success WSO2 Enterprise Integrator - P2 Profile Module0.51 sec
Success WSO2 BPS - Tools39 sec
Success WSO2 BPS - Client for Samples12 sec
Success WSO2 BPS - Utilities for Samples11 sec
Success WSO2 BPS - Sample Utilities and Jars to use with BPS Testing0.47 sec
Success MB Server Test Module39 sec
Success EI Test Service Module7.8 sec
Success EI Integration Test UI Pages14 sec
 WSO2 Enterprise Integrator - Analytics P2 Profile Generation (didn’t run)
Success >WSO2 Enterprise Integrator - Analytics Profile Generation4 min 17 sec
Success WSO2 BPS - Integration Parent0.46 sec
Success WSO2 BPS - Integration Parent0.43 sec
Success WSO2 BPS - Integration Parent0.47 sec
Success WSO2 BPS - Integration Parent0.47 sec
Success WSO2 BPS - P2 Profile Generation51 sec
Success WSO2 BPS - Distribution Parent0.54 sec
Success WSO2 Broker - P2 Profile Generation35 sec
Success WSO2 Enterprise Integrator - Distribution1 min 29 sec
Success WSO2 Enterprise Integrator14 sec
Success WSO2 Enterprise Integrator - Web App Samples1 sec