Started 8 hr 16 min ago
Took 2 hr 38 min on ECS_PRODUCTION-3001960a7d56a9

Unstable Build #1888 (Jul 5, 2022 1:31:17 AM)

No changes.

Started by timer

Revision: 525dad3dcebe90af89936da1ea06ef9825419930
  • refs/remotes/origin/master
Test Result (5 failures / +3)Show all failed tests >>>
Jacoco - Overall Coverage Summary
INSTRUCTION0%
BRANCH0%
COMPLEXITY0%
LINE0%
METHOD0%
CLASS0%

Identified problems

testCopyFile

java.lang.AssertionError: expected:<200> but was:<202> at org.testng.Assert.fail(Assert.java:89) at org.testng.Assert.failNotEquals(Assert.java:489) at org.testng.Assert.assertEquals(Assert.java:118) at org.testng.Assert.assertEquals(Assert.java:365) at org.testng.Assert.assertEquals(Assert.java:375) at org.wso2.carbon.ei.tests.connectors.FileConnectorIntegrationTest.testCopyFile(FileConnectorIntegrationTest.java:77)

testMessagesInMessageProcessor

java.lang.AssertionError: Message Processor : mspAdminTestInMemoryMessageProcessor did not de-activate after failed delivery attempts with OUT_ONLY property. expected: but was: at org.testng.Assert.fail(Assert.java:89) at org.testng.Assert.failNotEquals(Assert.java:489) at org.testng.Assert.assertFalse(Assert.java:58) at org.wso2.carbon.esb.message.processor.test.MessageProcessorAdminTestCase.testMessagesInMessageProcessor(MessageProcessorAdminTestCase.java:191)

xsltTransformationFromUrl

org.apache.axis2.AxisFault: org.apache.synapse.SynapseException: Content-Type:text/xml; charset=UTF-8,Host:localhost:8480,SOAPAction:"urn:getQuote", Unexpected error sending message back at org.apache.axis2.util.Utils.getInboundFaultFromMessageContext(Utils.java:531) at org.apache.axis2.description.OutInAxisOperationClient.handleResponse(OutInAxisOperation.java:382) at org.apache.axis2.description.OutInAxisOperationClient.send(OutInAxisOperation.java:457) at org.apache.axis2.description.OutInAxisOperationClient.executeImpl(OutInAxisOperation.java:228) at org.apache.axis2.client.OperationClient.execute(OperationClient.java:149) at org.apache.axis2.client.ServiceClient.sendReceive(ServiceClient.java:554) at org.apache.axis2.client.ServiceClient.sendReceive(ServiceClient.java:530) at org.wso2.esb.integration.common.utils.clients.stockquoteclient.StockQuoteClient.sendCustomQuoteRequest(StockQuoteClient.java:166) at org.wso2.carbon.esb.mediator.test.xslt.XsltTransformationFromUrlTestCase.xsltTransformationFromUrl(XsltTransformationFromUrlTestCase.java:42)

testPreserveContentTypeHeader

java.lang.AssertionError: Response header modified at org.junit.Assert.fail(Assert.java:88) at org.junit.Assert.assertTrue(Assert.java:41) at org.wso2.carbon.esb.passthru.transport.test.PreseveResponseHeaderTestCase.testPreserveContentTypeHeader(PreseveResponseHeaderTestCase.java:57)

testMalformedJSONPayloadInFaultySequence

java.lang.AssertionError: The status code set in the faulty sequence is not received expected:<500> but was:<202> at org.testng.Assert.fail(Assert.java:89) at org.testng.Assert.failNotEquals(Assert.java:489) at org.testng.Assert.assertEquals(Assert.java:118) at org.testng.Assert.assertEquals(Assert.java:365) at org.wso2.carbon.esb.json.EI2757MalformedJSONPayloadFaultyTestCase.testMalformedJSONPayloadInFaultySequence(EI2757MalformedJSONPayloadFaultyTestCase.java:44)

Environment Variables(62)15 different
Slave Information(87)10 different
Project Information(15)0 different

Module Builds

 AdminApiHelper (didn’t run)
Success EI Integration Test Admin Clients7.6 sec
Success WSO2 Enterprise Integrator - Automation Extensions26 sec
Success WSO2 BPS Samples11 sec
Success DataServices Clients28 sec
Success WSO2 DataServices Samples Parent1.4 sec
Success WSO2 Enterprise Integrator - Component Parent0.48 sec
Success WSO2 Enterprise Integrator - P2 Profile Generation1 min 40 sec
Success WSO2 Enterprise Integrator - Samples Parent0.43 sec
Success EI Test Common Module14 sec
Success EI Integration Test Common Utils12 sec
Success WSO2 Enterprise Integrator - Integration Tests0.44 sec
Success WSO2 Enterprise Integrator - Feature Aggregator Module0.47 sec
Success JAX-RS Basic Demo7.9 sec
 WSO2 Enterprise Integrator - Lightweight P2 Profile Generation (didn’t run)
Success WSO2 Enterprise Integrator - Mediation Integration Tests0.52 sec
 WSO2 Enterprise Integrator - micro-integrator P2 Profile Generation (didn’t run)
 WSO2 Enterprise Integrator - microIntegrator P2 Profile Generation (didn’t run)
 WSO2 MSF4J Runtime (didn’t run)
Success Integration Test Reporting13 sec
Success org.wso2.carbon.ei.migration8.8 sec
Unstable EI test Module - Test Connectors1 min 7 sec
Success EI test Module-mediator-128 min
Unstable EI test Module-mediator-216 min
Success EI test Module-Other15 min
Unstable EI test Module - Test Patches20 min
Success EI Test Module - Platform0.45 sec
Success EI test Module - Platform - RabbitMQ Transport3.1 sec
Success EI test Module - Platform - with WSO2MB6.6 sec
Success EI test Module - Sample8 min 43 sec
Success EI test Module-Service19 min
Success EI test Module-Transport28 min
Success EI test Module - UI5.5 sec
 WSO2 Enterprise Integrator - Core Component (didn’t run)
 WSO2 Enterprise Integrator - Core Server Feature (didn’t run)
 org.wso2.carbon.micro.integrator.admin.api (didn’t run)
 org.wso2.carbon.micro.integrator.admin.apis (didn’t run)
 org.wso2.carbon.micro.integrator.admin.apis.esb (didn’t run)
 WSO2 Enterprise Integrator - Micro Core Component (didn’t run)
 WSO2 Enterprise Integrator - Micro Extensions (didn’t run)
 org.wso2.carbon.micro.integrator.security (didn’t run)
 WSO2 Enterprise Integrator - Micro server Component (didn’t run)
 WSO2 Enterprise Integrator - Micro Core Server Feature (didn’t run)
Success WSO2 Carbon - Server Administration UI4.8 sec
Success WSO2 Enterprise Integrator - Admin Console feature1 sec
Success WSO2 Enterprise Integrator - Analytics ELK1 min 46 sec
Success WSO2 Enterprise Integrator - Analytics ELK Feature2.3 sec
Success WSO2 Enterprise Integrator - Analytics Feature3.4 sec
Success WSO2 Enterprise Integrator - Analytics Styles0.99 sec
Success WSO2 Enterprise Integrator Analytics - Styles Features1.4 sec
Success WSO2 Carbon - BPMN Analytics Core Extension9.7 sec
Success WSO2 ei bpmn Analytics - UDF3.5 sec
Success WSO2 EI Message Broker - Dashboard UI1.8 sec
Success WSO2 EI Broker - Tenant Dashboard UI1.3 sec
Success WSO2 EI Broker Styles0.94 sec
Success WSO2 EI Broker - Styles Features0.7 sec
Success WSO2 EI Business-Process - Tenant Dashboard UI23 sec
Success WSO2 EI Business-Process - Tenant Dashboard UI1.3 sec
Success WSO2 EI Business-Process - UI styles0.95 sec
Success WSO2 EI Business Process - Style Features0.72 sec
Success WSO2 EI - Samples8 sec
Success WSO2 Enterprise Integrator - Samples Features1.3 sec
Success WSO2 Enterprise Integrator - Styles4.2 sec
Success WSO2 Enterprise Integrator - Styles Features9.1 sec
Success WSO2 Enterprise Integrator - P2 Profile Module0.49 sec
Success WSO2 BPS - Tools1 min 13 sec
Success WSO2 BPS - Client for Samples3.8 sec
Success WSO2 BPS - Utilities for Samples4.9 sec
Success WSO2 BPS - Sample Utilities and Jars to use with BPS Testing0.45 sec
Success EI Test Service Module3.4 sec
Success EI Integration Test UI Pages6.6 sec
 WSO2 Enterprise Integrator - Analytics P2 Profile Generation (didn’t run)
Success >WSO2 Enterprise Integrator - Analytics Profile Generation2 min 40 sec
Success WSO2 BPS - P2 Profile Generation37 sec
Success WSO2 BPS - Distribution Parent0.44 sec
Success WSO2 Broker - P2 Profile Generation26 sec
Success WSO2 Enterprise Integrator - Distribution1 min 12 sec
Success WSO2 Enterprise Integrator12 sec
Success WSO2 Enterprise Integrator - Web App Samples0.68 sec