Started 6 days 12 hr ago
Took 3 hr 0 min on ECS_PRODUCTION-2d028baac989c3

Failed Build #138 (Jun 25, 2022 7:16:25 AM)

Build Artifacts
wso2mi-4.1.0-SNAPSHOT.zip146.68 MB view
Changes
  1. Add non proxy host configs to deployment.toml (commit: 4a727a4) (details)
  2. Remove unnecessarry db files (commit: 022b25a) (details)
Changes in dependency
  1. wso2mi-hl7  ? → Success#1564 (detail)
  2. WSO2 Micro Integrator - Analytics Data Publisher Util  ? → Success#1564 (detail)
  3. WSO2 Micro Integrator - Core Component  ? → Success#1564 (detail)
  4. WSO2 Carbon - HL7 Business Messaging - Common  ? → Success#1564 (detail)

Started by timer

Revision: 61e1df1698e9ad9b92c53cfe14d8779b16e97e74
  • refs/remotes/origin/master
Test Result (17 failures / -23)Show all failed tests >>>

Identified problems

testEmailTransport

org.apache.axis2.AxisFault: AxisFault while getting response :Read timed out at org.wso2.esb.integration.common.utils.clients.axis2client.AxisServiceClient.sendReceive(AxisServiceClient.java:59) at org.wso2.carbon.esb.mailto.transport.sender.test.SendMailWithSecondaryAccountThroughESBTestCase.testEmailTransport(SendMailWithSecondaryAccountThroughESBTestCase.java:75) Caused by: org.apache.axis2.AxisFault: Read timed out at org.apache.axis2.AxisFault.makeFault(AxisFault.java:430) at org.apache.axis2.transport.http.HTTPSender.sendViaPost(HTTPSender.java:227) at org.apache.axis2.transport.http.HTTPSender.send(HTTPSender.java:82) at org.apache.axis2.transport.http.CommonsHTTPTransportSender.writeMessageWithCommons(CommonsHTTPTransportSender.java:459) at org.apache.axis2.transport.http.CommonsHTTPTransportSender.invoke(CommonsHTTPTransportSender.java:286) at org.apache.axis2.engine.AxisEngine.send(AxisEngine.java:442) at org.apache.axis2.description.OutInAxisOperationClient.send(OutInAxisOperation.java:449) at org.apache.axis2.description.OutInAxisOperationClient.executeImpl(OutInAxisOperation.java:235) at org.apache.axis2.client.OperationClient.execute(OperationClient.java:149) at org.apache.axis2.client.ServiceClient.sendReceive(ServiceClient.java:554) at org.apache.axis2.client.ServiceClient.sendReceive(ServiceClient.java:530) at org.wso2.esb.integration.common.utils.clients.axis2client.AxisServiceClient.sendReceive(AxisServiceClient.java:53) ... 35 more Caused by: java.net.SocketTimeoutException: Read timed out at java.base/java.net.SocketInputStream.socketRead0(Native Method) at java.base/java.net.SocketInputStream.socketRead(SocketInputStream.java:115) at java.base/java.net.SocketInputStream.read(SocketInputStream.java:168) at java.base/java.net.SocketInputStream.read(SocketInputStream.java:140) at java.base/java.io.BufferedInputStream.fill(BufferedInputStream.java:252) at java.base/java.io.BufferedInputStream.read(BufferedInputStream.java:271) at org.apache.commons.httpclient.HttpParser.readRawLine(HttpParser.java:78) at org.apache.commons.httpclient.HttpParser.readLine(HttpParser.java:106) at org.apache.commons.httpclient.HttpConnection.readLine(HttpConnection.java:1116) at org.apache.commons.httpclient.MultiThreadedHttpConnectionManager$HttpConnectionAdapter.readLine(MultiThreadedHttpConnectionManager.java:1413) at org.apache.commons.httpclient.HttpMethodBase.readStatusLine(HttpMethodBase.java:1973) at org.apache.commons.httpclient.HttpMethodBase.readResponse(HttpMethodBase.java:1735) at org.apache.commons.httpclient.HttpMethodBase.execute(HttpMethodBase.java:1098) at org.apache.commons.httpclient.HttpMethodDirector.executeWithRetry(HttpMethodDirector.java:398) at org.apache.commons.httpclient.HttpMethodDirector.executeMethod(HttpMethodDirector.java:171) at org.apache.commons.httpclient.HttpClient.executeMethod(HttpClient.java:397) at org.apache.axis2.transport.http.AbstractHTTPSender.executeMethod(AbstractHTTPSender.java:717) at org.apache.axis2.transport.http.HTTPSender.sendViaPost(HTTPSender.java:223) ... 45 more

webSocketInboundTest

java.lang.ArrayIndexOutOfBoundsException: Index 0 out of bounds for length 0 at org.testng.internal.MethodInvocationHelper.invokeWithTimeoutWithNewExecutor(MethodInvocationHelper.java:289) at org.testng.internal.MethodInvocationHelper.invokeWithTimeout(MethodInvocationHelper.java:246) at org.testng.internal.Invoker.invokeMethod(Invoker.java:667) at org.testng.internal.Invoker.invokeTestMethod(Invoker.java:869) at org.testng.internal.Invoker.invokeTestMethods(Invoker.java:1193) at org.testng.internal.TestMethodWorker.invokeTestMethods(TestMethodWorker.java:126) at org.testng.internal.TestMethodWorker.run(TestMethodWorker.java:109) at org.testng.TestRunner.privateRun(TestRunner.java:744) at org.testng.TestRunner.run(TestRunner.java:602) at org.testng.SuiteRunner.runTest(SuiteRunner.java:380) at org.testng.SuiteRunner.runSequentially(SuiteRunner.java:375) at org.testng.SuiteRunner.privateRun(SuiteRunner.java:340) at org.testng.SuiteRunner.run(SuiteRunner.java:289) at org.testng.SuiteRunnerWorker.runSuite(SuiteRunnerWorker.java:52) at org.testng.SuiteRunnerWorker.run(SuiteRunnerWorker.java:86) at org.testng.TestNG.runSuitesSequentially(TestNG.java:1301) at org.testng.TestNG.runSuitesLocally(TestNG.java:1226) at org.testng.TestNG.runSuites(TestNG.java:1144) at org.testng.TestNG.run(TestNG.java:1115) at org.apache.maven.surefire.testng.TestNGExecutor.run(TestNGExecutor.java:178) at org.apache.maven.surefire.testng.TestNGXmlTestSuite.execute(TestNGXmlTestSuite.java:92) at org.apache.maven.surefire.testng.TestNGProvider.invoke(TestNGProvider.java:96) at java.base/jdk.internal.reflect.NativeMethodAccessorImpl.invoke0(Native Method) at java.base/jdk.internal.reflect.NativeMethodAccessorImpl.invoke(NativeMethodAccessorImpl.java:62) at java.base/jdk.internal.reflect.DelegatingMethodAccessorImpl.invoke(DelegatingMethodAccessorImpl.java:43) at java.base/java.lang.reflect.Method.invoke(Method.java:566) at org.apache.maven.surefire.util.ReflectionUtils.invokeMethodWithArray(ReflectionUtils.java:189) at org.apache.maven.surefire.booter.ProviderFactory$ProviderProxy.invoke(ProviderFactory.java:165) at org.apache.maven.surefire.booter.ProviderFactory.invokeProvider(ProviderFactory.java:85) at org.apache.maven.surefire.booter.ForkedBooter.runSuitesInProcess(ForkedBooter.java:115) at org.apache.maven.surefire.booter.ForkedBooter.main(ForkedBooter.java:75)

destroy

java.lang.NullPointerException at org.wso2.carbon.esb.websocket.client.WebSocketClientHandler.shutDown(WebSocketClientHandler.java:166) at org.wso2.carbon.esb.websocket.client.WebSocketTestClient.shutDown(WebSocketTestClient.java:234) at org.wso2.carbon.esb.websocket.inbound.transport.test.WebSocketInboundTestCase.destroy(WebSocketInboundTestCase.java:64)

testHLTransport

org.awaitility.core.ConditionTimeoutException: Condition with lambda expression in org.wso2.esb.integration.common.utils.CarbonLogReader that uses java.lang.Thread was not fulfilled within 5 seconds. at org.awaitility.core.ConditionAwaiter.await(ConditionAwaiter.java:145) at org.awaitility.core.CallableCondition.await(CallableCondition.java:79) at org.awaitility.core.CallableCondition.await(CallableCondition.java:27) at org.awaitility.core.ConditionFactory.until(ConditionFactory.java:902) at org.awaitility.core.ConditionFactory.until(ConditionFactory.java:860) at org.wso2.esb.integration.common.utils.CarbonLogReader.start(CarbonLogReader.java:85) at org.wso2.carbon.esb.hl7.transport.test.HL7TransportTests.testHLTransport(HL7TransportTests.java:70)

init

org.awaitility.core.ConditionTimeoutException: Condition with lambda expression in org.wso2.esb.integration.common.utils.CarbonLogReader that uses java.lang.Thread was not fulfilled within 5 seconds. at org.awaitility.core.ConditionAwaiter.await(ConditionAwaiter.java:145) at org.awaitility.core.CallableCondition.await(CallableCondition.java:79) at org.awaitility.core.CallableCondition.await(CallableCondition.java:27) at org.awaitility.core.ConditionFactory.until(ConditionFactory.java:902) at org.awaitility.core.ConditionFactory.until(ConditionFactory.java:860) at org.wso2.esb.integration.common.utils.CarbonLogReader.start(CarbonLogReader.java:85) at org.wso2.carbon.esb.hl7.inbound.transport.test.HL7InboundPreprocessorTest.init(HL7InboundPreprocessorTest.java:55)

testSequence

org.awaitility.core.ConditionTimeoutException: Condition with lambda expression in org.wso2.esb.integration.common.utils.CarbonLogReader that uses java.lang.Thread was not fulfilled within 5 seconds. at org.awaitility.core.ConditionAwaiter.await(ConditionAwaiter.java:145) at org.awaitility.core.CallableCondition.await(CallableCondition.java:79) at org.awaitility.core.CallableCondition.await(CallableCondition.java:27) at org.awaitility.core.ConditionFactory.until(ConditionFactory.java:902) at org.awaitility.core.ConditionFactory.until(ConditionFactory.java:860) at org.wso2.esb.integration.common.utils.CarbonLogReader.start(CarbonLogReader.java:85) at org.wso2.carbon.esb.file.inbound.transport.test.FileInboundWithDynamicSequenceTestCase.testSequence(FileInboundWithDynamicSequenceTestCase.java:74)

setEnvironment

org.awaitility.core.ConditionTimeoutException: Condition with lambda expression in org.wso2.esb.integration.common.utils.CarbonLogReader that uses java.lang.Thread was not fulfilled within 5 seconds. at org.awaitility.core.ConditionAwaiter.await(ConditionAwaiter.java:145) at org.awaitility.core.CallableCondition.await(CallableCondition.java:79) at org.awaitility.core.CallableCondition.await(CallableCondition.java:27) at org.awaitility.core.ConditionFactory.until(ConditionFactory.java:902) at org.awaitility.core.ConditionFactory.until(ConditionFactory.java:860) at org.wso2.esb.integration.common.utils.CarbonLogReader.start(CarbonLogReader.java:85) at org.wso2.carbon.esb.file.inbound.transport.test.InboundTransportTest.setEnvironment(InboundTransportTest.java:73)

testJmsQueueToHttpWithInboundEndpoint

org.awaitility.core.ConditionTimeoutException: Condition with lambda expression in org.wso2.esb.integration.common.utils.CarbonLogReader that uses java.lang.Thread was not fulfilled within 5 seconds. at org.awaitility.core.ConditionAwaiter.await(ConditionAwaiter.java:145) at org.awaitility.core.CallableCondition.await(CallableCondition.java:79) at org.awaitility.core.CallableCondition.await(CallableCondition.java:27) at org.awaitility.core.ConditionFactory.until(ConditionFactory.java:902) at org.awaitility.core.ConditionFactory.until(ConditionFactory.java:860) at org.wso2.esb.integration.common.utils.CarbonLogReader.start(CarbonLogReader.java:85) at org.wso2.carbon.esb.jms.inbound.transport.test.JmsToBackendWithInboundEndpointTestCase.testJmsQueueToHttpWithInboundEndpoint(JmsToBackendWithInboundEndpointTestCase.java:47)

initialize

org.awaitility.core.ConditionTimeoutException: Condition with lambda expression in org.wso2.esb.integration.common.utils.CarbonLogReader that uses java.lang.Thread was not fulfilled within 5 seconds. at org.awaitility.core.ConditionAwaiter.await(ConditionAwaiter.java:145) at org.awaitility.core.CallableCondition.await(CallableCondition.java:79) at org.awaitility.core.CallableCondition.await(CallableCondition.java:27) at org.awaitility.core.ConditionFactory.until(ConditionFactory.java:902) at org.awaitility.core.ConditionFactory.until(ConditionFactory.java:860) at org.wso2.esb.integration.common.utils.CarbonLogReader.start(CarbonLogReader.java:85) at org.wso2.carbon.esb.jms.inbound.transport.test.ESBJAVA5094SetOperationContextWithInboundEndpointTestCase.initialize(ESBJAVA5094SetOperationContextWithInboundEndpointTestCase.java:83)

initialize

org.awaitility.core.ConditionTimeoutException: Condition with lambda expression in org.wso2.esb.integration.common.utils.CarbonLogReader that uses java.lang.Thread was not fulfilled within 5 seconds. at org.awaitility.core.ConditionAwaiter.await(ConditionAwaiter.java:145) at org.awaitility.core.CallableCondition.await(CallableCondition.java:79) at org.awaitility.core.CallableCondition.await(CallableCondition.java:27) at org.awaitility.core.ConditionFactory.until(ConditionFactory.java:902) at org.awaitility.core.ConditionFactory.until(ConditionFactory.java:860) at org.wso2.esb.integration.common.utils.CarbonLogReader.start(CarbonLogReader.java:85) at org.wso2.carbon.esb.jms.inbound.transport.test.JMSInboundRollbackTestCase.initialize(JMSInboundRollbackTestCase.java:45)

JMSInboundEndpointHeaderTest

java.lang.AssertionError: Log for transport header is not present in carbon log expected [true] but found [false] at org.testng.Assert.fail(Assert.java:93) at org.testng.Assert.failNotEquals(Assert.java:512) at org.testng.Assert.assertTrue(Assert.java:41) at org.wso2.carbon.esb.jms.inbound.transport.test.ESBJAVA4702JMSHeaderTest.JMSInboundEndpointHeaderTest(ESBJAVA4702JMSHeaderTest.java:55)

testJmsTypeHeaderWithInboundEndpoint

org.awaitility.core.ConditionTimeoutException: Condition with lambda expression in org.wso2.esb.integration.common.utils.CarbonLogReader that uses java.lang.Thread was not fulfilled within 5 seconds. at org.awaitility.core.ConditionAwaiter.await(ConditionAwaiter.java:145) at org.awaitility.core.CallableCondition.await(CallableCondition.java:79) at org.awaitility.core.CallableCondition.await(CallableCondition.java:27) at org.awaitility.core.ConditionFactory.until(ConditionFactory.java:902) at org.awaitility.core.ConditionFactory.until(ConditionFactory.java:860) at org.wso2.esb.integration.common.utils.CarbonLogReader.start(CarbonLogReader.java:85) at org.wso2.carbon.esb.jms.inbound.transport.test.JmsTypeHeaderInboundEndpointTestCase.testJmsTypeHeaderWithInboundEndpoint(JmsTypeHeaderInboundEndpointTestCase.java:58)

init

org.awaitility.core.ConditionTimeoutException: Condition with lambda expression in org.wso2.esb.integration.common.utils.CarbonLogReader that uses java.lang.Thread was not fulfilled within 5 seconds. at org.awaitility.core.ConditionAwaiter.await(ConditionAwaiter.java:145) at org.awaitility.core.CallableCondition.await(CallableCondition.java:79) at org.awaitility.core.CallableCondition.await(CallableCondition.java:27) at org.awaitility.core.ConditionFactory.until(ConditionFactory.java:902) at org.awaitility.core.ConditionFactory.until(ConditionFactory.java:860) at org.wso2.esb.integration.common.utils.CarbonLogReader.start(CarbonLogReader.java:85) at org.wso2.carbon.esb.jms.inbound.transport.test.JMSInboundMessageSupportTestCase.init(JMSInboundMessageSupportTestCase.java:53)

initialize

org.awaitility.core.ConditionTimeoutException: Condition with lambda expression in org.wso2.esb.integration.common.utils.CarbonLogReader that uses java.lang.Thread was not fulfilled within 5 seconds. at org.awaitility.core.ConditionAwaiter.await(ConditionAwaiter.java:145) at org.awaitility.core.CallableCondition.await(CallableCondition.java:79) at org.awaitility.core.CallableCondition.await(CallableCondition.java:27) at org.awaitility.core.ConditionFactory.until(ConditionFactory.java:902) at org.awaitility.core.ConditionFactory.until(ConditionFactory.java:860) at org.wso2.esb.integration.common.utils.CarbonLogReader.start(CarbonLogReader.java:85) at org.wso2.carbon.esb.mailto.transport.receiver.test.MailToTransportInvalidAddressTestCase.initialize(MailToTransportInvalidAddressTestCase.java:53)

testInboundEndpointMoveAfterProcessFTP

org.awaitility.core.ConditionTimeoutException: Condition with lambda expression in org.wso2.carbon.esb.file.inbound.transport.test.FtpInboundTransportTest that uses java.io.File was not fulfilled within 60 seconds. at org.awaitility.core.ConditionAwaiter.await(ConditionAwaiter.java:145) at org.awaitility.core.CallableCondition.await(CallableCondition.java:79) at org.awaitility.core.CallableCondition.await(CallableCondition.java:27) at org.awaitility.core.ConditionFactory.until(ConditionFactory.java:902) at org.awaitility.core.ConditionFactory.until(ConditionFactory.java:860) at org.wso2.carbon.esb.file.inbound.transport.test.FtpInboundTransportTest.testInboundEndpointMoveAfterProcessFTP(FtpInboundTransportTest.java:135)

testTransactionCommit

java.lang.AssertionError: Did not find the "Committed" log expected [true] but found [false] at org.testng.Assert.fail(Assert.java:93) at org.testng.Assert.failNotEquals(Assert.java:512) at org.testng.Assert.assertTrue(Assert.java:41) at org.wso2.carbon.esb.jms.inbound.transport.test.JMSInboundTransactionTestCase.testTransactionCommit(JMSInboundTransactionTestCase.java:68)

testTransactionRollBack

java.lang.AssertionError: Did not find the "Rollbacked" log expected [true] but found [false] at org.testng.Assert.fail(Assert.java:93) at org.testng.Assert.failNotEquals(Assert.java:512) at org.testng.Assert.assertTrue(Assert.java:41) at org.wso2.carbon.esb.jms.inbound.transport.test.JMSInboundTransactionTestCase.testTransactionRollBack(JMSInboundTransactionTestCase.java:90)

Environment Variables(68)17 different
Slave Information(90)9 different
Project Information(15)0 different

Module Builds

Success MI Integration Test Admin Clients6.5 sec
Success WSO2 Micro Integrator - Automation Extensions33 sec
Success DataServices Clients27 sec
Success MI Data Service Tests0.47 sec
Success WSO2 DataServices Integration Test0.48 sec
Success Mi DSS Integration Test Common0.48 sec
Success DS Samples Parent1.8 sec
Success MI Test Common Module40 sec
Success MI Integration Test Common Utils13 sec
Success WSO2 MI - Management API Tests1 min 16 sec
Success WSO2 Enterprise Integrator - Mediation Integration Tests0.47 sec
Success MI DSS Samples Parent0.44 sec
Success WSO2 Micro Integrator - Integration Tests5.5 sec
Success MI Integration Test Reporting6.1 sec
Success MI test Module-mediator-113 min
Success MI test Module-mediator-216 min
Success MI test Module-Other14 min
Success Mi test Module - Test Patches18 min
Success MI Test Module - Platform0.47 sec
Success MI test Module - Platform - RabbitMQ Transport6.3 sec
Success MI test Module - Sample2 min 39 sec
Success MI test Module-Service8 min 25 sec
Unstable MI test Module-Transport1 hr 33 min
Success MI test Module-Transport-21 min 2 sec
Success MI DSS Admin Clients2.9 sec
Success MI DSS Test Utils1.9 sec
Success MI DSS Tests1 min 18 sec
Success WSO2 MI - Samples48 sec
Failed MI test Module-Coordination4.5 sec
Success MI test Module-Transaction8.1 sec
Failed MI test Module - UserStore0.42 sec
Success MI Test Service Module1.8 sec