UnstableConsole Output

Skipping 36,826 KB.. Full Log
et employee by Id
PASSED: deleteOperation
        delete employees by id

===============================================
    DSS-service-syntax-tests
    Tests run: 8, Failures: 0, Skips: 0
===============================================

INFO  [org.wso2.carbon.automation.engine.testlisteners.TestManagerListener] - =================== Running the test method org.wso2.ei.dataservice.integration.test.faulty.service.FaultDBExceptionTestCase.testExceptionForUnavailableDB ===================
INFO  [org.wso2.ei.dataservice.integration.test.faulty.service.FaultDBExceptionTestCase] - Running faultServiceTestCase#testExceptionForUnavailableDB
INFO  [org.wso2.carbon.automation.extensions.servers.utils.ServerLogReader] - [2019-06-16 16:14:05,559] [micro-integrator] ERROR - DBInOutMessageReceiver Error in in-out message receiver
INFO  [org.wso2.carbon.automation.extensions.servers.utils.ServerLogReader] - DS Code: DATABASE_ERROR
INFO  [org.wso2.carbon.automation.extensions.servers.utils.ServerLogReader] - Nested Exception:-
INFO  [org.wso2.carbon.automation.extensions.servers.utils.ServerLogReader] - javax.xml.stream.XMLStreamException: DS Fault Message: Error in 'SQLQuery.processPreNormalQuery': DS Fault Message: Error in 'createProcessedPreparedStatement'
INFO  [org.wso2.carbon.automation.extensions.servers.utils.ServerLogReader] - DS Code: UNKNOWN_ERROR
INFO  [org.wso2.carbon.automation.extensions.servers.utils.ServerLogReader] - Nested Exception:-
INFO  [org.wso2.carbon.automation.extensions.servers.utils.ServerLogReader] - org.h2.jdbc.JdbcSQLException: Table "WRONG" not found; SQL statement:
INFO  [org.wso2.carbon.automation.extensions.servers.utils.ServerLogReader] - SELECT * FROM Wrong [42102-175]
INFO  [org.wso2.carbon.automation.extensions.servers.utils.ServerLogReader] - 
INFO  [org.wso2.carbon.automation.extensions.servers.utils.ServerLogReader] - DS Code: DATABASE_ERROR
INFO  [org.wso2.carbon.automation.extensions.servers.utils.ServerLogReader] - Source Data Service:-
INFO  [org.wso2.carbon.automation.extensions.servers.utils.ServerLogReader] - Name: FaultDBService
INFO  [org.wso2.carbon.automation.extensions.servers.utils.ServerLogReader] - Location: /FaultDBService.dbs
INFO  [org.wso2.carbon.automation.extensions.servers.utils.ServerLogReader] - Description: N/A
INFO  [org.wso2.carbon.automation.extensions.servers.utils.ServerLogReader] - Default Namespace: http://ws.wso2.org/dataservice
INFO  [org.wso2.carbon.automation.extensions.servers.utils.ServerLogReader] - Current Request Name: select_op_all_fields
INFO  [org.wso2.carbon.automation.extensions.servers.utils.ServerLogReader] - Current Params: {}
INFO  [org.wso2.carbon.automation.extensions.servers.utils.ServerLogReader] - Nested Exception:-
INFO  [org.wso2.carbon.automation.extensions.servers.utils.ServerLogReader] - DS Fault Message: Error in 'createProcessedPreparedStatement'
INFO  [org.wso2.carbon.automation.extensions.servers.utils.ServerLogReader] - DS Code: UNKNOWN_ERROR
INFO  [org.wso2.carbon.automation.extensions.servers.utils.ServerLogReader] - Nested Exception:-
INFO  [org.wso2.carbon.automation.extensions.servers.utils.ServerLogReader] - org.h2.jdbc.JdbcSQLException: Table "WRONG" not found; SQL statement:
INFO  [org.wso2.carbon.automation.extensions.servers.utils.ServerLogReader] - SELECT * FROM Wrong [42102-175]
INFO  [org.wso2.carbon.automation.extensions.servers.utils.ServerLogReader] - 
INFO  [org.wso2.carbon.automation.extensions.servers.utils.ServerLogReader] - 
INFO  [org.wso2.carbon.automation.extensions.servers.utils.ServerLogReader] - 
INFO  [org.wso2.carbon.automation.extensions.servers.utils.ServerLogReader] - 	at org.wso2.carbon.dataservices.core.dispatch.SingleDataServiceRequest.processRequest(SingleDataServiceRequest.java:75)
INFO  [org.wso2.carbon.automation.extensions.servers.utils.ServerLogReader] - 	at org.wso2.carbon.dataservices.core.dispatch.DataServiceRequest.dispatch(DataServiceRequest.java:359)
INFO  [org.wso2.carbon.automation.extensions.servers.utils.ServerLogReader] - 	at org.wso2.carbon.dataservices.core.DataServiceProcessor.dispatch(DataServiceProcessor.java:41)
INFO  [org.wso2.carbon.automation.extensions.servers.utils.ServerLogReader] - 	at org.wso2.carbon.dataservices.core.DBInOutMessageReceiver.invokeBusinessLogic(DBInOutMessageReceiver.java:82)
INFO  [org.wso2.carbon.automation.extensions.servers.utils.ServerLogReader] - 	at org.apache.axis2.receivers.AbstractInOutSyncMessageReceiver.invokeBusinessLogic(AbstractInOutSyncMessageReceiver.java:42)
INFO  [org.wso2.carbon.automation.extensions.servers.utils.ServerLogReader] - 	at org.apache.axis2.receivers.AbstractMessageReceiver.receive(AbstractMessageReceiver.java:110)
INFO  [org.wso2.carbon.automation.extensions.servers.utils.ServerLogReader] - 	at org.apache.axis2.engine.AxisEngine.receive(AxisEngine.java:180)
INFO  [org.wso2.carbon.automation.extensions.servers.utils.ServerLogReader] - 	at org.apache.synapse.transport.passthru.ServerWorker.processEntityEnclosingRequest(ServerWorker.java:415)
INFO  [org.wso2.carbon.automation.extensions.servers.utils.ServerLogReader] - 	at org.apache.synapse.transport.passthru.ServerWorker.run(ServerWorker.java:152)
INFO  [org.wso2.carbon.automation.extensions.servers.utils.ServerLogReader] - 	at org.apache.axis2.transport.base.threads.NativeWorkerPool$1.run(NativeWorkerPool.java:172)
INFO  [org.wso2.carbon.automation.extensions.servers.utils.ServerLogReader] - 	at java.util.concurrent.ThreadPoolExecutor.runWorker(ThreadPoolExecutor.java:1149)
INFO  [org.wso2.carbon.automation.extensions.servers.utils.ServerLogReader] - 	at java.util.concurrent.ThreadPoolExecutor$Worker.run(ThreadPoolExecutor.java:624)
INFO  [org.wso2.carbon.automation.extensions.servers.utils.ServerLogReader] - 	at java.lang.Thread.run(Thread.java:748)
INFO  [org.wso2.carbon.automation.extensions.servers.utils.ServerLogReader] - Caused by: javax.xml.stream.XMLStreamException: DS Fault Message: Error in 'SQLQuery.processPreNormalQuery': DS Fault Message: Error in 'createProcessedPreparedStatement'
INFO  [org.wso2.carbon.automation.extensions.servers.utils.ServerLogReader] - DS Code: UNKNOWN_ERROR
INFO  [org.wso2.carbon.automation.extensions.servers.utils.ServerLogReader] - Nested Exception:-
INFO  [org.wso2.carbon.automation.extensions.servers.utils.ServerLogReader] - org.h2.jdbc.JdbcSQLException: Table "WRONG" not found; SQL statement:
INFO  [org.wso2.carbon.automation.extensions.servers.utils.ServerLogReader] - SELECT * FROM Wrong [42102-175]
INFO  [org.wso2.carbon.automation.extensions.servers.utils.ServerLogReader] - 
INFO  [org.wso2.carbon.automation.extensions.servers.utils.ServerLogReader] - DS Code: DATABASE_ERROR
INFO  [org.wso2.carbon.automation.extensions.servers.utils.ServerLogReader] - Source Data Service:-
INFO  [org.wso2.carbon.automation.extensions.servers.utils.ServerLogReader] - Name: FaultDBService
INFO  [org.wso2.carbon.automation.extensions.servers.utils.ServerLogReader] - Location: /FaultDBService.dbs
INFO  [org.wso2.carbon.automation.extensions.servers.utils.ServerLogReader] - Description: N/A
INFO  [org.wso2.carbon.automation.extensions.servers.utils.ServerLogReader] - Default Namespace: http://ws.wso2.org/dataservice
INFO  [org.wso2.carbon.automation.extensions.servers.utils.ServerLogReader] - Current Request Name: select_op_all_fields
INFO  [org.wso2.carbon.automation.extensions.servers.utils.ServerLogReader] - Current Params: {}
INFO  [org.wso2.carbon.automation.extensions.servers.utils.ServerLogReader] - Nested Exception:-
INFO  [org.wso2.carbon.automation.extensions.servers.utils.ServerLogReader] - DS Fault Message: Error in 'createProcessedPreparedStatement'
INFO  [org.wso2.carbon.automation.extensions.servers.utils.ServerLogReader] - DS Code: UNKNOWN_ERROR
INFO  [org.wso2.carbon.automation.extensions.servers.utils.ServerLogReader] - Nested Exception:-
INFO  [org.wso2.carbon.automation.extensions.servers.utils.ServerLogReader] - org.h2.jdbc.JdbcSQLException: Table "WRONG" not found; SQL statement:
INFO  [org.wso2.carbon.automation.extensions.servers.utils.ServerLogReader] - SELECT * FROM Wrong [42102-175]
INFO  [org.wso2.carbon.automation.extensions.servers.utils.ServerLogReader] - 
INFO  [org.wso2.carbon.automation.extensions.servers.utils.ServerLogReader] - 
INFO  [org.wso2.carbon.automation.extensions.servers.utils.ServerLogReader] - 	at org.wso2.carbon.dataservices.core.engine.DSOMDataSource.execute(DSOMDataSource.java:102)
INFO  [org.wso2.carbon.automation.extensions.servers.utils.ServerLogReader] - 	at org.wso2.carbon.dataservices.core.dispatch.SingleDataServiceRequest.processRequest(SingleDataServiceRequest.java:73)
INFO  [org.wso2.carbon.automation.extensions.servers.utils.ServerLogReader] - 	... 12 more
INFO  [org.wso2.carbon.automation.extensions.servers.utils.ServerLogReader] - [2019-06-16 16:14:05,560] [micro-integrator] ERROR - ServerWorker Error processing POST request for : /services/FaultDBService
INFO  [org.wso2.carbon.automation.extensions.servers.utils.ServerLogReader] - org.apache.axis2.AxisFault: DS Code: DATABASE_ERROR
INFO  [org.wso2.carbon.automation.extensions.servers.utils.ServerLogReader] - Nested Exception:-
INFO  [org.wso2.carbon.automation.extensions.servers.utils.ServerLogReader] - javax.xml.stream.XMLStreamException: DS Fault Message: Error in 'SQLQuery.processPreNormalQuery': DS Fault Message: Error in 'createProcessedPreparedStatement'
INFO  [org.wso2.carbon.automation.extensions.servers.utils.ServerLogReader] - DS Code: UNKNOWN_ERROR
INFO  [org.wso2.carbon.automation.extensions.servers.utils.ServerLogReader] - Nested Exception:-
INFO  [org.wso2.carbon.automation.extensions.servers.utils.ServerLogReader] - org.h2.jdbc.JdbcSQLException: Table "WRONG" not found; SQL statement:
INFO  [org.wso2.carbon.automation.extensions.servers.utils.ServerLogReader] - SELECT * FROM Wrong [42102-175]
INFO  [org.wso2.carbon.automation.extensions.servers.utils.ServerLogReader] - 
INFO  [org.wso2.carbon.automation.extensions.servers.utils.ServerLogReader] - DS Code: DATABASE_ERROR
INFO  [org.wso2.carbon.automation.extensions.servers.utils.ServerLogReader] - Source Data Service:-
INFO  [org.wso2.carbon.automation.extensions.servers.utils.ServerLogReader] - Name: FaultDBService
INFO  [org.wso2.carbon.automation.extensions.servers.utils.ServerLogReader] - Location: /FaultDBService.dbs
INFO  [org.wso2.carbon.automation.extensions.servers.utils.ServerLogReader] - Description: N/A
INFO  [org.wso2.carbon.automation.extensions.servers.utils.ServerLogReader] - Default Namespace: http://ws.wso2.org/dataservice
INFO  [org.wso2.carbon.automation.extensions.servers.utils.ServerLogReader] - Current Request Name: select_op_all_fields
INFO  [org.wso2.carbon.automation.extensions.servers.utils.ServerLogReader] - Current Params: {}
INFO  [org.wso2.carbon.automation.extensions.servers.utils.ServerLogReader] - Nested Exception:-
INFO  [org.wso2.carbon.automation.extensions.servers.utils.ServerLogReader] - DS Fault Message: Error in 'createProcessedPreparedStatement'
INFO  [org.wso2.carbon.automation.extensions.servers.utils.ServerLogReader] - DS Code: UNKNOWN_ERROR
INFO  [org.wso2.carbon.automation.extensions.servers.utils.ServerLogReader] - Nested Exception:-
INFO  [org.wso2.carbon.automation.extensions.servers.utils.ServerLogReader] - org.h2.jdbc.JdbcSQLException: Table "WRONG" not found; SQL statement:
INFO  [org.wso2.carbon.automation.extensions.servers.utils.ServerLogReader] - SELECT * FROM Wrong [42102-175]
INFO  [org.wso2.carbon.automation.extensions.servers.utils.ServerLogReader] - 
INFO  [org.wso2.carbon.automation.extensions.servers.utils.ServerLogReader] - 
INFO  [org.wso2.carbon.automation.extensions.servers.utils.ServerLogReader] - 
INFO  [org.wso2.carbon.automation.extensions.servers.utils.ServerLogReader] - 	at org.wso2.carbon.dataservices.core.DBUtils.createAxisFault(DBUtils.java:801)
INFO  [org.wso2.carbon.automation.extensions.servers.utils.ServerLogReader] - 	at org.wso2.carbon.dataservices.core.DBInOutMessageReceiver.invokeBusinessLogic(DBInOutMessageReceiver.java:96)
INFO  [org.wso2.carbon.automation.extensions.servers.utils.ServerLogReader] - 	at org.apache.axis2.receivers.AbstractInOutSyncMessageReceiver.invokeBusinessLogic(AbstractInOutSyncMessageReceiver.java:42)
INFO  [org.wso2.carbon.automation.extensions.servers.utils.ServerLogReader] - 	at org.apache.axis2.receivers.AbstractMessageReceiver.receive(AbstractMessageReceiver.java:110)
INFO  [org.wso2.carbon.automation.extensions.servers.utils.ServerLogReader] - 	at org.apache.axis2.engine.AxisEngine.receive(AxisEngine.java:180)
INFO  [org.wso2.carbon.automation.extensions.servers.utils.ServerLogReader] - 	at org.apache.synapse.transport.passthru.ServerWorker.processEntityEnclosingRequest(ServerWorker.java:415)
INFO  [org.wso2.carbon.automation.extensions.servers.utils.ServerLogReader] - 	at org.apache.synapse.transport.passthru.ServerWorker.run(ServerWorker.java:152)
INFO  [org.wso2.carbon.automation.extensions.servers.utils.ServerLogReader] - 	at org.apache.axis2.transport.base.threads.NativeWorkerPool$1.run(NativeWorkerPool.java:172)
INFO  [org.wso2.carbon.automation.extensions.servers.utils.ServerLogReader] - 	at java.util.concurrent.ThreadPoolExecutor.runWorker(ThreadPoolExecutor.java:1149)
INFO  [org.wso2.carbon.automation.extensions.servers.utils.ServerLogReader] - 	at java.util.concurrent.ThreadPoolExecutor$Worker.run(ThreadPoolExecutor.java:624)
INFO  [org.wso2.carbon.automation.extensions.servers.utils.ServerLogReader] - 	at java.lang.Thread.run(Thread.java:748)
INFO  [org.wso2.carbon.automation.extensions.servers.utils.ServerLogReader] - Caused by: javax.xml.stream.XMLStreamException: DS Fault Message: Error in 'SQLQuery.processPreNormalQuery': DS Fault Message: Error in 'createProcessedPreparedStatement'
INFO  [org.wso2.carbon.automation.extensions.servers.utils.ServerLogReader] - DS Code: UNKNOWN_ERROR
INFO  [org.wso2.carbon.automation.extensions.servers.utils.ServerLogReader] - Nested Exception:-
INFO  [org.wso2.carbon.automation.extensions.servers.utils.ServerLogReader] - org.h2.jdbc.JdbcSQLException: Table "WRONG" not found; SQL statement:
INFO  [org.wso2.carbon.automation.extensions.servers.utils.ServerLogReader] - SELECT * FROM Wrong [42102-175]
INFO  [org.wso2.carbon.automation.extensions.servers.utils.ServerLogReader] - 
INFO  [org.wso2.carbon.automation.extensions.servers.utils.ServerLogReader] - DS Code: DATABASE_ERROR
INFO  [org.wso2.carbon.automation.extensions.servers.utils.ServerLogReader] - Source Data Service:-
INFO  [org.wso2.carbon.automation.extensions.servers.utils.ServerLogReader] - Name: FaultDBService
INFO  [org.wso2.carbon.automation.extensions.servers.utils.ServerLogReader] - Location: /FaultDBService.dbs
INFO  [org.wso2.carbon.automation.extensions.servers.utils.ServerLogReader] - Description: N/A
INFO  [org.wso2.carbon.automation.extensions.servers.utils.ServerLogReader] - Default Namespace: http://ws.wso2.org/dataservice
INFO  [org.wso2.carbon.automation.extensions.servers.utils.ServerLogReader] - Current Request Name: select_op_all_fields
INFO  [org.wso2.carbon.automation.extensions.servers.utils.ServerLogReader] - Current Params: {}
INFO  [org.wso2.carbon.automation.extensions.servers.utils.ServerLogReader] - Nested Exception:-
INFO  [org.wso2.carbon.automation.extensions.servers.utils.ServerLogReader] - DS Fault Message: Error in 'createProcessedPreparedStatement'
INFO  [org.wso2.carbon.automation.extensions.servers.utils.ServerLogReader] - DS Code: UNKNOWN_ERROR
INFO  [org.wso2.carbon.automation.extensions.servers.utils.ServerLogReader] - Nested Exception:-
INFO  [org.wso2.carbon.automation.extensions.servers.utils.ServerLogReader] - org.h2.jdbc.JdbcSQLException: Table "WRONG" not found; SQL statement:
INFO  [org.wso2.carbon.automation.extensions.servers.utils.ServerLogReader] - SELECT * FROM Wrong [42102-175]
INFO  [org.wso2.carbon.automation.extensions.servers.utils.ServerLogReader] - 
INFO  [org.wso2.carbon.automation.extensions.servers.utils.ServerLogReader] - 
INFO  [org.wso2.carbon.automation.extensions.servers.utils.ServerLogReader] - 	at org.wso2.carbon.dataservices.core.engine.DSOMDataSource.execute(DSOMDataSource.java:102)
INFO  [org.wso2.carbon.automation.extensions.servers.utils.ServerLogReader] - 	at org.wso2.carbon.dataservices.core.dispatch.SingleDataServiceRequest.processRequest(SingleDataServiceRequest.java:73)
INFO  [org.wso2.carbon.automation.extensions.servers.utils.ServerLogReader] - 	at org.wso2.carbon.dataservices.core.dispatch.DataServiceRequest.dispatch(DataServiceRequest.java:359)
INFO  [org.wso2.carbon.automation.extensions.servers.utils.ServerLogReader] - 	at org.wso2.carbon.dataservices.core.DataServiceProcessor.dispatch(DataServiceProcessor.java:41)
INFO  [org.wso2.carbon.automation.extensions.servers.utils.ServerLogReader] - 	at org.wso2.carbon.dataservices.core.DBInOutMessageReceiver.invokeBusinessLogic(DBInOutMessageReceiver.java:82)
INFO  [org.wso2.carbon.automation.extensions.servers.utils.ServerLogReader] - 	... 9 more
INFO  [org.wso2.carbon.automation.engine.testlisteners.TestManagerListener] - =================== On test success org.wso2.ei.dataservice.integration.test.faulty.service.FaultDBExceptionTestCase.testExceptionForUnavailableDB ===================
INFO  [org.wso2.carbon.automation.engine.testlisteners.TestManagerListener] - =================== Running the test method org.wso2.ei.dataservice.integration.test.faulty.service.InvalidClosingTagUnDeployedServiceTestCase.testDeployService ===================
INFO  [org.wso2.carbon.automation.extensions.servers.utils.ServerLogReader] - [2019-06-16 16:14:05,679] [micro-integrator]  INFO - LogMediator main sequence executed for call to non-existent = /services/FaultyDataService
INFO  [org.apache.axis2.transport.http.HTTPSender] - Unable to sendViaPost to url[http://localhost:8480/services/FaultyDataService]
org.apache.axis2.AxisFault: Transport error: 404 Error: Not Found
	at org.apache.axis2.transport.http.HTTPSender.handleResponse(HTTPSender.java:371)
	at org.apache.axis2.transport.http.HTTPSender.sendViaPost(HTTPSender.java:200)
	at org.apache.axis2.transport.http.HTTPSender.send(HTTPSender.java:81)
	at org.apache.axis2.transport.http.CommonsHTTPTransportSender.writeMessageWithCommons(CommonsHTTPTransportSender.java:459)
	at org.apache.axis2.transport.http.CommonsHTTPTransportSender.invoke(CommonsHTTPTransportSender.java:286)
	at org.apache.axis2.engine.AxisEngine.send(AxisEngine.java:442)
	at org.apache.axis2.description.OutInAxisOperationClient.send(OutInAxisOperation.java:442)
	at org.apache.axis2.description.OutInAxisOperationClient.executeImpl(OutInAxisOperation.java:228)
	at org.apache.axis2.client.OperationClient.execute(OperationClient.java:149)
	at org.apache.axis2.client.ServiceClient.sendReceive(ServiceClient.java:554)
	at org.apache.axis2.client.ServiceClient.sendReceive(ServiceClient.java:530)
	at org.wso2.esb.integration.common.utils.clients.axis2client.AxisServiceClient.sendReceive(AxisServiceClient.java:53)
	at org.wso2.ei.dataservice.integration.test.faulty.service.InvalidClosingTagUnDeployedServiceTestCase.testDeployService(InvalidClosingTagUnDeployedServiceTestCase.java:42)
	at sun.reflect.NativeMethodAccessorImpl.invoke0(Native Method)
	at sun.reflect.NativeMethodAccessorImpl.invoke(NativeMethodAccessorImpl.java:62)
	at sun.reflect.DelegatingMethodAccessorImpl.invoke(DelegatingMethodAccessorImpl.java:43)
	at java.lang.reflect.Method.invoke(Method.java:498)
	at org.testng.internal.MethodInvocationHelper.invokeMethod(MethodInvocationHelper.java:108)
	at org.testng.internal.Invoker.invokeMethod(Invoker.java:661)
	at org.testng.internal.Invoker.invokeTestMethod(Invoker.java:869)
	at org.testng.internal.Invoker.invokeTestMethods(Invoker.java:1193)
	at org.testng.internal.TestMethodWorker.invokeTestMethods(TestMethodWorker.java:126)
	at org.testng.internal.TestMethodWorker.run(TestMethodWorker.java:109)
	at org.testng.TestRunner.privateRun(TestRunner.java:744)
	at org.testng.TestRunner.run(TestRunner.java:602)
	at org.testng.SuiteRunner.runTest(SuiteRunner.java:380)
	at org.testng.SuiteRunner.runSequentially(SuiteRunner.java:375)
	at org.testng.SuiteRunner.privateRun(SuiteRunner.java:340)
	at org.testng.SuiteRunner.run(SuiteRunner.java:289)
	at org.testng.SuiteRunnerWorker.runSuite(SuiteRunnerWorker.java:52)
	at org.testng.SuiteRunnerWorker.run(SuiteRunnerWorker.java:86)
	at org.testng.TestNG.runSuitesSequentially(TestNG.java:1301)
	at org.testng.TestNG.runSuitesLocally(TestNG.java:1226)
	at org.testng.TestNG.runSuites(TestNG.java:1144)
	at org.testng.TestNG.run(TestNG.java:1115)
	at org.apache.maven.surefire.testng.TestNGExecutor.run(TestNGExecutor.java:178)
	at org.apache.maven.surefire.testng.TestNGXmlTestSuite.execute(TestNGXmlTestSuite.java:92)
	at org.apache.maven.surefire.testng.TestNGProvider.invoke(TestNGProvider.java:96)
	at sun.reflect.NativeMethodAccessorImpl.invoke0(Native Method)
	at sun.reflect.NativeMethodAccessorImpl.invoke(NativeMethodAccessorImpl.java:62)
	at sun.reflect.DelegatingMethodAccessorImpl.invoke(DelegatingMethodAccessorImpl.java:43)
	at java.lang.reflect.Method.invoke(Method.java:498)
	at org.apache.maven.surefire.util.ReflectionUtils.invokeMethodWithArray(ReflectionUtils.java:189)
	at org.apache.maven.surefire.booter.ProviderFactory$ProviderProxy.invoke(ProviderFactory.java:165)
	at org.apache.maven.surefire.booter.ProviderFactory.invokeProvider(ProviderFactory.java:85)
	at org.apache.maven.surefire.booter.ForkedBooter.runSuitesInProcess(ForkedBooter.java:115)
	at org.apache.maven.surefire.booter.ForkedBooter.main(ForkedBooter.java:75)
ERROR [org.wso2.esb.integration.common.utils.clients.axis2client.AxisServiceClient] - Transport error: 404 Error: Not Found
INFO  [org.wso2.carbon.automation.engine.testlisteners.TestManagerListener] - =================== On test success org.wso2.ei.dataservice.integration.test.faulty.service.InvalidClosingTagUnDeployedServiceTestCase.testDeployService ===================
PASSED: testExceptionForUnavailableDB
        Checking the Exception returned from DSS when Database/table does not exist for the data service
PASSED: testDeployService
        deploy invalid dbs

===============================================
    DSS-faulty-service-tests
    Tests run: 2, Failures: 0, Skips: 0
===============================================


===============================================
    DSS-samples-tests
    Tests run: 0, Failures: 0, Skips: 0
===============================================

INFO  [org.wso2.carbon.automation.engine.testlisteners.TestManagerListener] - =================== Running the test method org.wso2.ei.dataservice.integration.test.requestBox.RequestBoxTestCase.requestBoxFailRequests ===================
WARN  [org.apache.commons.httpclient.HttpMethodBase] - Going to buffer response body of large or unknown size. Using getResponseBodyAsStream instead is recommended.
INFO  [org.wso2.carbon.automation.extensions.servers.utils.ServerLogReader] - [2019-06-16 16:14:05,853] [micro-integrator] ERROR - DBInOutMessageReceiver Error in in-out message receiver
INFO  [org.wso2.carbon.automation.extensions.servers.utils.ServerLogReader] - DS Fault Message: Error in DS non result invoke.
INFO  [org.wso2.carbon.automation.extensions.servers.utils.ServerLogReader] - DS Code: DATABASE_ERROR
INFO  [org.wso2.carbon.automation.extensions.servers.utils.ServerLogReader] - Nested Exception:-
INFO  [org.wso2.carbon.automation.extensions.servers.utils.ServerLogReader] - javax.xml.stream.XMLStreamException: DS Fault Message: Error in 'SQLQuery.processPreNormalQuery': Unique index or primary key violation: "PRODUCTS_PK ON PUBLIC.PRODUCTS(PRODUCTCODE) VALUES ( /* 2 */ 'productCode100' )"; SQL statement:
INFO  [org.wso2.carbon.automation.extensions.servers.utils.ServerLogReader] - INSERT INTO Products VALUES(?,?,?,?,?) [23505-175]
INFO  [org.wso2.carbon.automation.extensions.servers.utils.ServerLogReader] - DS Code: DATABASE_ERROR
INFO  [org.wso2.carbon.automation.extensions.servers.utils.ServerLogReader] - Source Data Service:-
INFO  [org.wso2.carbon.automation.extensions.servers.utils.ServerLogReader] - Name: RequestBoxTest
INFO  [org.wso2.carbon.automation.extensions.servers.utils.ServerLogReader] - Location: /RequestBoxTest.dbs
INFO  [org.wso2.carbon.automation.extensions.servers.utils.ServerLogReader] - Description: N/A
INFO  [org.wso2.carbon.automation.extensions.servers.utils.ServerLogReader] - Default Namespace: http://ws.wso2.org/dataservice/samples/rdbms_sample
INFO  [org.wso2.carbon.automation.extensions.servers.utils.ServerLogReader] - Current Request Name: insert_into_products_operation
INFO  [org.wso2.carbon.automation.extensions.servers.utils.ServerLogReader] - Current Params: {productLine=productLine100, quantityInStock=1580, productCode=productCode100, productName=productName100, productDescription=productDescription100}
INFO  [org.wso2.carbon.automation.extensions.servers.utils.ServerLogReader] - Nested Exception:-
INFO  [org.wso2.carbon.automation.extensions.servers.utils.ServerLogReader] - org.h2.jdbc.JdbcSQLException: Unique index or primary key violation: "PRODUCTS_PK ON PUBLIC.PRODUCTS(PRODUCTCODE) VALUES ( /* 2 */ 'productCode100' )"; SQL statement:
INFO  [org.wso2.carbon.automation.extensions.servers.utils.ServerLogReader] - INSERT INTO Products VALUES(?,?,?,?,?) [23505-175]
INFO  [org.wso2.carbon.automation.extensions.servers.utils.ServerLogReader] - 
INFO  [org.wso2.carbon.automation.extensions.servers.utils.ServerLogReader] - 
INFO  [org.wso2.carbon.automation.extensions.servers.utils.ServerLogReader] - 	at org.wso2.carbon.dataservices.core.dispatch.SingleDataServiceRequest.processSingleRequest(SingleDataServiceRequest.java:118)
INFO  [org.wso2.carbon.automation.extensions.servers.utils.ServerLogReader] - 	at org.wso2.carbon.dataservices.core.dispatch.SingleDataServiceRequest.processRequest(SingleDataServiceRequest.java:67)
INFO  [org.wso2.carbon.automation.extensions.servers.utils.ServerLogReader] - 	at org.wso2.carbon.dataservices.core.dispatch.DataServiceRequest.dispatch(DataServiceRequest.java:359)
INFO  [org.wso2.carbon.automation.extensions.servers.utils.ServerLogReader] - 	at org.wso2.carbon.dataservices.core.boxcarring.RequestBox.execute(RequestBox.java:66)
INFO  [org.wso2.carbon.automation.extensions.servers.utils.ServerLogReader] - 	at org.wso2.carbon.dataservices.core.dispatch.RequestBoxRequest.processRequest(RequestBoxRequest.java:70)
INFO  [org.wso2.carbon.automation.extensions.servers.utils.ServerLogReader] - 	at org.wso2.carbon.dataservices.core.dispatch.DataServiceRequest.dispatch(DataServiceRequest.java:359)
INFO  [org.wso2.carbon.automation.extensions.servers.utils.ServerLogReader] - 	at org.wso2.carbon.dataservices.core.DataServiceProcessor.dispatch(DataServiceProcessor.java:41)
INFO  [org.wso2.carbon.automation.extensions.servers.utils.ServerLogReader] - 	at org.wso2.carbon.dataservices.core.DBInOutMessageReceiver.invokeBusinessLogic(DBInOutMessageReceiver.java:82)
INFO  [org.wso2.carbon.automation.extensions.servers.utils.ServerLogReader] - 	at org.apache.axis2.receivers.AbstractInOutSyncMessageReceiver.invokeBusinessLogic(AbstractInOutSyncMessageReceiver.java:42)
INFO  [org.wso2.carbon.automation.extensions.servers.utils.ServerLogReader] - 	at org.apache.axis2.receivers.AbstractMessageReceiver.receive(AbstractMessageReceiver.java:110)
INFO  [org.wso2.carbon.automation.extensions.servers.utils.ServerLogReader] - 	at org.apache.axis2.engine.AxisEngine.receive(AxisEngine.java:180)
INFO  [org.wso2.carbon.automation.extensions.servers.utils.ServerLogReader] - 	at org.apache.synapse.transport.passthru.ServerWorker.processEntityEnclosingRequest(ServerWorker.java:415)
INFO  [org.wso2.carbon.automation.extensions.servers.utils.ServerLogReader] - 	at org.apache.synapse.transport.passthru.ServerWorker.run(ServerWorker.java:152)
INFO  [org.wso2.carbon.automation.extensions.servers.utils.ServerLogReader] - 	at org.apache.axis2.transport.base.threads.NativeWorkerPool$1.run(NativeWorkerPool.java:172)
INFO  [org.wso2.carbon.automation.extensions.servers.utils.ServerLogReader] - 	at java.util.concurrent.ThreadPoolExecutor.runWorker(ThreadPoolExecutor.java:1149)
INFO  [org.wso2.carbon.automation.extensions.servers.utils.ServerLogReader] - 	at java.util.concurrent.ThreadPoolExecutor$Worker.run(ThreadPoolExecutor.java:624)
INFO  [org.wso2.carbon.automation.extensions.servers.utils.ServerLogReader] - 	at java.lang.Thread.run(Thread.java:748)
INFO  [org.wso2.carbon.automation.extensions.servers.utils.ServerLogReader] - Caused by: javax.xml.stream.XMLStreamException: DS Fault Message: Error in 'SQLQuery.processPreNormalQuery': Unique index or primary key violation: "PRODUCTS_PK ON PUBLIC.PRODUCTS(PRODUCTCODE) VALUES ( /* 2 */ 'productCode100' )"; SQL statement:
INFO  [org.wso2.carbon.automation.extensions.servers.utils.ServerLogReader] - INSERT INTO Products VALUES(?,?,?,?,?) [23505-175]
INFO  [org.wso2.carbon.automation.extensions.servers.utils.ServerLogReader] - DS Code: DATABASE_ERROR
INFO  [org.wso2.carbon.automation.extensions.servers.utils.ServerLogReader] - Source Data Service:-
INFO  [org.wso2.carbon.automation.extensions.servers.utils.ServerLogReader] - Name: RequestBoxTest
INFO  [org.wso2.carbon.automation.extensions.servers.utils.ServerLogReader] - Location: /RequestBoxTest.dbs
INFO  [org.wso2.carbon.automation.extensions.servers.utils.ServerLogReader] - Description: N/A
INFO  [org.wso2.carbon.automation.extensions.servers.utils.ServerLogReader] - Default Namespace: http://ws.wso2.org/dataservice/samples/rdbms_sample
INFO  [org.wso2.carbon.automation.extensions.servers.utils.ServerLogReader] - Current Request Name: insert_into_products_operation
INFO  [org.wso2.carbon.automation.extensions.servers.utils.ServerLogReader] - Current Params: {productLine=productLine100, quantityInStock=1580, productCode=productCode100, productName=productName100, productDescription=productDescription100}
INFO  [org.wso2.carbon.automation.extensions.servers.utils.ServerLogReader] - Nested Exception:-
INFO  [org.wso2.carbon.automation.extensions.servers.utils.ServerLogReader] - org.h2.jdbc.JdbcSQLException: Unique index or primary key violation: "PRODUCTS_PK ON PUBLIC.PRODUCTS(PRODUCTCODE) VALUES ( /* 2 */ 'productCode100' )"; SQL statement:
INFO  [org.wso2.carbon.automation.extensions.servers.utils.ServerLogReader] - INSERT INTO Products VALUES(?,?,?,?,?) [23505-175]
INFO  [org.wso2.carbon.automation.extensions.servers.utils.ServerLogReader] - 
INFO  [org.wso2.carbon.automation.extensions.servers.utils.ServerLogReader] - 	at org.wso2.carbon.dataservices.core.engine.DSOMDataSource.execute(DSOMDataSource.java:102)
INFO  [org.wso2.carbon.automation.extensions.servers.utils.ServerLogReader] - 	at org.wso2.carbon.dataservices.core.engine.DSOMDataSource.serialize(DSOMDataSource.java:107)
INFO  [org.wso2.carbon.automation.extensions.servers.utils.ServerLogReader] - 	at org.wso2.carbon.dataservices.core.engine.DSOMDataSource.executeInOnly(DSOMDataSource.java:80)
INFO  [org.wso2.carbon.automation.extensions.servers.utils.ServerLogReader] - 	at org.wso2.carbon.dataservices.core.dispatch.SingleDataServiceRequest.processSingleRequest(SingleDataServiceRequest.java:116)
INFO  [org.wso2.carbon.automation.extensions.servers.utils.ServerLogReader] - 	... 16 more
INFO  [org.wso2.carbon.automation.extensions.servers.utils.ServerLogReader] - [2019-06-16 16:14:05,855] [micro-integrator] ERROR - ServerWorker Error processing POST request for : /services/RequestBoxTest
INFO  [org.wso2.carbon.automation.extensions.servers.utils.ServerLogReader] - org.apache.axis2.AxisFault: DS Fault Message: Error in DS non result invoke.
INFO  [org.wso2.carbon.automation.extensions.servers.utils.ServerLogReader] - DS Code: DATABASE_ERROR
INFO  [org.wso2.carbon.automation.extensions.servers.utils.ServerLogReader] - Nested Exception:-
INFO  [org.wso2.carbon.automation.extensions.servers.utils.ServerLogReader] - javax.xml.stream.XMLStreamException: DS Fault Message: Error in 'SQLQuery.processPreNormalQuery': Unique index or primary key violation: "PRODUCTS_PK ON PUBLIC.PRODUCTS(PRODUCTCODE) VALUES ( /* 2 */ 'productCode100' )"; SQL statement:
INFO  [org.wso2.carbon.automation.extensions.servers.utils.ServerLogReader] - INSERT INTO Products VALUES(?,?,?,?,?) [23505-175]
INFO  [org.wso2.carbon.automation.extensions.servers.utils.ServerLogReader] - DS Code: DATABASE_ERROR
INFO  [org.wso2.carbon.automation.extensions.servers.utils.ServerLogReader] - Source Data Service:-
INFO  [org.wso2.carbon.automation.extensions.servers.utils.ServerLogReader] - Name: RequestBoxTest
INFO  [org.wso2.carbon.automation.extensions.servers.utils.ServerLogReader] - Location: /RequestBoxTest.dbs
INFO  [org.wso2.carbon.automation.extensions.servers.utils.ServerLogReader] - Description: N/A
INFO  [org.wso2.carbon.automation.extensions.servers.utils.ServerLogReader] - Default Namespace: http://ws.wso2.org/dataservice/samples/rdbms_sample
INFO  [org.wso2.carbon.automation.extensions.servers.utils.ServerLogReader] - Current Request Name: insert_into_products_operation
INFO  [org.wso2.carbon.automation.extensions.servers.utils.ServerLogReader] - Current Params: {productLine=productLine100, quantityInStock=1580, productCode=productCode100, productName=productName100, productDescription=productDescription100}
INFO  [org.wso2.carbon.automation.extensions.servers.utils.ServerLogReader] - Nested Exception:-
INFO  [org.wso2.carbon.automation.extensions.servers.utils.ServerLogReader] - org.h2.jdbc.JdbcSQLException: Unique index or primary key violation: "PRODUCTS_PK ON PUBLIC.PRODUCTS(PRODUCTCODE) VALUES ( /* 2 */ 'productCode100' )"; SQL statement:
INFO  [org.wso2.carbon.automation.extensions.servers.utils.ServerLogReader] - INSERT INTO Products VALUES(?,?,?,?,?) [23505-175]
INFO  [org.wso2.carbon.automation.extensions.servers.utils.ServerLogReader] - 
INFO  [org.wso2.carbon.automation.extensions.servers.utils.ServerLogReader] - 
INFO  [org.wso2.carbon.automation.extensions.servers.utils.ServerLogReader] - 	at org.wso2.carbon.dataservices.core.DBUtils.createAxisFault(DBUtils.java:801)
INFO  [org.wso2.carbon.automation.extensions.servers.utils.ServerLogReader] - 	at org.wso2.carbon.dataservices.core.DBInOutMessageReceiver.invokeBusinessLogic(DBInOutMessageReceiver.java:96)
INFO  [org.wso2.carbon.automation.extensions.servers.utils.ServerLogReader] - 	at org.apache.axis2.receivers.AbstractInOutSyncMessageReceiver.invokeBusinessLogic(AbstractInOutSyncMessageReceiver.java:42)
INFO  [org.wso2.carbon.automation.extensions.servers.utils.ServerLogReader] - 	at org.apache.axis2.receivers.AbstractMessageReceiver.receive(AbstractMessageReceiver.java:110)
INFO  [org.wso2.carbon.automation.extensions.servers.utils.ServerLogReader] - 	at org.apache.axis2.engine.AxisEngine.receive(AxisEngine.java:180)
INFO  [org.wso2.carbon.automation.extensions.servers.utils.ServerLogReader] - 	at org.apache.synapse.transport.passthru.ServerWorker.processEntityEnclosingRequest(ServerWorker.java:415)
INFO  [org.wso2.carbon.automation.extensions.servers.utils.ServerLogReader] - 	at org.apache.synapse.transport.passthru.ServerWorker.run(ServerWorker.java:152)
INFO  [org.wso2.carbon.automation.extensions.servers.utils.ServerLogReader] - 	at org.apache.axis2.transport.base.threads.NativeWorkerPool$1.run(NativeWorkerPool.java:172)
INFO  [org.wso2.carbon.automation.extensions.servers.utils.ServerLogReader] - 	at java.util.concurrent.ThreadPoolExecutor.runWorker(ThreadPoolExecutor.java:1149)
INFO  [org.wso2.carbon.automation.extensions.servers.utils.ServerLogReader] - 	at java.util.concurrent.ThreadPoolExecutor$Worker.run(ThreadPoolExecutor.java:624)
INFO  [org.wso2.carbon.automation.extensions.servers.utils.ServerLogReader] - 	at java.lang.Thread.run(Thread.java:748)
INFO  [org.wso2.carbon.automation.extensions.servers.utils.ServerLogReader] - Caused by: javax.xml.stream.XMLStreamException: DS Fault Message: Error in 'SQLQuery.processPreNormalQuery': Unique index or primary key violation: "PRODUCTS_PK ON PUBLIC.PRODUCTS(PRODUCTCODE) VALUES ( /* 2 */ 'productCode100' )"; SQL statement:
INFO  [org.wso2.carbon.automation.extensions.servers.utils.ServerLogReader] - INSERT INTO Products VALUES(?,?,?,?,?) [23505-175]
INFO  [org.wso2.carbon.automation.extensions.servers.utils.ServerLogReader] - DS Code: DATABASE_ERROR
INFO  [org.wso2.carbon.automation.extensions.servers.utils.ServerLogReader] - Source Data Service:-
INFO  [org.wso2.carbon.automation.extensions.servers.utils.ServerLogReader] - Name: RequestBoxTest
INFO  [org.wso2.carbon.automation.extensions.servers.utils.ServerLogReader] - Location: /RequestBoxTest.dbs
INFO  [org.wso2.carbon.automation.extensions.servers.utils.ServerLogReader] - Description: N/A
INFO  [org.wso2.carbon.automation.extensions.servers.utils.ServerLogReader] - Default Namespace: http://ws.wso2.org/dataservice/samples/rdbms_sample
INFO  [org.wso2.carbon.automation.extensions.servers.utils.ServerLogReader] - Current Request Name: insert_into_products_operation
INFO  [org.wso2.carbon.automation.extensions.servers.utils.ServerLogReader] - Current Params: {productLine=productLine100, quantityInStock=1580, productCode=productCode100, productName=productName100, productDescription=productDescription100}
INFO  [org.wso2.carbon.automation.extensions.servers.utils.ServerLogReader] - Nested Exception:-
INFO  [org.wso2.carbon.automation.extensions.servers.utils.ServerLogReader] - org.h2.jdbc.JdbcSQLException: Unique index or primary key violation: "PRODUCTS_PK ON PUBLIC.PRODUCTS(PRODUCTCODE) VALUES ( /* 2 */ 'productCode100' )"; SQL statement:
INFO  [org.wso2.carbon.automation.extensions.servers.utils.ServerLogReader] - INSERT INTO Products VALUES(?,?,?,?,?) [23505-175]
INFO  [org.wso2.carbon.automation.extensions.servers.utils.ServerLogReader] - 
INFO  [org.wso2.carbon.automation.extensions.servers.utils.ServerLogReader] - 	at org.wso2.carbon.dataservices.core.engine.DSOMDataSource.execute(DSOMDataSource.java:102)
INFO  [org.wso2.carbon.automation.extensions.servers.utils.ServerLogReader] - 	at org.wso2.carbon.dataservices.core.engine.DSOMDataSource.serialize(DSOMDataSource.java:107)
INFO  [org.wso2.carbon.automation.extensions.servers.utils.ServerLogReader] - 	at org.wso2.carbon.dataservices.core.engine.DSOMDataSource.executeInOnly(DSOMDataSource.java:80)
INFO  [org.wso2.carbon.automation.extensions.servers.utils.ServerLogReader] - 	at org.wso2.carbon.dataservices.core.dispatch.SingleDataServiceRequest.processSingleRequest(SingleDataServiceRequest.java:116)
INFO  [org.wso2.carbon.automation.extensions.servers.utils.ServerLogReader] - 	at org.wso2.carbon.dataservices.core.dispatch.SingleDataServiceRequest.processRequest(SingleDataServiceRequest.java:67)
INFO  [org.wso2.carbon.automation.extensions.servers.utils.ServerLogReader] - 	at org.wso2.carbon.dataservices.core.dispatch.DataServiceRequest.dispatch(DataServiceRequest.java:359)
INFO  [org.wso2.carbon.automation.extensions.servers.utils.ServerLogReader] - 	at org.wso2.carbon.dataservices.core.boxcarring.RequestBox.execute(RequestBox.java:66)
INFO  [org.wso2.carbon.automation.extensions.servers.utils.ServerLogReader] - 	at org.wso2.carbon.dataservices.core.dispatch.RequestBoxRequest.processRequest(RequestBoxRequest.java:70)
INFO  [org.wso2.carbon.automation.extensions.servers.utils.ServerLogReader] - 	at org.wso2.carbon.dataservices.core.dispatch.DataServiceRequest.dispatch(DataServiceRequest.java:359)
INFO  [org.wso2.carbon.automation.extensions.servers.utils.ServerLogReader] - 	at org.wso2.carbon.dataservices.core.DataServiceProcessor.dispatch(DataServiceProcessor.java:41)
INFO  [org.wso2.carbon.automation.extensions.servers.utils.ServerLogReader] - 	at org.wso2.carbon.dataservices.core.DBInOutMessageReceiver.invokeBusinessLogic(DBInOutMessageReceiver.java:82)
INFO  [org.wso2.carbon.automation.extensions.servers.utils.ServerLogReader] - 	... 9 more
ERROR [org.wso2.carbon.automation.test.utils.axis2client.AxisServiceClient] - DS Fault Message: Error in DS non result invoke.
DS Code: DATABASE_ERROR
Nested Exception:-
javax.xml.stream.XMLStreamException: DS Fault Message: Error in 'SQLQuery.processPreNormalQuery': Unique index or primary key violation: "PRODUCTS_PK ON PUBLIC.PRODUCTS(PRODUCTCODE) VALUES ( /* 2 */ 'productCode100' )"; SQL statement:
INSERT INTO Products VALUES(?,?,?,?,?) [23505-175]
DS Code: DATABASE_ERROR
Source Data Service:-
Name: RequestBoxTest
Location: /RequestBoxTest.dbs
Description: N/A
Default Namespace: http://ws.wso2.org/dataservice/samples/rdbms_sample
Current Request Name: insert_into_products_operation
Current Params: {productLine=productLine100, quantityInStock=1580, productCode=productCode100, productName=productName100, productDescription=productDescription100}
Nested Exception:-
org.h2.jdbc.JdbcSQLException: Unique index or primary key violation: "PRODUCTS_PK ON PUBLIC.PRODUCTS(PRODUCTCODE) VALUES ( /* 2 */ 'productCode100' )"; SQL statement:
INSERT INTO Products VALUES(?,?,?,?,?) [23505-175]


INFO  [org.wso2.carbon.automation.extensions.servers.utils.ServerLogReader] - [2019-06-16 16:14:05,994] [micro-integrator] ERROR - DBInOutMessageReceiver Error in in-out message receiver
INFO  [org.wso2.carbon.automation.extensions.servers.utils.ServerLogReader] - DS Fault Message: Error in DS non result invoke.
INFO  [org.wso2.carbon.automation.extensions.servers.utils.ServerLogReader] - DS Code: DATABASE_ERROR
INFO  [org.wso2.carbon.automation.extensions.servers.utils.ServerLogReader] - Nested Exception:-
INFO  [org.wso2.carbon.automation.extensions.servers.utils.ServerLogReader] - javax.xml.stream.XMLStreamException: DS Fault Message: Error in 'SQLQuery.processPreNormalQuery': Unique index or primary key violation: "PRODUCTS_PK ON PUBLIC.PRODUCTS(PRODUCTCODE) VALUES ( /* 3 */ 'productCode100' )"; SQL statement:
INFO  [org.wso2.carbon.automation.extensions.servers.utils.ServerLogReader] - INSERT INTO Products VALUES(?,?,?,?,?) [23505-175]
INFO  [org.wso2.carbon.automation.extensions.servers.utils.ServerLogReader] - DS Code: DATABASE_ERROR
INFO  [org.wso2.carbon.automation.extensions.servers.utils.ServerLogReader] - Source Data Service:-
INFO  [org.wso2.carbon.automation.extensions.servers.utils.ServerLogReader] - Name: RequestBoxTest
INFO  [org.wso2.carbon.automation.extensions.servers.utils.ServerLogReader] - Location: /RequestBoxTest.dbs
INFO  [org.wso2.carbon.automation.extensions.servers.utils.ServerLogReader] - Description: N/A
INFO  [org.wso2.carbon.automation.extensions.servers.utils.ServerLogReader] - Default Namespace: http://ws.wso2.org/dataservice/samples/rdbms_sample
INFO  [org.wso2.carbon.automation.extensions.servers.utils.ServerLogReader] - Current Request Name: insert_into_products_operation
INFO  [org.wso2.carbon.automation.extensions.servers.utils.ServerLogReader] - Current Params: {productLine=productLine100, quantityInStock=1580, productCode=productCode100, productName=productName100, productDescription=productDescription100}
INFO  [org.wso2.carbon.automation.extensions.servers.utils.ServerLogReader] - Nested Exception:-
INFO  [org.wso2.carbon.automation.extensions.servers.utils.ServerLogReader] - org.h2.jdbc.JdbcSQLException: Unique index or primary key violation: "PRODUCTS_PK ON PUBLIC.PRODUCTS(PRODUCTCODE) VALUES ( /* 3 */ 'productCode100' )"; SQL statement:
INFO  [org.wso2.carbon.automation.extensions.servers.utils.ServerLogReader] - INSERT INTO Products VALUES(?,?,?,?,?) [23505-175]
INFO  [org.wso2.carbon.automation.extensions.servers.utils.ServerLogReader] - 
INFO  [org.wso2.carbon.automation.extensions.servers.utils.ServerLogReader] - 
INFO  [org.wso2.carbon.automation.extensions.servers.utils.ServerLogReader] - 	at org.wso2.carbon.dataservices.core.dispatch.SingleDataServiceRequest.processSingleRequest(SingleDataServiceRequest.java:118)
INFO  [org.wso2.carbon.automation.extensions.servers.utils.ServerLogReader] - 	at org.wso2.carbon.dataservices.core.dispatch.SingleDataServiceRequest.processRequest(SingleDataServiceRequest.java:67)
INFO  [org.wso2.carbon.automation.extensions.servers.utils.ServerLogReader] - 	at org.wso2.carbon.dataservices.core.dispatch.DataServiceRequest.dispatch(DataServiceRequest.java:359)
INFO  [org.wso2.carbon.automation.extensions.servers.utils.ServerLogReader] - 	at org.wso2.carbon.dataservices.core.boxcarring.RequestBox.execute(RequestBox.java:66)
INFO  [org.wso2.carbon.automation.extensions.servers.utils.ServerLogReader] - 	at org.wso2.carbon.dataservices.core.dispatch.RequestBoxRequest.processRequest(RequestBoxRequest.java:70)
INFO  [org.wso2.carbon.automation.extensions.servers.utils.ServerLogReader] - 	at org.wso2.carbon.dataservices.core.dispatch.DataServiceRequest.dispatch(DataServiceRequest.java:359)
INFO  [org.wso2.carbon.automation.extensions.servers.utils.ServerLogReader] - 	at org.wso2.carbon.dataservices.core.DataServiceProcessor.dispatch(DataServiceProcessor.java:41)
INFO  [org.wso2.carbon.automation.extensions.servers.utils.ServerLogReader] - 	at org.wso2.carbon.dataservices.core.DBInOutMessageReceiver.invokeBusinessLogic(DBInOutMessageReceiver.java:82)
INFO  [org.wso2.carbon.automation.extensions.servers.utils.ServerLogReader] - 	at org.apache.axis2.receivers.AbstractInOutSyncMessageReceiver.invokeBusinessLogic(AbstractInOutSyncMessageReceiver.java:42)
INFO  [org.wso2.carbon.automation.extensions.servers.utils.ServerLogReader] - 	at org.apache.axis2.receivers.AbstractMessageReceiver.receive(AbstractMessageReceiver.java:110)
INFO  [org.wso2.carbon.automation.extensions.servers.utils.ServerLogReader] - 	at org.apache.axis2.engine.AxisEngine.receive(AxisEngine.java:180)
INFO  [org.wso2.carbon.automation.extensions.servers.utils.ServerLogReader] - 	at org.apache.synapse.transport.passthru.ServerWorker.processEntityEnclosingRequest(ServerWorker.java:415)
INFO  [org.wso2.carbon.automation.extensions.servers.utils.ServerLogReader] - 	at org.apache.synapse.transport.passthru.ServerWorker.run(ServerWorker.java:152)
INFO  [org.wso2.carbon.automation.extensions.servers.utils.ServerLogReader] - 	at org.apache.axis2.transport.base.threads.NativeWorkerPool$1.run(NativeWorkerPool.java:172)
INFO  [org.wso2.carbon.automation.extensions.servers.utils.ServerLogReader] - 	at java.util.concurrent.ThreadPoolExecutor.runWorker(ThreadPoolExecutor.java:1149)
INFO  [org.wso2.carbon.automation.extensions.servers.utils.ServerLogReader] - 	at java.util.concurrent.ThreadPoolExecutor$Worker.run(ThreadPoolExecutor.java:624)
INFO  [org.wso2.carbon.automation.extensions.servers.utils.ServerLogReader] - 	at java.lang.Thread.run(Thread.java:748)
INFO  [org.wso2.carbon.automation.extensions.servers.utils.ServerLogReader] - Caused by: javax.xml.stream.XMLStreamException: DS Fault Message: Error in 'SQLQuery.processPreNormalQuery': Unique index or primary key violation: "PRODUCTS_PK ON PUBLIC.PRODUCTS(PRODUCTCODE) VALUES ( /* 3 */ 'productCode100' )"; SQL statement:
INFO  [org.wso2.carbon.automation.extensions.servers.utils.ServerLogReader] - INSERT INTO Products VALUES(?,?,?,?,?) [23505-175]
INFO  [org.wso2.carbon.automation.extensions.servers.utils.ServerLogReader] - DS Code: DATABASE_ERROR
INFO  [org.wso2.carbon.automation.extensions.servers.utils.ServerLogReader] - Source Data Service:-
INFO  [org.wso2.carbon.automation.extensions.servers.utils.ServerLogReader] - Name: RequestBoxTest
INFO  [org.wso2.carbon.automation.extensions.servers.utils.ServerLogReader] - Location: /RequestBoxTest.dbs
INFO  [org.wso2.carbon.automation.extensions.servers.utils.ServerLogReader] - Description: N/A
INFO  [org.wso2.carbon.automation.extensions.servers.utils.ServerLogReader] - Default Namespace: http://ws.wso2.org/dataservice/samples/rdbms_sample
INFO  [org.wso2.carbon.automation.extensions.servers.utils.ServerLogReader] - Current Request Name: insert_into_products_operation
INFO  [org.wso2.carbon.automation.extensions.servers.utils.ServerLogReader] - Current Params: {productLine=productLine100, quantityInStock=1580, productCode=productCode100, productName=productName100, productDescription=productDescription100}
INFO  [org.wso2.carbon.automation.extensions.servers.utils.ServerLogReader] - Nested Exception:-
INFO  [org.wso2.carbon.automation.extensions.servers.utils.ServerLogReader] - org.h2.jdbc.JdbcSQLException: Unique index or primary key violation: "PRODUCTS_PK ON PUBLIC.PRODUCTS(PRODUCTCODE) VALUES ( /* 3 */ 'productCode100' )"; SQL statement:
INFO  [org.wso2.carbon.automation.extensions.servers.utils.ServerLogReader] - INSERT INTO Products VALUES(?,?,?,?,?) [23505-175]
INFO  [org.wso2.carbon.automation.extensions.servers.utils.ServerLogReader] - 
INFO  [org.wso2.carbon.automation.extensions.servers.utils.ServerLogReader] - 	at org.wso2.carbon.dataservices.core.engine.DSOMDataSource.execute(DSOMDataSource.java:102)
INFO  [org.wso2.carbon.automation.extensions.servers.utils.ServerLogReader] - 	at org.wso2.carbon.dataservices.core.engine.DSOMDataSource.serialize(DSOMDataSource.java:107)
INFO  [org.wso2.carbon.automation.extensions.servers.utils.ServerLogReader] - 	at org.wso2.carbon.dataservices.core.engine.DSOMDataSource.executeInOnly(DSOMDataSource.java:80)
INFO  [org.wso2.carbon.automation.extensions.servers.utils.ServerLogReader] - 	at org.wso2.carbon.dataservices.core.dispatch.SingleDataServiceRequest.processSingleRequest(SingleDataServiceRequest.java:116)
INFO  [org.wso2.carbon.automation.extensions.servers.utils.ServerLogReader] - 	... 16 more
INFO  [org.wso2.carbon.automation.extensions.servers.utils.ServerLogReader] - [2019-06-16 16:14:05,995] [micro-integrator] ERROR - ServerWorker Error processing POST request for : /services/RequestBoxTest
INFO  [org.wso2.carbon.automation.extensions.servers.utils.ServerLogReader] - org.apache.axis2.AxisFault: DS Fault Message: Error in DS non result invoke.
INFO  [org.wso2.carbon.automation.extensions.servers.utils.ServerLogReader] - DS Code: DATABASE_ERROR
INFO  [org.wso2.carbon.automation.extensions.servers.utils.ServerLogReader] - Nested Exception:-
INFO  [org.wso2.carbon.automation.extensions.servers.utils.ServerLogReader] - javax.xml.stream.XMLStreamException: DS Fault Message: Error in 'SQLQuery.processPreNormalQuery': Unique index or primary key violation: "PRODUCTS_PK ON PUBLIC.PRODUCTS(PRODUCTCODE) VALUES ( /* 3 */ 'productCode100' )"; SQL statement:
INFO  [org.wso2.carbon.automation.extensions.servers.utils.ServerLogReader] - INSERT INTO Products VALUES(?,?,?,?,?) [23505-175]
INFO  [org.wso2.carbon.automation.extensions.servers.utils.ServerLogReader] - DS Code: DATABASE_ERROR
INFO  [org.wso2.carbon.automation.extensions.servers.utils.ServerLogReader] - Source Data Service:-
INFO  [org.wso2.carbon.automation.extensions.servers.utils.ServerLogReader] - Name: RequestBoxTest
INFO  [org.wso2.carbon.automation.extensions.servers.utils.ServerLogReader] - Location: /RequestBoxTest.dbs
INFO  [org.wso2.carbon.automation.extensions.servers.utils.ServerLogReader] - Description: N/A
INFO  [org.wso2.carbon.automation.extensions.servers.utils.ServerLogReader] - Default Namespace: http://ws.wso2.org/dataservice/samples/rdbms_sample
INFO  [org.wso2.carbon.automation.extensions.servers.utils.ServerLogReader] - Current Request Name: insert_into_products_operation
INFO  [org.wso2.carbon.automation.extensions.servers.utils.ServerLogReader] - Current Params: {productLine=productLine100, quantityInStock=1580, productCode=productCode100, productName=productName100, productDescription=productDescription100}
INFO  [org.wso2.carbon.automation.extensions.servers.utils.ServerLogReader] - Nested Exception:-
INFO  [org.wso2.carbon.automation.extensions.servers.utils.ServerLogReader] - org.h2.jdbc.JdbcSQLException: Unique index or primary key violation: "PRODUCTS_PK ON PUBLIC.PRODUCTS(PRODUCTCODE) VALUES ( /* 3 */ 'productCode100' )"; SQL statement:
INFO  [org.wso2.carbon.automation.extensions.servers.utils.ServerLogReader] - INSERT INTO Products VALUES(?,?,?,?,?) [23505-175]
INFO  [org.wso2.carbon.automation.extensions.servers.utils.ServerLogReader] - 
INFO  [org.wso2.carbon.automation.extensions.servers.utils.ServerLogReader] - 
INFO  [org.wso2.carbon.automation.extensions.servers.utils.ServerLogReader] - 	at org.wso2.carbon.dataservices.core.DBUtils.createAxisFault(DBUtils.java:801)
INFO  [org.wso2.carbon.automation.extensions.servers.utils.ServerLogReader] - 	at org.wso2.carbon.dataservices.core.DBInOutMessageReceiver.invokeBusinessLogic(DBInOutMessageReceiver.java:96)
INFO  [org.wso2.carbon.automation.extensions.servers.utils.ServerLogReader] - 	at org.apache.axis2.receivers.AbstractInOutSyncMessageReceiver.invokeBusinessLogic(AbstractInOutSyncMessageReceiver.java:42)
INFO  [org.wso2.carbon.automation.extensions.servers.utils.ServerLogReader] - 	at org.apache.axis2.receivers.AbstractMessageReceiver.receive(AbstractMessageReceiver.java:110)
INFO  [org.wso2.carbon.automation.extensions.servers.utils.ServerLogReader] - 	at org.apache.axis2.engine.AxisEngine.receive(AxisEngine.java:180)
INFO  [org.wso2.carbon.automation.extensions.servers.utils.ServerLogReader] - 	at org.apache.synapse.transport.passthru.ServerWorker.processEntityEnclosingRequest(ServerWorker.java:415)
INFO  [org.wso2.carbon.automation.extensions.servers.utils.ServerLogReader] - 	at org.apache.synapse.transport.passthru.ServerWorker.run(ServerWorker.java:152)
INFO  [org.wso2.carbon.automation.extensions.servers.utils.ServerLogReader] - 	at org.apache.axis2.transport.base.threads.NativeWorkerPool$1.run(NativeWorkerPool.java:172)
INFO  [org.wso2.carbon.automation.extensions.servers.utils.ServerLogReader] - 	at java.util.concurrent.ThreadPoolExecutor.runWorker(ThreadPoolExecutor.java:1149)
INFO  [org.wso2.carbon.automation.extensions.servers.utils.ServerLogReader] - 	at java.util.concurrent.ThreadPoolExecutor$Worker.run(ThreadPoolExecutor.java:624)
INFO  [org.wso2.carbon.automation.extensions.servers.utils.ServerLogReader] - 	at java.lang.Thread.run(Thread.java:748)
INFO  [org.wso2.carbon.automation.extensions.servers.utils.ServerLogReader] - Caused by: javax.xml.stream.XMLStreamException: DS Fault Message: Error in 'SQLQuery.processPreNormalQuery': Unique index or primary key violation: "PRODUCTS_PK ON PUBLIC.PRODUCTS(PRODUCTCODE) VALUES ( /* 3 */ 'productCode100' )"; SQL statement:
INFO  [org.wso2.carbon.automation.extensions.servers.utils.ServerLogReader] - INSERT INTO Products VALUES(?,?,?,?,?) [23505-175]
INFO  [org.wso2.carbon.automation.extensions.servers.utils.ServerLogReader] - DS Code: DATABASE_ERROR
INFO  [org.wso2.carbon.automation.extensions.servers.utils.ServerLogReader] - Source Data Service:-
INFO  [org.wso2.carbon.automation.extensions.servers.utils.ServerLogReader] - Name: RequestBoxTest
INFO  [org.wso2.carbon.automation.extensions.servers.utils.ServerLogReader] - Location: /RequestBoxTest.dbs
INFO  [org.wso2.carbon.automation.extensions.servers.utils.ServerLogReader] - Description: N/A
INFO  [org.wso2.carbon.automation.extensions.servers.utils.ServerLogReader] - Default Namespace: http://ws.wso2.org/dataservice/samples/rdbms_sample
INFO  [org.wso2.carbon.automation.extensions.servers.utils.ServerLogReader] - Current Request Name: insert_into_products_operation
INFO  [org.wso2.carbon.automation.extensions.servers.utils.ServerLogReader] - Current Params: {productLine=productLine100, quantityInStock=1580, productCode=productCode100, productName=productName100, productDescription=productDescription100}
INFO  [org.wso2.carbon.automation.extensions.servers.utils.ServerLogReader] - Nested Exception:-
INFO  [org.wso2.carbon.automation.extensions.servers.utils.ServerLogReader] - org.h2.jdbc.JdbcSQLException: Unique index or primary key violation: "PRODUCTS_PK ON PUBLIC.PRODUCTS(PRODUCTCODE) VALUES ( /* 3 */ 'productCode100' )"; SQL statement:
INFO  [org.wso2.carbon.automation.extensions.servers.utils.ServerLogReader] - INSERT INTO Products VALUES(?,?,?,?,?) [23505-175]
INFO  [org.wso2.carbon.automation.extensions.servers.utils.ServerLogReader] - 
INFO  [org.wso2.carbon.automation.extensions.servers.utils.ServerLogReader] - 	at org.wso2.carbon.dataservices.core.engine.DSOMDataSource.execute(DSOMDataSource.java:102)
INFO  [org.wso2.carbon.automation.extensions.servers.utils.ServerLogReader] - 	at org.wso2.carbon.dataservices.core.engine.DSOMDataSource.serialize(DSOMDataSource.java:107)
INFO  [org.wso2.carbon.automation.extensions.servers.utils.ServerLogReader] - 	at org.wso2.carbon.dataservices.core.engine.DSOMDataSource.executeInOnly(DSOMDataSource.java:80)
INFO  [org.wso2.carbon.automation.extensions.servers.utils.ServerLogReader] - 	at org.wso2.carbon.dataservices.core.dispatch.SingleDataServiceRequest.processSingleRequest(SingleDataServiceRequest.java:116)
INFO  [org.wso2.carbon.automation.extensions.servers.utils.ServerLogReader] - 	at org.wso2.carbon.dataservices.core.dispatch.SingleDataServiceRequest.processRequest(SingleDataServiceRequest.java:67)
INFO  [org.wso2.carbon.automation.extensions.servers.utils.ServerLogReader] - 	at org.wso2.carbon.dataservices.core.dispatch.DataServiceRequest.dispatch(DataServiceRequest.java:359)
INFO  [org.wso2.carbon.automation.extensions.servers.utils.ServerLogReader] - 	at org.wso2.carbon.dataservices.core.boxcarring.RequestBox.execute(RequestBox.java:66)
INFO  [org.wso2.carbon.automation.extensions.servers.utils.ServerLogReader] - 	at org.wso2.carbon.dataservices.core.dispatch.RequestBoxRequest.processRequest(RequestBoxRequest.java:70)
INFO  [org.wso2.carbon.automation.extensions.servers.utils.ServerLogReader] - 	at org.wso2.carbon.dataservices.core.dispatch.DataServiceRequest.dispatch(DataServiceRequest.java:359)
INFO  [org.wso2.carbon.automation.extensions.servers.utils.ServerLogReader] - 	at org.wso2.carbon.dataservices.core.DataServiceProcessor.dispatch(DataServiceProcessor.java:41)
INFO  [org.wso2.carbon.automation.extensions.servers.utils.ServerLogReader] - 	at org.wso2.carbon.dataservices.core.DBInOutMessageReceiver.invokeBusinessLogic(DBInOutMessageReceiver.java:82)
INFO  [org.wso2.carbon.automation.extensions.servers.utils.ServerLogReader] - 	... 9 more
ERROR [org.wso2.carbon.automation.test.utils.axis2client.AxisServiceClient] - DS Fault Message: Error in DS non result invoke.
DS Code: DATABASE_ERROR
Nested Exception:-
javax.xml.stream.XMLStreamException: DS Fault Message: Error in 'SQLQuery.processPreNormalQuery': Unique index or primary key violation: "PRODUCTS_PK ON PUBLIC.PRODUCTS(PRODUCTCODE) VALUES ( /* 3 */ 'productCode100' )"; SQL statement:
INSERT INTO Products VALUES(?,?,?,?,?) [23505-175]
DS Code: DATABASE_ERROR
Source Data Service:-
Name: RequestBoxTest
Location: /RequestBoxTest.dbs
Description: N/A
Default Namespace: http://ws.wso2.org/dataservice/samples/rdbms_sample
Current Request Name: insert_into_products_operation
Current Params: {productLine=productLine100, quantityInStock=1580, productCode=productCode100, productName=productName100, productDescription=productDescription100}
Nested Exception:-
org.h2.jdbc.JdbcSQLException: Unique index or primary key violation: "PRODUCTS_PK ON PUBLIC.PRODUCTS(PRODUCTCODE) VALUES ( /* 3 */ 'productCode100' )"; SQL statement:
INSERT INTO Products VALUES(?,?,?,?,?) [23505-175]


INFO  [org.wso2.carbon.automation.engine.testlisteners.TestManagerListener] - =================== On test success org.wso2.ei.dataservice.integration.test.requestBox.RequestBoxTestCase.requestBoxFailRequests ===================
INFO  [org.wso2.carbon.automation.engine.testlisteners.TestManagerListener] - =================== Running the test method org.wso2.ei.dataservice.integration.test.requestBox.RequestBoxTestCase.requestBoxSuccessRequests ===================
INFO  [org.wso2.carbon.automation.engine.testlisteners.TestManagerListener] - =================== On test success org.wso2.ei.dataservice.integration.test.requestBox.RequestBoxTestCase.requestBoxSuccessRequests ===================
PASSED: requestBoxFailRequests
        Send Request box requests which should be failed and check whether they are really failed
PASSED: requestBoxSuccessRequests
        Send Request box requests which should be successful and check whether they are successful

===============================================
    DSS-requestBox-tests
    Tests run: 2, Failures: 0, Skips: 0
===============================================

INFO  [org.wso2.carbon.automation.engine.testlisteners.TestManagerListener] - =================== Running the test method org.wso2.ei.dataservice.integration.test.jira.issues.DS1103DuplicateDataServiceTestCase.testForDuplicateDataServiceDeployment ===================
INFO  [org.wso2.carbon.automation.extensions.servers.utils.ServerLogReader] - [2019-06-16 16:14:06,892] [micro-integrator]  INFO - LogMediator main sequence executed for call to non-existent = /services/H2SimpleJsonTestDuplicate
INFO  [org.apache.axis2.transport.http.HTTPSender] - Unable to sendViaPost to url[http://localhost:8480/services/H2SimpleJsonTestDuplicate]
org.apache.axis2.AxisFault: Transport error: 404 Error: Not Found
	at org.apache.axis2.transport.http.HTTPSender.handleResponse(HTTPSender.java:371)
	at org.apache.axis2.transport.http.HTTPSender.sendViaPost(HTTPSender.java:200)
	at org.apache.axis2.transport.http.HTTPSender.send(HTTPSender.java:81)
	at org.apache.axis2.transport.http.CommonsHTTPTransportSender.writeMessageWithCommons(CommonsHTTPTransportSender.java:459)
	at org.apache.axis2.transport.http.CommonsHTTPTransportSender.invoke(CommonsHTTPTransportSender.java:286)
	at org.apache.axis2.engine.AxisEngine.send(AxisEngine.java:442)
	at org.apache.axis2.description.OutInAxisOperationClient.send(OutInAxisOperation.java:442)
	at org.apache.axis2.description.OutInAxisOperationClient.executeImpl(OutInAxisOperation.java:228)
	at org.apache.axis2.client.OperationClient.execute(OperationClient.java:149)
	at org.apache.axis2.client.ServiceClient.sendReceive(ServiceClient.java:554)
	at org.apache.axis2.client.ServiceClient.sendReceive(ServiceClient.java:530)
	at org.wso2.carbon.automation.test.utils.axis2client.AxisServiceClient.sendReceive(AxisServiceClient.java:53)
	at org.wso2.ei.dataservice.integration.test.jira.issues.DS1103DuplicateDataServiceTestCase.testForDuplicateDataServiceDeployment(DS1103DuplicateDataServiceTestCase.java:48)
	at sun.reflect.NativeMethodAccessorImpl.invoke0(Native Method)
	at sun.reflect.NativeMethodAccessorImpl.invoke(NativeMethodAccessorImpl.java:62)
	at sun.reflect.DelegatingMethodAccessorImpl.invoke(DelegatingMethodAccessorImpl.java:43)
	at java.lang.reflect.Method.invoke(Method.java:498)
	at org.testng.internal.MethodInvocationHelper.invokeMethod(MethodInvocationHelper.java:108)
	at org.testng.internal.Invoker.invokeMethod(Invoker.java:661)
	at org.testng.internal.Invoker.invokeTestMethod(Invoker.java:869)
	at org.testng.internal.Invoker.invokeTestMethods(Invoker.java:1193)
	at org.testng.internal.TestMethodWorker.invokeTestMethods(TestMethodWorker.java:126)
	at org.testng.internal.TestMethodWorker.run(TestMethodWorker.java:109)
	at org.testng.TestRunner.privateRun(TestRunner.java:744)
	at org.testng.TestRunner.run(TestRunner.java:602)
	at org.testng.SuiteRunner.runTest(SuiteRunner.java:380)
	at org.testng.SuiteRunner.runSequentially(SuiteRunner.java:375)
	at org.testng.SuiteRunner.privateRun(SuiteRunner.java:340)
	at org.testng.SuiteRunner.run(SuiteRunner.java:289)
	at org.testng.SuiteRunnerWorker.runSuite(SuiteRunnerWorker.java:52)
	at org.testng.SuiteRunnerWorker.run(SuiteRunnerWorker.java:86)
	at org.testng.TestNG.runSuitesSequentially(TestNG.java:1301)
	at org.testng.TestNG.runSuitesLocally(TestNG.java:1226)
	at org.testng.TestNG.runSuites(TestNG.java:1144)
	at org.testng.TestNG.run(TestNG.java:1115)
	at org.apache.maven.surefire.testng.TestNGExecutor.run(TestNGExecutor.java:178)
	at org.apache.maven.surefire.testng.TestNGXmlTestSuite.execute(TestNGXmlTestSuite.java:92)
	at org.apache.maven.surefire.testng.TestNGProvider.invoke(TestNGProvider.java:96)
	at sun.reflect.NativeMethodAccessorImpl.invoke0(Native Method)
	at sun.reflect.NativeMethodAccessorImpl.invoke(NativeMethodAccessorImpl.java:62)
	at sun.reflect.DelegatingMethodAccessorImpl.invoke(DelegatingMethodAccessorImpl.java:43)
	at java.lang.reflect.Method.invoke(Method.java:498)
	at org.apache.maven.surefire.util.ReflectionUtils.invokeMethodWithArray(ReflectionUtils.java:189)
	at org.apache.maven.surefire.booter.ProviderFactory$ProviderProxy.invoke(ProviderFactory.java:165)
	at org.apache.maven.surefire.booter.ProviderFactory.invokeProvider(ProviderFactory.java:85)
	at org.apache.maven.surefire.booter.ForkedBooter.runSuitesInProcess(ForkedBooter.java:115)
	at org.apache.maven.surefire.booter.ForkedBooter.main(ForkedBooter.java:75)
ERROR [org.wso2.carbon.automation.test.utils.axis2client.AxisServiceClient] - Transport error: 404 Error: Not Found
INFO  [org.wso2.carbon.automation.engine.testlisteners.TestManagerListener] - =================== On test success org.wso2.ei.dataservice.integration.test.jira.issues.DS1103DuplicateDataServiceTestCase.testForDuplicateDataServiceDeployment ===================
INFO  [org.wso2.carbon.automation.engine.testlisteners.TestManagerListener] - =================== Running the test method org.wso2.ei.dataservice.integration.test.jira.issues.DS1111UserRoleExtensionTestCase.invokeRoleExtensionTest ===================
INFO  [org.wso2.carbon.automation.extensions.servers.utils.ServerLogReader] - [2019-06-16 16:14:06,924] [micro-integrator]  INFO - RoleRetriever External role retriever invoked returning roles
INFO  [org.wso2.ei.dataservice.integration.test.jira.issues.DS1111UserRoleExtensionTestCase] - role retriever extension worked and roles were provided correctly
INFO  [org.wso2.carbon.automation.engine.testlisteners.TestManagerListener] - =================== On test success org.wso2.ei.dataservice.integration.test.jira.issues.DS1111UserRoleExtensionTestCase.invokeRoleExtensionTest ===================
INFO  [org.wso2.carbon.automation.engine.testlisteners.TestManagerListener] - =================== Running the test method org.wso2.ei.dataservice.integration.test.jira.issues.DS1031PolicyKeyWithoutPolicyPathTestCase.testServiceDeployment ===================
INFO  [org.wso2.carbon.automation.extensions.servers.utils.ServerLogReader] - [2019-06-16 16:14:07,005] [micro-integrator]  INFO - LogMediator main sequence executed for call to non-existent = /services/PolicyKeyWithoutPolicyPathTest
INFO  [org.apache.axis2.transport.http.HTTPSender] - Unable to sendViaPost to url[http://localhost:8480/services/PolicyKeyWithoutPolicyPathTest]
org.apache.axis2.AxisFault: Transport error: 404 Error: Not Found
	at org.apache.axis2.transport.http.HTTPSender.handleResponse(HTTPSender.java:371)
	at org.apache.axis2.transport.http.HTTPSender.sendViaPost(HTTPSender.java:200)
	at org.apache.axis2.transport.http.HTTPSender.send(HTTPSender.java:81)
	at org.apache.axis2.transport.http.CommonsHTTPTransportSender.writeMessageWithCommons(CommonsHTTPTransportSender.java:459)
	at org.apache.axis2.transport.http.CommonsHTTPTransportSender.invoke(CommonsHTTPTransportSender.java:286)
	at org.apache.axis2.engine.AxisEngine.send(AxisEngine.java:442)
	at org.apache.axis2.description.OutInAxisOperationClient.send(OutInAxisOperation.java:442)
	at org.apache.axis2.description.OutInAxisOperationClient.executeImpl(OutInAxisOperation.java:228)
	at org.apache.axis2.client.OperationClient.execute(OperationClient.java:149)
	at org.apache.axis2.client.ServiceClient.sendReceive(ServiceClient.java:554)
	at org.apache.axis2.client.ServiceClient.sendReceive(ServiceClient.java:530)
	at org.wso2.carbon.automation.test.utils.axis2client.AxisServiceClient.sendReceive(AxisServiceClient.java:53)
	at org.wso2.ei.dataservice.integration.test.jira.issues.DS1031PolicyKeyWithoutPolicyPathTestCase.testServiceDeployment(DS1031PolicyKeyWithoutPolicyPathTestCase.java:49)
	at sun.reflect.NativeMethodAccessorImpl.invoke0(Native Method)
	at sun.reflect.NativeMethodAccessorImpl.invoke(NativeMethodAccessorImpl.java:62)
	at sun.reflect.DelegatingMethodAccessorImpl.invoke(DelegatingMethodAccessorImpl.java:43)
	at java.lang.reflect.Method.invoke(Method.java:498)
	at org.testng.internal.MethodInvocationHelper.invokeMethod(MethodInvocationHelper.java:108)
	at org.testng.internal.Invoker.invokeMethod(Invoker.java:661)
	at org.testng.internal.Invoker.invokeTestMethod(Invoker.java:869)
	at org.testng.internal.Invoker.invokeTestMethods(Invoker.java:1193)
	at org.testng.internal.TestMethodWorker.invokeTestMethods(TestMethodWorker.java:126)
	at org.testng.internal.TestMethodWorker.run(TestMethodWorker.java:109)
	at org.testng.TestRunner.privateRun(TestRunner.java:744)
	at org.testng.TestRunner.run(TestRunner.java:602)
	at org.testng.SuiteRunner.runTest(SuiteRunner.java:380)
	at org.testng.SuiteRunner.runSequentially(SuiteRunner.java:375)
	at org.testng.SuiteRunner.privateRun(SuiteRunner.java:340)
	at org.testng.SuiteRunner.run(SuiteRunner.java:289)
	at org.testng.SuiteRunnerWorker.runSuite(SuiteRunnerWorker.java:52)
	at org.testng.SuiteRunnerWorker.run(SuiteRunnerWorker.java:86)
	at org.testng.TestNG.runSuitesSequentially(TestNG.java:1301)
	at org.testng.TestNG.runSuitesLocally(TestNG.java:1226)
	at org.testng.TestNG.runSuites(TestNG.java:1144)
	at org.testng.TestNG.run(TestNG.java:1115)
	at org.apache.maven.surefire.testng.TestNGExecutor.run(TestNGExecutor.java:178)
	at org.apache.maven.surefire.testng.TestNGXmlTestSuite.execute(TestNGXmlTestSuite.java:92)
	at org.apache.maven.surefire.testng.TestNGProvider.invoke(TestNGProvider.java:96)
	at sun.reflect.NativeMethodAccessorImpl.invoke0(Native Method)
	at sun.reflect.NativeMethodAccessorImpl.invoke(NativeMethodAccessorImpl.java:62)
	at sun.reflect.DelegatingMethodAccessorImpl.invoke(DelegatingMethodAccessorImpl.java:43)
	at java.lang.reflect.Method.invoke(Method.java:498)
	at org.apache.maven.surefire.util.ReflectionUtils.invokeMethodWithArray(ReflectionUtils.java:189)
	at org.apache.maven.surefire.booter.ProviderFactory$ProviderProxy.invoke(ProviderFactory.java:165)
	at org.apache.maven.surefire.booter.ProviderFactory.invokeProvider(ProviderFactory.java:85)
	at org.apache.maven.surefire.booter.ForkedBooter.runSuitesInProcess(ForkedBooter.java:115)
	at org.apache.maven.surefire.booter.ForkedBooter.main(ForkedBooter.java:75)
ERROR [org.wso2.carbon.automation.test.utils.axis2client.AxisServiceClient] - Transport error: 404 Error: Not Found
INFO  [org.wso2.carbon.automation.engine.testlisteners.TestManagerListener] - =================== On test success org.wso2.ei.dataservice.integration.test.jira.issues.DS1031PolicyKeyWithoutPolicyPathTestCase.testServiceDeployment ===================
INFO  [org.wso2.carbon.automation.engine.testlisteners.TestManagerListener] - =================== Running the test method org.wso2.ei.dataservice.integration.test.jira.issues.DS1081NullValuesTest.validateNullValues ===================
INFO  [org.wso2.carbon.automation.engine.testlisteners.TestManagerListener] - =================== On test success org.wso2.ei.dataservice.integration.test.jira.issues.DS1081NullValuesTest.validateNullValues ===================
INFO  [org.wso2.carbon.automation.engine.testlisteners.TestManagerListener] - =================== Running the test method org.wso2.ei.dataservice.integration.test.jira.issues.DS1090EscapeNonPrintableCharactersTestCase.testForNullResultSet ===================
INFO  [org.wso2.carbon.automation.engine.testlisteners.TestManagerListener] - =================== On test success org.wso2.ei.dataservice.integration.test.jira.issues.DS1090EscapeNonPrintableCharactersTestCase.testForNullResultSet ===================
INFO  [org.wso2.carbon.automation.engine.testlisteners.TestManagerListener] - =================== Running the test method org.wso2.ei.dataservice.integration.test.jira.issues.DS1209EqualElementNamesInJSONHierarchyTestCase.sendGetRequest ===================
INFO  [org.wso2.carbon.automation.engine.testlisteners.TestManagerListener] - =================== On test success org.wso2.ei.dataservice.integration.test.jira.issues.DS1209EqualElementNamesInJSONHierarchyTestCase.sendGetRequest ===================
INFO  [org.wso2.carbon.automation.engine.testlisteners.TestManagerListener] - =================== Running the test method org.wso2.ei.dataservice.integration.test.jira.issues.CARBON15280RepeatServiceNameInURLTest.performJsonPutMethodTest ===================
INFO  [org.wso2.carbon.automation.engine.testlisteners.TestManagerListener] - =================== On test success org.wso2.ei.dataservice.integration.test.jira.issues.CARBON15280RepeatServiceNameInURLTest.performJsonPutMethodTest ===================
PASSED: testForDuplicateDataServiceDeployment
        Testing the duplicate data service deployment fail test case.
PASSED: invokeRoleExtensionTest
        Check whether role extension returns roles correctly
PASSED: testServiceDeployment
        Check whether service is listed as a deployed service
PASSED: validateNullValues
        validate retrieval of null values
PASSED: testForNullResultSet
PASSED: sendGetRequest
        Sending a GET request expecting a response with more than one records
PASSED: performJsonPutMethodTest
        Invoking a GET Request with repeating the SerivceName in URL

===============================================
    DSS-JIRA-issues
    Tests run: 7, Failures: 0, Skips: 0
===============================================

INFO  [org.wso2.carbon.automation.engine.testlisteners.TestSuiteListener] - Inside Test Suite Listener - On Finish
INFO  [org.wso2.carbon.automation.engine.testlisteners.TestExecutionListener] - Inside Test Execution Listener - On Finish
INFO  [org.wso2.esb.integration.common.extensions.carbonserver.CarbonServerManager] - Shutting down server ...
INFO  [org.wso2.carbon.automation.extensions.servers.utils.ServerLogReader] - [2019-06-16 16:14:07,409] [micro-integrator]  INFO - PassThroughListeningIOReactorManager Shutting down IO Reactor bind for port 8480
INFO  [org.wso2.carbon.automation.extensions.servers.utils.ServerLogReader] - [2019-06-16 16:14:07,445] [micro-integrator]  INFO - PassThroughListeningIOReactorManager HTTP-Listener I/O dispatcher Listener shutdown.
INFO  [org.wso2.carbon.automation.extensions.servers.utils.ServerLogReader] - [2019-06-16 16:14:07,480] [micro-integrator]  INFO - PassThroughListeningIOReactorManager Shutting down IO Reactor bind for port 8443
INFO  [org.wso2.carbon.automation.extensions.servers.utils.ServerLogReader] - [2019-06-16 16:14:07,487] [micro-integrator]  INFO - PassThroughListeningIOReactorManager HTTPS-Listener I/O dispatcher Listener shutdown.
INFO  [org.wso2.esb.integration.common.extensions.carbonserver.CarbonServerManager] - Server stopped successfully ...
Tests run: 68, Failures: 0, Errors: 0, Skipped: 0, Time elapsed: 38.657 sec

Results :

Tests run: 68, Failures: 0, Errors: 0, Skipped: 0

[JENKINS] Recording test results
[INFO] 
[INFO] --- maven-jar-plugin:2.4:jar (default-jar) @ org.wso2.ei.integration.test ---
[INFO] Building jar: /home/jenkins/workspace/products/micro-integrator-asankaab-delete/integration/dataservice-hosting-tests/tests-integration/tests/target/org.wso2.ei.integration.test-1.1.0-SNAPSHOT.jar
[INFO] 
[INFO] --- maven-jar-plugin:2.4:test-jar (default) @ org.wso2.ei.integration.test ---
[INFO] Building jar: /home/jenkins/workspace/products/micro-integrator-asankaab-delete/integration/dataservice-hosting-tests/tests-integration/tests/target/org.wso2.ei.integration.test-1.1.0-SNAPSHOT-tests.jar
[INFO] 
[INFO] --- maven-install-plugin:2.5.2:install (default-install) @ org.wso2.ei.integration.test ---
[INFO] Installing /home/jenkins/workspace/products/micro-integrator-asankaab-delete/integration/dataservice-hosting-tests/tests-integration/tests/target/org.wso2.ei.integration.test-1.1.0-SNAPSHOT.jar to /home/jenkins/workspace/products/micro-integrator-asankaab-delete/.repository/org/wso2/ei/org.wso2.ei.integration.test/1.1.0-SNAPSHOT/org.wso2.ei.integration.test-1.1.0-SNAPSHOT.jar
[INFO] Installing /home/jenkins/workspace/products/micro-integrator-asankaab-delete/integration/dataservice-hosting-tests/tests-integration/tests/pom.xml to /home/jenkins/workspace/products/micro-integrator-asankaab-delete/.repository/org/wso2/ei/org.wso2.ei.integration.test/1.1.0-SNAPSHOT/org.wso2.ei.integration.test-1.1.0-SNAPSHOT.pom
[INFO] Installing /home/jenkins/workspace/products/micro-integrator-asankaab-delete/integration/dataservice-hosting-tests/tests-integration/tests/target/org.wso2.ei.integration.test-1.1.0-SNAPSHOT-tests.jar to /home/jenkins/workspace/products/micro-integrator-asankaab-delete/.repository/org/wso2/ei/org.wso2.ei.integration.test/1.1.0-SNAPSHOT/org.wso2.ei.integration.test-1.1.0-SNAPSHOT-tests.jar
[INFO] ------------------------------------------------------------------------
[INFO] Reactor Summary:
[INFO] 
[INFO] WSO2 Micro Integrator ............................. SUCCESS [4.750s]
[INFO] WSO2 Enterprise Integrator - Component Parent ..... SUCCESS [0.059s]
[INFO] WSO2 Micro Integrator - Core Component ............ SUCCESS [1:02.418s]
[INFO] WSO2 Micro Integrator - Server Component .......... SUCCESS [1.005s]
[INFO] org.wso2.carbon.micro.integrator.security ......... SUCCESS [13.271s]
[INFO] WSO2 Micro Integrator - Extensions ................ SUCCESS [0.041s]
[INFO] org.wso2.carbon.micro.integrator.management.apis .. SUCCESS [15.634s]
[INFO] WSO2 Micro Integrator - Feature Aggregator Module . SUCCESS [0.038s]
[INFO] WSO2 Micro Integrator - Core Server Feature ....... SUCCESS [16.653s]
[INFO] WSO2 Enterprise Integrator - micro-integrator P2 Profile Generation  SUCCESS [27.722s]
[INFO] WSO2 Micro Integrator - Distribution .............. SUCCESS [12.821s]
[INFO] WSO2 Micro Integrator - Integration Tests ......... SUCCESS [0.038s]
[INFO] WSO2 MI - Samples ................................. SUCCESS [3.876s]
[INFO] WSO2 Micro Integrator - Automation Extensions ..... SUCCESS [13.113s]
[INFO] MI Test Common Module ............................. SUCCESS [4.188s]
[INFO] MI Integration Test Admin Clients ................. SUCCESS [2.513s]
[INFO] MI Integration Test Common Utils .................. SUCCESS [5.203s]
[INFO] WSO2 Enterprise Integrator - Mediation Integration Tests  SUCCESS [0.245s]
[INFO] MI Test Service Module ............................ SUCCESS [2.588s]
[INFO] MI test Module-Transport .......................... SUCCESS [18:12.348s]
[INFO] MI test Module-Service ............................ SUCCESS [16:05.542s]
[INFO] MI test Module-mediator-1 ......................... SUCCESS [8:49.175s]
[INFO] MI test Module-mediator-2 ......................... SUCCESS [7:08.959s]
[INFO] Mi test Module - Test Patches ..................... SUCCESS [6:54.221s]
[INFO] MI test Module - Sample ........................... SUCCESS [2:34.783s]
[INFO] MI test Module-Other .............................. SUCCESS [6:39.528s]
[INFO] MI Test Module - Platform ......................... SUCCESS [0.046s]
[INFO] MI test Module - Platform - RabbitMQ Transport .... SUCCESS [1.856s]
[INFO] MI Integration Test Reporting ..................... SUCCESS [7.153s]
[INFO] MI Data Service Tests ............................. SUCCESS [0.055s]
[INFO] MI DSS Samples Parent ............................. SUCCESS [0.035s]
[INFO] DS Samples Parent ................................. SUCCESS [0.734s]
[INFO] DataServices Clients .............................. SUCCESS [15.948s]
[INFO] Mi DSS Integration Test Common .................... SUCCESS [0.184s]
[INFO] MI DSS Admin Clients .............................. SUCCESS [0.863s]
[INFO] MI DSS Test Utils ................................. SUCCESS [1.216s]
[INFO] WSO2 DataServices Integration Test ................ SUCCESS [0.092s]
[INFO] MI DSS Tests ...................................... SUCCESS [43.722s]
[INFO] ------------------------------------------------------------------------
[INFO] BUILD SUCCESS
[INFO] ------------------------------------------------------------------------
[INFO] Total time: 1:12:25.648s
[INFO] Finished at: Sun Jun 16 16:14:09 UTC 2019
[INFO] Final Memory: 195M/640M
[INFO] ------------------------------------------------------------------------
Waiting for Jenkins to finish collecting data
[JENKINS] Archiving /home/jenkins/workspace/products/micro-integrator-asankaab-delete/components/org.wso2.carbon.micro.integrator.server/pom.xml to org.wso2.ei/org.wso2.carbon.micro.integrator.server/1.1.0-SNAPSHOT/org.wso2.carbon.micro.integrator.server-1.1.0-SNAPSHOT.pom
[JENKINS] Archiving /home/jenkins/workspace/products/micro-integrator-asankaab-delete/components/org.wso2.carbon.micro.integrator.server/target/org.wso2.carbon.micro.integrator.server-1.1.0-SNAPSHOT.jar to org.wso2.ei/org.wso2.carbon.micro.integrator.server/1.1.0-SNAPSHOT/org.wso2.carbon.micro.integrator.server-1.1.0-SNAPSHOT.jar
[JENKINS] Archiving /home/jenkins/workspace/products/micro-integrator-asankaab-delete/integration/mediation-tests/tests-transport/pom.xml to org.wso2.ei/org.wso2.carbon.ei.tests.transport/1.1.0-SNAPSHOT/org.wso2.carbon.ei.tests.transport-1.1.0-SNAPSHOT.pom
[JENKINS] Archiving /home/jenkins/workspace/products/micro-integrator-asankaab-delete/integration/mediation-tests/tests-transport/target/org.wso2.carbon.ei.tests.transport-1.1.0-SNAPSHOT.jar to org.wso2.ei/org.wso2.carbon.ei.tests.transport/1.1.0-SNAPSHOT/org.wso2.carbon.ei.tests.transport-1.1.0-SNAPSHOT.jar
[JENKINS] Archiving /home/jenkins/workspace/products/micro-integrator-asankaab-delete/integration/mediation-tests/tests-transport/target/org.wso2.carbon.ei.tests.transport-1.1.0-SNAPSHOT-tests.jar to org.wso2.ei/org.wso2.carbon.ei.tests.transport/1.1.0-SNAPSHOT/org.wso2.carbon.ei.tests.transport-1.1.0-SNAPSHOT-tests.jar
[JENKINS] Archiving /home/jenkins/workspace/products/micro-integrator-asankaab-delete/integration/mediation-tests/tests-service/pom.xml to org.wso2.ei/org.wso2.carbon.ei.tests.service/1.1.0-SNAPSHOT/org.wso2.carbon.ei.tests.service-1.1.0-SNAPSHOT.pom
[JENKINS] Archiving /home/jenkins/workspace/products/micro-integrator-asankaab-delete/integration/mediation-tests/tests-service/target/org.wso2.carbon.ei.tests.service-1.1.0-SNAPSHOT.jar to org.wso2.ei/org.wso2.carbon.ei.tests.service/1.1.0-SNAPSHOT/org.wso2.carbon.ei.tests.service-1.1.0-SNAPSHOT.jar
[JENKINS] Archiving /home/jenkins/workspace/products/micro-integrator-asankaab-delete/integration/mediation-tests/tests-service/target/org.wso2.carbon.ei.tests.service-1.1.0-SNAPSHOT-tests.jar to org.wso2.ei/org.wso2.carbon.ei.tests.service/1.1.0-SNAPSHOT/org.wso2.carbon.ei.tests.service-1.1.0-SNAPSHOT-tests.jar
[JENKINS] Archiving /home/jenkins/workspace/products/micro-integrator-asankaab-delete/integration/mediation-tests/tests-sample/pom.xml to org.wso2.ei/org.wso2.carbon.ei.tests.sample/1.1.0-SNAPSHOT/org.wso2.carbon.ei.tests.sample-1.1.0-SNAPSHOT.pom
[JENKINS] Archiving /home/jenkins/workspace/products/micro-integrator-asankaab-delete/integration/mediation-tests/tests-sample/target/org.wso2.carbon.ei.tests.sample-1.1.0-SNAPSHOT.jar to org.wso2.ei/org.wso2.carbon.ei.tests.sample/1.1.0-SNAPSHOT/org.wso2.carbon.ei.tests.sample-1.1.0-SNAPSHOT.jar
[JENKINS] Archiving /home/jenkins/workspace/products/micro-integrator-asankaab-delete/integration/mediation-tests/tests-sample/target/org.wso2.carbon.ei.tests.sample-1.1.0-SNAPSHOT-tests.jar to org.wso2.ei/org.wso2.carbon.ei.tests.sample/1.1.0-SNAPSHOT/org.wso2.carbon.ei.tests.sample-1.1.0-SNAPSHOT-tests.jar
[JENKINS] Archiving /home/jenkins/workspace/products/micro-integrator-asankaab-delete/integration/dataservice-hosting-tests/tests-common/integration-test-utils/pom.xml to org.wso2.ei/org.wso2.ei.dataservice.integration.common.utils/1.1.0-SNAPSHOT/org.wso2.ei.dataservice.integration.common.utils-1.1.0-SNAPSHOT.pom
[JENKINS] Archiving /home/jenkins/workspace/products/micro-integrator-asankaab-delete/integration/dataservice-hosting-tests/tests-common/integration-test-utils/target/org.wso2.ei.dataservice.integration.common.utils-1.1.0-SNAPSHOT.jar to org.wso2.ei/org.wso2.ei.dataservice.integration.common.utils/1.1.0-SNAPSHOT/org.wso2.ei.dataservice.integration.common.utils-1.1.0-SNAPSHOT.jar
[JENKINS] Archiving /home/jenkins/workspace/products/micro-integrator-asankaab-delete/integration/tests-common/pom.xml to org.wso2.ei/integration-test-common/1.1.0-SNAPSHOT/integration-test-common-1.1.0-SNAPSHOT.pom
[JENKINS] Archiving /home/jenkins/workspace/products/micro-integrator-asankaab-delete/features/org.wso2.carbon.micro.integrator.server.feature/target/org.wso2.carbon.micro.integrator.server.feature-1.1.0-SNAPSHOT.zip to org.wso2.ei/org.wso2.carbon.micro.integrator.server.feature/1.1.0-SNAPSHOT/org.wso2.carbon.micro.integrator.server.feature-1.1.0-SNAPSHOT.pom
[JENKINS] Archiving /home/jenkins/workspace/products/micro-integrator-asankaab-delete/features/org.wso2.carbon.micro.integrator.server.feature/target/org.wso2.carbon.micro.integrator.server.feature-1.1.0-SNAPSHOT.zip to org.wso2.ei/org.wso2.carbon.micro.integrator.server.feature/1.1.0-SNAPSHOT/org.wso2.carbon.micro.integrator.server.feature-1.1.0-SNAPSHOT.zip
[JENKINS] Archiving /home/jenkins/workspace/products/micro-integrator-asankaab-delete/integration/dataservice-hosting-tests/tests-integration/tests/pom.xml to org.wso2.ei/org.wso2.ei.integration.test/1.1.0-SNAPSHOT/org.wso2.ei.integration.test-1.1.0-SNAPSHOT.pom
[JENKINS] Archiving /home/jenkins/workspace/products/micro-integrator-asankaab-delete/integration/dataservice-hosting-tests/tests-integration/tests/target/org.wso2.ei.integration.test-1.1.0-SNAPSHOT.jar to org.wso2.ei/org.wso2.ei.integration.test/1.1.0-SNAPSHOT/org.wso2.ei.integration.test-1.1.0-SNAPSHOT.jar
[JENKINS] Archiving /home/jenkins/workspace/products/micro-integrator-asankaab-delete/integration/dataservice-hosting-tests/tests-integration/tests/target/org.wso2.ei.integration.test-1.1.0-SNAPSHOT-tests.jar to org.wso2.ei/org.wso2.ei.integration.test/1.1.0-SNAPSHOT/org.wso2.ei.integration.test-1.1.0-SNAPSHOT-tests.jar
[JENKINS] Archiving /home/jenkins/workspace/products/micro-integrator-asankaab-delete/integration/samples/product/pom.xml to org.wso2.ei/org.wso2.mi.samples/1.1.0-SNAPSHOT/org.wso2.mi.samples-1.1.0-SNAPSHOT.pom
[JENKINS] Archiving /home/jenkins/workspace/products/micro-integrator-asankaab-delete/integration/samples/product/target/org.wso2.mi.samples-1.1.0-SNAPSHOT.jar to org.wso2.ei/org.wso2.mi.samples/1.1.0-SNAPSHOT/org.wso2.mi.samples-1.1.0-SNAPSHOT.jar
[JENKINS] Archiving /home/jenkins/workspace/products/micro-integrator-asankaab-delete/integration/mediation-tests/coverage-report/pom.xml to org.wso2.ei/org.wso2.carbon.ei.integration.reports/1.1.0-SNAPSHOT/org.wso2.carbon.ei.integration.reports-1.1.0-SNAPSHOT.pom
[JENKINS] Archiving /home/jenkins/workspace/products/micro-integrator-asankaab-delete/integration/dataservice-hosting-tests/tests-integration/pom.xml to org.wso2.ei/dataservice-integration-tests/1.1.0-SNAPSHOT/dataservice-integration-tests-1.1.0-SNAPSHOT.pom
[JENKINS] Archiving /home/jenkins/workspace/products/micro-integrator-asankaab-delete/p2-profile/pom.xml to org.wso2.ei/micro-integrator-p2-profile/1.1.0-SNAPSHOT/micro-integrator-p2-profile-1.1.0-SNAPSHOT.pom
[JENKINS] Archiving /home/jenkins/workspace/products/micro-integrator-asankaab-delete/components/org.wso2.carbon.micro.integrator.core/pom.xml to org.wso2.ei/org.wso2.carbon.micro.integrator.core/1.1.0-SNAPSHOT/org.wso2.carbon.micro.integrator.core-1.1.0-SNAPSHOT.pom
[JENKINS] Archiving /home/jenkins/workspace/products/micro-integrator-asankaab-delete/components/org.wso2.carbon.micro.integrator.core/target/org.wso2.carbon.micro.integrator.core-1.1.0-SNAPSHOT.jar to org.wso2.ei/org.wso2.carbon.micro.integrator.core/1.1.0-SNAPSHOT/org.wso2.carbon.micro.integrator.core-1.1.0-SNAPSHOT.jar
[JENKINS] Archiving /home/jenkins/workspace/products/micro-integrator-asankaab-delete/components/org.wso2.carbon.micro.integrator.extensions/pom.xml to org.wso2.ei/org.wso2.carbon.micro.integrator.extensions/1.1.0-SNAPSHOT/org.wso2.carbon.micro.integrator.extensions-1.1.0-SNAPSHOT.pom
[JENKINS] Archiving /home/jenkins/workspace/products/micro-integrator-asankaab-delete/integration/dataservice-hosting-tests/pom.xml to org.wso2.ei/dataservice-integration/1.1.0-SNAPSHOT/dataservice-integration-1.1.0-SNAPSHOT.pom
[JENKINS] Archiving /home/jenkins/workspace/products/micro-integrator-asankaab-delete/integration/dataservice-hosting-tests/samples/data-services/clients/pom.xml to org.wso2.ei/dataservice-client-samples/1.1.0-SNAPSHOT/dataservice-client-samples-1.1.0-SNAPSHOT.pom
[JENKINS] Archiving /home/jenkins/workspace/products/micro-integrator-asankaab-delete/integration/dataservice-hosting-tests/samples/data-services/clients/target/dataservice-client-samples-1.1.0-SNAPSHOT.jar to org.wso2.ei/dataservice-client-samples/1.1.0-SNAPSHOT/dataservice-client-samples-1.1.0-SNAPSHOT.jar
[JENKINS] Archiving /home/jenkins/workspace/products/micro-integrator-asankaab-delete/integration/dataservice-hosting-tests/tests-common/admin-clients/pom.xml to org.wso2.ei/org.wso2.ei.dataservice.integration.common.clients/1.1.0-SNAPSHOT/org.wso2.ei.dataservice.integration.common.clients-1.1.0-SNAPSHOT.pom
[JENKINS] Archiving /home/jenkins/workspace/products/micro-integrator-asankaab-delete/integration/dataservice-hosting-tests/tests-common/admin-clients/target/org.wso2.ei.dataservice.integration.common.clients-1.1.0-SNAPSHOT.jar to org.wso2.ei/org.wso2.ei.dataservice.integration.common.clients/1.1.0-SNAPSHOT/org.wso2.ei.dataservice.integration.common.clients-1.1.0-SNAPSHOT.jar
[JENKINS] Archiving /home/jenkins/workspace/products/micro-integrator-asankaab-delete/integration/tests-common/admin-clients/pom.xml to org.wso2.ei/admin-clients/1.1.0-SNAPSHOT/admin-clients-1.1.0-SNAPSHOT.pom
[JENKINS] Archiving /home/jenkins/workspace/products/micro-integrator-asankaab-delete/integration/tests-common/admin-clients/target/admin-clients-1.1.0-SNAPSHOT.jar to org.wso2.ei/admin-clients/1.1.0-SNAPSHOT/admin-clients-1.1.0-SNAPSHOT.jar
[JENKINS] Archiving /home/jenkins/workspace/products/micro-integrator-asankaab-delete/integration/pom.xml to org.wso2.ei/micro-integrator-integration-test/1.1.0-SNAPSHOT/micro-integrator-integration-test-1.1.0-SNAPSHOT.pom
[JENKINS] Archiving /home/jenkins/workspace/products/micro-integrator-asankaab-delete/integration/mediation-tests/service-samples/pom.xml to org.wso2.ei/service-samples/1.1.0-SNAPSHOT/service-samples-1.1.0-SNAPSHOT.pom
[JENKINS] Archiving /home/jenkins/workspace/products/micro-integrator-asankaab-delete/integration/mediation-tests/service-samples/target/service-samples-1.1.0-SNAPSHOT.jar to org.wso2.ei/service-samples/1.1.0-SNAPSHOT/service-samples-1.1.0-SNAPSHOT.jar
[JENKINS] Archiving /home/jenkins/workspace/products/micro-integrator-asankaab-delete/components/org.wso2.carbon.micro.integrator.extensions/org.wso2.carbon.micro.integrator.management.apis/pom.xml to org.wso2.ei/org.wso2.carbon.micro.integrator.management.apis/1.1.0-SNAPSHOT/org.wso2.carbon.micro.integrator.management.apis-1.1.0-SNAPSHOT.pom
[JENKINS] Archiving /home/jenkins/workspace/products/micro-integrator-asankaab-delete/components/org.wso2.carbon.micro.integrator.extensions/org.wso2.carbon.micro.integrator.management.apis/target/org.wso2.carbon.micro.integrator.management.apis-1.1.0-SNAPSHOT.jar to org.wso2.ei/org.wso2.carbon.micro.integrator.management.apis/1.1.0-SNAPSHOT/org.wso2.carbon.micro.integrator.management.apis-1.1.0-SNAPSHOT.jar
[JENKINS] Archiving /home/jenkins/workspace/products/micro-integrator-asankaab-delete/pom.xml to org.wso2.ei/wso2-micro-integrator-parent/1.1.0-SNAPSHOT/wso2-micro-integrator-parent-1.1.0-SNAPSHOT.pom
[JENKINS] Archiving /home/jenkins/workspace/products/micro-integrator-asankaab-delete/integration/mediation-tests/tests-other/pom.xml to org.wso2.ei/org.wso2.carbon.ei.tests.other/1.1.0-SNAPSHOT/org.wso2.carbon.ei.tests.other-1.1.0-SNAPSHOT.pom
[JENKINS] Archiving /home/jenkins/workspace/products/micro-integrator-asankaab-delete/integration/mediation-tests/tests-other/target/org.wso2.carbon.ei.tests.other-1.1.0-SNAPSHOT.jar to org.wso2.ei/org.wso2.carbon.ei.tests.other/1.1.0-SNAPSHOT/org.wso2.carbon.ei.tests.other-1.1.0-SNAPSHOT.jar
[JENKINS] Archiving /home/jenkins/workspace/products/micro-integrator-asankaab-delete/integration/mediation-tests/tests-other/target/org.wso2.carbon.ei.tests.other-1.1.0-SNAPSHOT-tests.jar to org.wso2.ei/org.wso2.carbon.ei.tests.other/1.1.0-SNAPSHOT/org.wso2.carbon.ei.tests.other-1.1.0-SNAPSHOT-tests.jar
[JENKINS] Archiving /home/jenkins/workspace/products/micro-integrator-asankaab-delete/components/org.wso2.carbon.micro.integrator.security/pom.xml to org.wso2.ei/org.wso2.carbon.micro.integrator.security/1.1.0-SNAPSHOT/org.wso2.carbon.micro.integrator.security-1.1.0-SNAPSHOT.pom
[JENKINS] Archiving /home/jenkins/workspace/products/micro-integrator-asankaab-delete/components/org.wso2.carbon.micro.integrator.security/target/org.wso2.carbon.micro.integrator.security-1.1.0-SNAPSHOT.jar to org.wso2.ei/org.wso2.carbon.micro.integrator.security/1.1.0-SNAPSHOT/org.wso2.carbon.micro.integrator.security-1.1.0-SNAPSHOT.jar
[JENKINS] Archiving /home/jenkins/workspace/products/micro-integrator-asankaab-delete/integration/automation-extensions/pom.xml to org.wso2.ei/automation-extensions/1.1.0-SNAPSHOT/automation-extensions-1.1.0-SNAPSHOT.pom
[JENKINS] Archiving /home/jenkins/workspace/products/micro-integrator-asankaab-delete/integration/automation-extensions/target/automation-extensions-1.1.0-SNAPSHOT.jar to org.wso2.ei/automation-extensions/1.1.0-SNAPSHOT/automation-extensions-1.1.0-SNAPSHOT.jar
[JENKINS] Archiving /home/jenkins/workspace/products/micro-integrator-asankaab-delete/components/pom.xml to org.wso2.ei/mi-component-parent/1.1.0-SNAPSHOT/mi-component-parent-1.1.0-SNAPSHOT.pom
[JENKINS] Archiving /home/jenkins/workspace/products/micro-integrator-asankaab-delete/integration/mediation-tests/tests-patches/pom.xml to org.wso2.ei/org.wso2.carbon.ei.tests.patches/1.1.0-SNAPSHOT/org.wso2.carbon.ei.tests.patches-1.1.0-SNAPSHOT.pom
[JENKINS] Archiving /home/jenkins/workspace/products/micro-integrator-asankaab-delete/integration/mediation-tests/tests-patches/target/org.wso2.carbon.ei.tests.patches-1.1.0-SNAPSHOT.jar to org.wso2.ei/org.wso2.carbon.ei.tests.patches/1.1.0-SNAPSHOT/org.wso2.carbon.ei.tests.patches-1.1.0-SNAPSHOT.jar
[JENKINS] Archiving /home/jenkins/workspace/products/micro-integrator-asankaab-delete/integration/mediation-tests/tests-patches/target/org.wso2.carbon.ei.tests.patches-1.1.0-SNAPSHOT-tests.jar to org.wso2.ei/org.wso2.carbon.ei.tests.patches/1.1.0-SNAPSHOT/org.wso2.carbon.ei.tests.patches-1.1.0-SNAPSHOT-tests.jar
[JENKINS] Archiving /home/jenkins/workspace/products/micro-integrator-asankaab-delete/integration/mediation-tests/pom.xml to org.wso2.ei/mediation-integration/1.1.0-SNAPSHOT/mediation-integration-1.1.0-SNAPSHOT.pom
[JENKINS] Archiving /home/jenkins/workspace/products/micro-integrator-asankaab-delete/integration/mediation-tests/tests-mediator-1/pom.xml to org.wso2.ei/org.wso2.carbon.ei.tests.mediator-1/1.1.0-SNAPSHOT/org.wso2.carbon.ei.tests.mediator-1-1.1.0-SNAPSHOT.pom
[JENKINS] Archiving /home/jenkins/workspace/products/micro-integrator-asankaab-delete/integration/mediation-tests/tests-mediator-1/target/org.wso2.carbon.ei.tests.mediator-1-1.1.0-SNAPSHOT.jar to org.wso2.ei/org.wso2.carbon.ei.tests.mediator-1/1.1.0-SNAPSHOT/org.wso2.carbon.ei.tests.mediator-1-1.1.0-SNAPSHOT.jar
[JENKINS] Archiving /home/jenkins/workspace/products/micro-integrator-asankaab-delete/integration/mediation-tests/tests-mediator-1/target/org.wso2.carbon.ei.tests.mediator-1-1.1.0-SNAPSHOT-tests.jar to org.wso2.ei/org.wso2.carbon.ei.tests.mediator-1/1.1.0-SNAPSHOT/org.wso2.carbon.ei.tests.mediator-1-1.1.0-SNAPSHOT-tests.jar
[JENKINS] Archiving /home/jenkins/workspace/products/micro-integrator-asankaab-delete/integration/mediation-tests/tests-platform/tests-rabbitmq/pom.xml to org.wso2.ei/org.wso2.carbon.ei.tests.platform.rabbitmq/1.1.0-SNAPSHOT/org.wso2.carbon.ei.tests.platform.rabbitmq-1.1.0-SNAPSHOT.pom
[JENKINS] Archiving /home/jenkins/workspace/products/micro-integrator-asankaab-delete/integration/mediation-tests/tests-platform/tests-rabbitmq/target/org.wso2.carbon.ei.tests.platform.rabbitmq-1.1.0-SNAPSHOT.jar to org.wso2.ei/org.wso2.carbon.ei.tests.platform.rabbitmq/1.1.0-SNAPSHOT/org.wso2.carbon.ei.tests.platform.rabbitmq-1.1.0-SNAPSHOT.jar
[JENKINS] Archiving /home/jenkins/workspace/products/micro-integrator-asankaab-delete/distribution/pom.xml to org.wso2.ei/wso2mi/1.1.0-SNAPSHOT/wso2mi-1.1.0-SNAPSHOT.pom
[JENKINS] Archiving /home/jenkins/workspace/products/micro-integrator-asankaab-delete/distribution/target/wso2mi-1.1.0-SNAPSHOT.zip to org.wso2.ei/wso2mi/1.1.0-SNAPSHOT/wso2mi-1.1.0-SNAPSHOT.zip
[JENKINS] Archiving /home/jenkins/workspace/products/micro-integrator-asankaab-delete/integration/mediation-tests/tests-mediator-2/pom.xml to org.wso2.ei/org.wso2.carbon.ei.tests.mediator-2/1.1.0-SNAPSHOT/org.wso2.carbon.ei.tests.mediator-2-1.1.0-SNAPSHOT.pom
[JENKINS] Archiving /home/jenkins/workspace/products/micro-integrator-asankaab-delete/integration/mediation-tests/tests-mediator-2/target/org.wso2.carbon.ei.tests.mediator-2-1.1.0-SNAPSHOT.jar to org.wso2.ei/org.wso2.carbon.ei.tests.mediator-2/1.1.0-SNAPSHOT/org.wso2.carbon.ei.tests.mediator-2-1.1.0-SNAPSHOT.jar
[JENKINS] Archiving /home/jenkins/workspace/products/micro-integrator-asankaab-delete/integration/mediation-tests/tests-mediator-2/target/org.wso2.carbon.ei.tests.mediator-2-1.1.0-SNAPSHOT-tests.jar to org.wso2.ei/org.wso2.carbon.ei.tests.mediator-2/1.1.0-SNAPSHOT/org.wso2.carbon.ei.tests.mediator-2-1.1.0-SNAPSHOT-tests.jar
[JENKINS] Archiving /home/jenkins/workspace/products/micro-integrator-asankaab-delete/features/pom.xml to org.wso2.ei/micro-integrator-features/1.1.0-SNAPSHOT/micro-integrator-features-1.1.0-SNAPSHOT.pom
[JENKINS] Archiving /home/jenkins/workspace/products/micro-integrator-asankaab-delete/integration/dataservice-hosting-tests/samples/data-services/pom.xml to org.wso2.ei/dataservices-samples-parent/1.1.0-SNAPSHOT/dataservices-samples-parent-1.1.0-SNAPSHOT.pom
[JENKINS] Archiving /home/jenkins/workspace/products/micro-integrator-asankaab-delete/integration/tests-common/integration-test-utils/pom.xml to org.wso2.ei/integration-test-utils/1.1.0-SNAPSHOT/integration-test-utils-1.1.0-SNAPSHOT.pom
[JENKINS] Archiving /home/jenkins/workspace/products/micro-integrator-asankaab-delete/integration/tests-common/integration-test-utils/target/integration-test-utils-1.1.0-SNAPSHOT.jar to org.wso2.ei/integration-test-utils/1.1.0-SNAPSHOT/integration-test-utils-1.1.0-SNAPSHOT.jar
[JENKINS] Archiving /home/jenkins/workspace/products/micro-integrator-asankaab-delete/integration/mediation-tests/tests-platform/pom.xml to org.wso2.ei/org.wso2.carbon.ei.tests.platform/1.1.0-SNAPSHOT/org.wso2.carbon.ei.tests.platform-1.1.0-SNAPSHOT.pom
[JENKINS] Archiving /home/jenkins/workspace/products/micro-integrator-asankaab-delete/integration/dataservice-hosting-tests/samples/pom.xml to org.wso2.ei/mi-samples-parent/1.1.0-SNAPSHOT/mi-samples-parent-1.1.0-SNAPSHOT.pom
[JENKINS] Archiving /home/jenkins/workspace/products/micro-integrator-asankaab-delete/integration/dataservice-hosting-tests/tests-common/pom.xml to org.wso2.ei/dataservice-integration-tests-common/1.1.0-SNAPSHOT/dataservice-integration-tests-common-1.1.0-SNAPSHOT.pom
Sending e-mails to: [email protected]
Sending e-mails to: [email protected]
Sending e-mails to: [email protected]
Sending e-mails to: [email protected]
Sending e-mails to: [email protected]
Sending e-mails to: [email protected]
Sending e-mails to: [email protected]
executing script 'Script - Kill Carbon Servers'
channel stopped
[micro-integrator-asankaab-delete] $ /bin/bash /tmp/build_step_template2512508878415520016.sh
Running port and java processes validation has become successful.
[Current build status] check if current [UNSTABLE] is worse or equals then [SUCCESS] and better or equals then [SUCCESS]
Run condition [Current build status] preventing perform for step [Execute shell]
Archiving artifacts
[htmlpublisher] Archiving HTML reports...
[htmlpublisher] Archiving at BUILD level /home/jenkins/workspace/products/micro-integrator-asankaab-delete/integration/mediation-tests/coverage-report/target/jacoco/coverage to /build/jenkins-home/jobs/products/jobs/micro-integrator-asankaab-delete/builds/84/htmlreports/Integration_20Test_20Coverage_20Report
[JaCoCo plugin] Collecting JaCoCo coverage data...
[JaCoCo plugin] **/**.exec;**/classes;**/java; locations are configured
[JaCoCo plugin] Number of found exec files for pattern **/**.exec: 13
[JaCoCo plugin] Saving matched execfiles:  /home/jenkins/workspace/products/micro-integrator-asankaab-delete/integration/mediation-tests/coverage-report/target/jacoco/jacoco-data-merge.exec /home/jenkins/workspace/products/micro-integrator-asankaab-delete/integration/mediation-tests/tests-mediator-1/target/jacoco/jacoco-data-merge.exec /home/jenkins/workspace/products/micro-integrator-asankaab-delete/integration/mediation-tests/tests-mediator-1/target/jacoco/jacoco1560699586136.exec /home/jenkins/workspace/products/micro-integrator-asankaab-delete/integration/mediation-tests/tests-mediator-2/target/jacoco/jacoco-data-merge.exec /home/jenkins/workspace/products/micro-integrator-asankaab-delete/integration/mediation-tests/tests-mediator-2/target/jacoco/jacoco1560700145398.exec /home/jenkins/workspace/products/micro-integrator-asankaab-delete/integration/mediation-tests/tests-other/target/jacoco/jacoco-data-merge.exec /home/jenkins/workspace/products/micro-integrator-asankaab-delete/integration/mediation-tests/tests-other/target/jacoco/jacoco1560701176976.exec /home/jenkins/workspace/products/micro-integrator-asankaab-delete/integration/mediation-tests/tests-patches/target/jacoco/jacoco-data-merge.exec /home/jenkins/workspace/products/micro-integrator-asankaab-delete/integration/mediation-tests/tests-patches/target/jacoco/jacoco1560700600892.exec /home/jenkins/workspace/products/micro-integrator-asankaab-delete/integration/mediation-tests/tests-sample/target/jacoco/jacoco-data-merge.exec /home/jenkins/workspace/products/micro-integrator-asankaab-delete/integration/mediation-tests/tests-sample/target/jacoco/jacoco1560701021633.exec /home/jenkins/workspace/products/micro-integrator-asankaab-delete/integration/mediation-tests/tests-service/target/jacoco/jacoco-data-merge.exec /home/jenkins/workspace/products/micro-integrator-asankaab-delete/integration/mediation-tests/tests-service/target/jacoco/jacoco1560698605235.exec
[JaCoCo plugin] Saving matched class directories for class-pattern: **/classes: 
[JaCoCo plugin]  - /home/jenkins/workspace/products/micro-integrator-asankaab-delete/components/org.wso2.carbon.micro.integrator.core/target/classes 127 files
[JaCoCo plugin]  - /home/jenkins/workspace/products/micro-integrator-asankaab-delete/components/org.wso2.carbon.micro.integrator.extensions/org.wso2.carbon.micro.integrator.management.apis/target/classes 10 files
[JaCoCo plugin]  - /home/jenkins/workspace/products/micro-integrator-asankaab-delete/components/org.wso2.carbon.micro.integrator.security/target/classes 16 files
[JaCoCo plugin]  - /home/jenkins/workspace/products/micro-integrator-asankaab-delete/components/org.wso2.carbon.micro.integrator.server/target/classes 2 files
[JaCoCo plugin]  - /home/jenkins/workspace/products/micro-integrator-asankaab-delete/integration/automation-extensions/target/classes 12 files
[JaCoCo plugin]  - /home/jenkins/workspace/products/micro-integrator-asankaab-delete/integration/dataservice-hosting-tests/samples/data-services/clients/target/classes 406 files
[JaCoCo plugin]  - /home/jenkins/workspace/products/micro-integrator-asankaab-delete/integration/dataservice-hosting-tests/tests-common/admin-clients/target/classes 6 files
[JaCoCo plugin]  - /home/jenkins/workspace/products/micro-integrator-asankaab-delete/integration/dataservice-hosting-tests/tests-common/integration-test-utils/target/classes 3 files
[JaCoCo plugin]  - /home/jenkins/workspace/products/micro-integrator-asankaab-delete/integration/dataservice-hosting-tests/tests-integration/tests/target/carbontmp1560701610410/wso2mi-1.1.0-SNAPSHOT/samples/product/target/classes 27 files
[JaCoCo plugin]  - /home/jenkins/workspace/products/micro-integrator-asankaab-delete/integration/dataservice-hosting-tests/tests-integration/tests/target/classes 0 files
[JaCoCo plugin]  - /home/jenkins/workspace/products/micro-integrator-asankaab-delete/integration/dataservice-hosting-tests/tests-integration/tests/target/samples/product/target/classes 27 files
[JaCoCo plugin]  - /home/jenkins/workspace/products/micro-integrator-asankaab-delete/integration/mediation-tests/service-samples/target/classes 30 files
[JaCoCo plugin]  - /home/jenkins/workspace/products/micro-integrator-asankaab-delete/integration/mediation-tests/tests-mediator-1/target/carbontmp1560699584460/wso2mi-1.1.0-SNAPSHOT/samples/product/target/classes 27 files
[JaCoCo plugin]  - /home/jenkins/workspace/products/micro-integrator-asankaab-delete/integration/mediation-tests/tests-mediator-1/target/classes 0 files
[JaCoCo plugin]  - /home/jenkins/workspace/products/micro-integrator-asankaab-delete/integration/mediation-tests/tests-mediator-1/target/samples/product/target/classes 27 files
[JaCoCo plugin]  - /home/jenkins/workspace/products/micro-integrator-asankaab-delete/integration/mediation-tests/tests-mediator-2/target/carbontmp1560700143746/wso2mi-1.1.0-SNAPSHOT/samples/product/target/classes 27 files
[JaCoCo plugin]  - /home/jenkins/workspace/products/micro-integrator-asankaab-delete/integration/mediation-tests/tests-mediator-2/target/classes 0 files
[JaCoCo plugin]  - /home/jenkins/workspace/products/micro-integrator-asankaab-delete/integration/mediation-tests/tests-mediator-2/target/samples/product/target/classes 27 files
[JaCoCo plugin]  - /home/jenkins/workspace/products/micro-integrator-asankaab-delete/integration/mediation-tests/tests-other/src/test/resources/artifacts/ESB/synapseconfig/config8/classes 0 files
[JaCoCo plugin]  - /home/jenkins/workspace/products/micro-integrator-asankaab-delete/integration/mediation-tests/tests-other/target/carbontmp1560701175320/wso2mi-1.1.0-SNAPSHOT/samples/product/target/classes 27 files
[JaCoCo plugin]  - /home/jenkins/workspace/products/micro-integrator-asankaab-delete/integration/mediation-tests/tests-other/target/classes 0 files
[JaCoCo plugin]  - /home/jenkins/workspace/products/micro-integrator-asankaab-delete/integration/mediation-tests/tests-other/target/samples/product/target/classes 27 files
[JaCoCo plugin]  - /home/jenkins/workspace/products/micro-integrator-asankaab-delete/integration/mediation-tests/tests-other/target/test-classes/artifacts/ESB/synapseconfig/config8/classes 0 files
[JaCoCo plugin]  - /home/jenkins/workspace/products/micro-integrator-asankaab-delete/integration/mediation-tests/tests-patches/src/test/resources/artifacts/ESB/synapseconfig/config8/classes 0 files
[JaCoCo plugin]  - /home/jenkins/workspace/products/micro-integrator-asankaab-delete/integration/mediation-tests/tests-patches/target/carbontmp1560700599235/wso2mi-1.1.0-SNAPSHOT/samples/product/target/classes 27 files
[JaCoCo plugin]  - /home/jenkins/workspace/products/micro-integrator-asankaab-delete/integration/mediation-tests/tests-patches/target/classes 0 files
[JaCoCo plugin]  - /home/jenkins/workspace/products/micro-integrator-asankaab-delete/integration/mediation-tests/tests-patches/target/samples/product/target/classes 27 files
[JaCoCo plugin]  - /home/jenkins/workspace/products/micro-integrator-asankaab-delete/integration/mediation-tests/tests-patches/target/test-classes/artifacts/ESB/synapseconfig/config8/classes 0 files
[JaCoCo plugin]  - /home/jenkins/workspace/products/micro-integrator-asankaab-delete/integration/mediation-tests/tests-platform/tests-rabbitmq/target/classes 0 files
[JaCoCo plugin]  - /home/jenkins/workspace/products/micro-integrator-asankaab-delete/integration/mediation-tests/tests-sample/src/test/resources/artifacts/ESB/synapseconfig/config8/classes 0 files
[JaCoCo plugin]  - /home/jenkins/workspace/products/micro-integrator-asankaab-delete/integration/mediation-tests/tests-sample/target/carbontmp1560701019987/wso2mi-1.1.0-SNAPSHOT/samples/product/target/classes 27 files
[JaCoCo plugin]  - /home/jenkins/workspace/products/micro-integrator-asankaab-delete/integration/mediation-tests/tests-sample/target/classes 0 files
[JaCoCo plugin]  - /home/jenkins/workspace/products/micro-integrator-asankaab-delete/integration/mediation-tests/tests-sample/target/samples/product/target/classes 27 files
[JaCoCo plugin]  - /home/jenkins/workspace/products/micro-integrator-asankaab-delete/integration/mediation-tests/tests-sample/target/test-classes/artifacts/ESB/synapseconfig/config8/classes 0 files
[JaCoCo plugin]  - /home/jenkins/workspace/products/micro-integrator-asankaab-delete/integration/mediation-tests/tests-service/src/test/resources/artifacts/ESB/synapseconfig/config8/classes 0 files
[JaCoCo plugin]  - /home/jenkins/workspace/products/micro-integrator-asankaab-delete/integration/mediation-tests/tests-service/target/carbontmp1560698603562/wso2mi-1.1.0-SNAPSHOT/samples/product/target/classes 27 files
[JaCoCo plugin]  - /home/jenkins/workspace/products/micro-integrator-asankaab-delete/integration/mediation-tests/tests-service/target/classes 0 files
[JaCoCo plugin]  - /home/jenkins/workspace/products/micro-integrator-asankaab-delete/integration/mediation-tests/tests-service/target/samples/product/target/classes 27 files
[JaCoCo plugin]  - /home/jenkins/workspace/products/micro-integrator-asankaab-delete/integration/mediation-tests/tests-service/target/test-classes/artifacts/ESB/synapseconfig/config8/classes 0 files
[JaCoCo plugin]  - /home/jenkins/workspace/products/micro-integrator-asankaab-delete/integration/mediation-tests/tests-transport/src/test/resources/artifacts/ESB/synapseconfig/config8/classes 0 files
[JaCoCo plugin]  - /home/jenkins/workspace/products/micro-integrator-asankaab-delete/integration/mediation-tests/tests-transport/target/carbontmp1560697508171/wso2mi-1.1.0-SNAPSHOT/samples/product/target/classes 27 files
[JaCoCo plugin]  - /home/jenkins/workspace/products/micro-integrator-asankaab-delete/integration/mediation-tests/tests-transport/target/classes 0 files
[JaCoCo plugin]  - /home/jenkins/workspace/products/micro-integrator-asankaab-delete/integration/mediation-tests/tests-transport/target/samples/product/target/classes 27 files
[JaCoCo plugin]  - /home/jenkins/workspace/products/micro-integrator-asankaab-delete/integration/mediation-tests/tests-transport/target/test-classes/artifacts/ESB/synapseconfig/config8/classes 0 files
[JaCoCo plugin]  - /home/jenkins/workspace/products/micro-integrator-asankaab-delete/integration/samples/product/target/classes 27 files
[JaCoCo plugin]  - /home/jenkins/workspace/products/micro-integrator-asankaab-delete/integration/tests-common/admin-clients/target/classes 38 files
[JaCoCo plugin]  - /home/jenkins/workspace/products/micro-integrator-asankaab-delete/integration/tests-common/integration-test-utils/target/classes 82 files
[JaCoCo plugin] Saving matched source directories for source-pattern: **/java: 
[JaCoCo plugin] - /home/jenkins/workspace/products/micro-integrator-asankaab-delete/.repository/net/java 0 files
[JaCoCo plugin] - /home/jenkins/workspace/products/micro-integrator-asankaab-delete/components/org.wso2.carbon.micro.integrator.core/src/main/java 104 files
[JaCoCo plugin] - /home/jenkins/workspace/products/micro-integrator-asankaab-delete/components/org.wso2.carbon.micro.integrator.extensions/org.wso2.carbon.micro.integrator.management.apis/src/main/java 10 files
[JaCoCo plugin] - /home/jenkins/workspace/products/micro-integrator-asankaab-delete/components/org.wso2.carbon.micro.integrator.security/src/main/java 14 files
[JaCoCo plugin] - /home/jenkins/workspace/products/micro-integrator-asankaab-delete/components/org.wso2.carbon.micro.integrator.server/src/main/java 1 files
[JaCoCo plugin] - /home/jenkins/workspace/products/micro-integrator-asankaab-delete/integration/automation-extensions/src/main/java 11 files
[JaCoCo plugin] - /home/jenkins/workspace/products/micro-integrator-asankaab-delete/integration/dataservice-hosting-tests/tests-common/admin-clients/src/main/java 6 files
[JaCoCo plugin] - /home/jenkins/workspace/products/micro-integrator-asankaab-delete/integration/dataservice-hosting-tests/tests-common/integration-test-utils/src/main/java 3 files
[JaCoCo plugin] - /home/jenkins/workspace/products/micro-integrator-asankaab-delete/integration/dataservice-hosting-tests/tests-integration/tests/src/test/java 106 files
[JaCoCo plugin] - /home/jenkins/workspace/products/micro-integrator-asankaab-delete/integration/dataservice-hosting-tests/tests-integration/tests/src/test/resources/artifacts/DSS/sources/msgContextHandler/src/main/java 1 files
[JaCoCo plugin] - /home/jenkins/workspace/products/micro-integrator-asankaab-delete/integration/dataservice-hosting-tests/tests-integration/tests/src/test/resources/artifacts/DSS/sources/roleRetriever/src/main/java 1 files
[JaCoCo plugin] - /home/jenkins/workspace/products/micro-integrator-asankaab-delete/integration/dataservice-hosting-tests/tests-integration/tests/target/carbontmp1560701610410/wso2mi-1.1.0-SNAPSHOT/samples/product/src/main/java 23 files
[JaCoCo plugin] - /home/jenkins/workspace/products/micro-integrator-asankaab-delete/integration/dataservice-hosting-tests/tests-integration/tests/target/samples/product/src/main/java 23 files
[JaCoCo plugin] - /home/jenkins/workspace/products/micro-integrator-asankaab-delete/integration/dataservice-hosting-tests/tests-integration/tests/target/test-classes/artifacts/DSS/sources/msgContextHandler/src/main/java 1 files
[JaCoCo plugin] - /home/jenkins/workspace/products/micro-integrator-asankaab-delete/integration/dataservice-hosting-tests/tests-integration/tests/target/test-classes/artifacts/DSS/sources/roleRetriever/src/main/java 1 files
[JaCoCo plugin] - /home/jenkins/workspace/products/micro-integrator-asankaab-delete/integration/mediation-tests/service-samples/src/main/java 30 files
[JaCoCo plugin] - /home/jenkins/workspace/products/micro-integrator-asankaab-delete/integration/mediation-tests/tests-mediator-1/src/test/java 367 files
[JaCoCo plugin] - /home/jenkins/workspace/products/micro-integrator-asankaab-delete/integration/mediation-tests/tests-mediator-1/target/carbontmp1560699584460/wso2mi-1.1.0-SNAPSHOT/samples/product/src/main/java 23 files
[JaCoCo plugin] - /home/jenkins/workspace/products/micro-integrator-asankaab-delete/integration/mediation-tests/tests-mediator-1/target/samples/product/src/main/java 23 files
[JaCoCo plugin] - /home/jenkins/workspace/products/micro-integrator-asankaab-delete/integration/mediation-tests/tests-mediator-2/src/test/java 126 files
[JaCoCo plugin] - /home/jenkins/workspace/products/micro-integrator-asankaab-delete/integration/mediation-tests/tests-mediator-2/target/carbontmp1560700143746/wso2mi-1.1.0-SNAPSHOT/samples/product/src/main/java 23 files
[JaCoCo plugin] - /home/jenkins/workspace/products/micro-integrator-asankaab-delete/integration/mediation-tests/tests-mediator-2/target/samples/product/src/main/java 23 files
[JaCoCo plugin] - /home/jenkins/workspace/products/micro-integrator-asankaab-delete/integration/mediation-tests/tests-other/src/test/java 58 files
[JaCoCo plugin] - /home/jenkins/workspace/products/micro-integrator-asankaab-delete/integration/mediation-tests/tests-other/target/carbontmp1560701175320/wso2mi-1.1.0-SNAPSHOT/samples/product/src/main/java 23 files
[JaCoCo plugin] - /home/jenkins/workspace/products/micro-integrator-asankaab-delete/integration/mediation-tests/tests-other/target/samples/product/src/main/java 23 files
[JaCoCo plugin] - /home/jenkins/workspace/products/micro-integrator-asankaab-delete/integration/mediation-tests/tests-patches/src/test/java 88 files
[JaCoCo plugin] - /home/jenkins/workspace/products/micro-integrator-asankaab-delete/integration/mediation-tests/tests-patches/target/carbontmp1560700599235/wso2mi-1.1.0-SNAPSHOT/samples/product/src/main/java 23 files
[JaCoCo plugin] - /home/jenkins/workspace/products/micro-integrator-asankaab-delete/integration/mediation-tests/tests-patches/target/samples/product/src/main/java 23 files
[JaCoCo plugin] - /home/jenkins/workspace/products/micro-integrator-asankaab-delete/integration/mediation-tests/tests-platform/tests-rabbitmq/src/test/java 16 files
[JaCoCo plugin] - /home/jenkins/workspace/products/micro-integrator-asankaab-delete/integration/mediation-tests/tests-platform/tests-sap/src/test/java 3 files
[JaCoCo plugin] - /home/jenkins/workspace/products/micro-integrator-asankaab-delete/integration/mediation-tests/tests-platform/tests-wso2mb/src/test/java 3 files
[JaCoCo plugin] - /home/jenkins/workspace/products/micro-integrator-asankaab-delete/integration/mediation-tests/tests-sample/src/test/java 37 files
[JaCoCo plugin] - /home/jenkins/workspace/products/micro-integrator-asankaab-delete/integration/mediation-tests/tests-sample/target/carbontmp1560701019987/wso2mi-1.1.0-SNAPSHOT/samples/product/src/main/java 23 files
[JaCoCo plugin] - /home/jenkins/workspace/products/micro-integrator-asankaab-delete/integration/mediation-tests/tests-sample/target/samples/product/src/main/java 23 files
[JaCoCo plugin] - /home/jenkins/workspace/products/micro-integrator-asankaab-delete/integration/mediation-tests/tests-service/src/test/java 149 files
[JaCoCo plugin] - /home/jenkins/workspace/products/micro-integrator-asankaab-delete/integration/mediation-tests/tests-service/target/carbontmp1560698603562/wso2mi-1.1.0-SNAPSHOT/samples/product/src/main/java 23 files
[JaCoCo plugin] - /home/jenkins/workspace/products/micro-integrator-asankaab-delete/integration/mediation-tests/tests-service/target/samples/product/src/main/java 23 files
[JaCoCo plugin] - /home/jenkins/workspace/products/micro-integrator-asankaab-delete/integration/mediation-tests/tests-transport/src/test/java 130 files
[JaCoCo plugin] - /home/jenkins/workspace/products/micro-integrator-asankaab-delete/integration/mediation-tests/tests-transport/target/carbontmp1560697508171/wso2mi-1.1.0-SNAPSHOT/samples/product/src/main/java 23 files
[JaCoCo plugin] - /home/jenkins/workspace/products/micro-integrator-asankaab-delete/integration/mediation-tests/tests-transport/target/samples/product/src/main/java 23 files
[JaCoCo plugin] - /home/jenkins/workspace/products/micro-integrator-asankaab-delete/integration/samples/product/src/main/java 23 files
[JaCoCo plugin] - /home/jenkins/workspace/products/micro-integrator-asankaab-delete/integration/tests-common/admin-clients/src/main/java 38 files
[JaCoCo plugin] - /home/jenkins/workspace/products/micro-integrator-asankaab-delete/integration/tests-common/integration-test-utils/src/main/java 64 files
[JaCoCo plugin] - /home/jenkins/workspace/products/micro-integrator-asankaab-delete/migration/registry/from-mi-1.0.0-to-later/src/main/java 1 files
[JaCoCo plugin] Loading inclusions files..
[JaCoCo plugin] inclusions: [**/*.class]
[JaCoCo plugin] exclusions: [ ]
[JaCoCo plugin] Thresholds: JacocoHealthReportThresholds [minClass=70, maxClass=70, minMethod=70, maxMethod=70, minLine=70, maxLine=70, minBranch=70, maxBranch=70, minInstruction=70, maxInstruction=70, minComplexity=70, maxComplexity=70]
[JaCoCo plugin] Publishing the results..
[JaCoCo plugin] Loading packages..
[JaCoCo plugin] Done.
[JaCoCo plugin] Overall coverage: class: 0, method: 0, line: 0, branch: 0, instruction: 0
[JaCoCo plugin] Collecting .java , .class and jacoco.exec files
[JaCoCo plugin] Creating folder to store files
[JaCoCo plugin] File created successfully at /build/jenkins-home/jobs/products/jobs/micro-integrator-asankaab-delete/builds/84
[JaCoCo plugin] Found 13 jacoco.exec files.Merging...
[JaCoCo plugin] Successfully merged jacoco.exec files
[JaCoCo plugin] Compressing Jacoco resource folder...
[JaCoCo plugin] Successfully compressed jacoco resource folder
[BFA] Scanning build for known causes...
[BFA] Found failure cause(s):
[BFA] There are test failures
[BFA] Done. 88s
[BFA] Found failed test case: testSOAPAction
[BFA] Found failed test case: enrichMediatorTest
[BFA] Found failed test case: testSOAP11FaultActor
[BFA] Found failed test case: testFloatVal
[BFA] Found failed test case: testIntVal
[BFA] Found failed test case: testLongVal
[BFA] Found failed test case: testShortVal
[BFA] Found failed test case: testStringVal
[BFA] Found failed test case: testFloatVal
[BFA] Found failed test case: testIntVal
[BFA] Found failed test case: testLongVal
[BFA] Found failed test case: testShortVal
[BFA] Found failed test case: testStringVal
[BFA] Found failed test case: testFloatVal
[BFA] Found failed test case: testIntVal
[BFA] Found failed test case: testLongVal
[BFA] Found failed test case: testShortVal
[BFA] Found failed test case: testStringVal
[BFA] Found failed test case: testFloatVal
[BFA] Found failed test case: testIntVal
[BFA] Found failed test case: testLongVal
[BFA] Found failed test case: testShortVal
[BFA] Found failed test case: testStringVal
[BFA] Found failed test case: testStringVal
[BFA] Found failed test case: transformPayloadByArgsValue
[BFA] Found failed test case: transformPayloadByArgsValue
[BFA] Found failed test case: transformPayloadByArgsValue
[BFA] Found failed test case: testSequence
[BFA] Found failed test case: testSequence
[BFA] Found failed test case: testRESPONSETEnabledTrue
[BFA] Found failed test case: invokeServiceFromXmlRequest
[BFA] Found failed test case: invokeServiceFromXmlRequest
[BFA] Found failed test case: invokeServiceFromXmlRequest
[BFA] Found failed test case: setEnvironment
[BFA] Found failed test case: testConcurrencyAndRequestBasedPolicyThrottlingConcurrency
[BFA] Found failed test case: setEnvironment
[BFA] Found failed test case: checkOnCompleteExecutionInClone
[BFA] Found failed test case: checkOnCompleteExecutionInIterator
[BFA] Found failed test case: setEnvironment
[BFA] Found failed test case: setEnvironment
[BFA] Found failed test case: init
[BFA] Found failed test case: init
[BFA] Found failed test case: testCollectorTypeMediator
[BFA] Found failed test case: testExcludingHeaders
[BFA] Found failed test case: testMaxAge
[BFA] Found failed test case: testNoStore
[BFA] Found failed test case: testMaxSize
[BFA] Found failed test case: testSmallMessageSize
[BFA] Found failed test case: testExcludingMultipleHeaders
[BFA] Found failed test case: testTemplatesParameter
[BFA] Found failed test case: testCalloutJMSHeaders
[BFA] Found failed test case: test_sourceXpathTargetXpath
[BFA] Found failed test case: setEnvironment
[BFA] Found failed test case: test_faultSeqCalledWhenSoapWhenGotSoapFault
[BFA] Found failed test case: transportCleanupOnFaultTest
[BFA] Found failed test case: TestDynamicEndPoints
[BFA] Found failed test case: TestPath
[BFA] Found failed test case: callMediatorInMainScenario2TestCase
[BFA] Found failed test case: callMediatorInMainTestCase
[BFA] Found failed test case: callMediatorFailOverTestCase
[BFA] Found failed test case: perAPILogPrintTest
[BFA] Found failed test case: testAggregateID
[BFA] Found failed test case: testHTTPS
[BFA] Found failed test case: setEnvironment
[BFA] Found failed test case: conditionalRouterMediatorWithContinueAfterFalseTest
[BFA] Found failed test case: conditionalRouterMediatorWithContinueAfterTrueTest
[BFA] Found failed test case: conditionalRouterMediatorWithDynamicSequenceTest
[BFA] Found failed test case: messageStoreFIXStoringTest
[BFA] Found failed test case: setEnvironment
[BFA] Found failed test case: setEnvironment
[BFA] Found failed test case: setEnvironment
[BFA] Found failed test case: messageStorePersistenceTest
[BFA] Found failed test case: destroy
[BFA] Found failed test case: test
[BFA] Found failed test case: uploadSynapseConfig
[BFA] Found failed test case: dropMediatorTest
[BFA] Found failed test case: uploadSynapseConfig
[BFA] Found failed test case: uploadSynapseConfig
[BFA] Found failed test case: uploadSynapseConfig
[BFA] Found failed test case: uploadSynapseConfig
[BFA] Found failed test case: uploadSynapseConfig
[BFA] Found failed test case: testSecuredProxySecuredService
[BFA] Found failed test case: testSOAP11FaultCodeVersionMismatched
[BFA] Found failed test case: testSOAP12FaultCodeReceiver
[BFA] Found failed test case: testSOAP12FaultCodeVersionMismatched
[BFA] Found failed test case: testSOAP12FaultFromOutSequence
[BFA] Found failed test case: testSOAP11FaultDetail
[BFA] Found failed test case: testSOAP12FullFaultMessage
[BFA] Found failed test case: testSOAP11FaultCodeServer
[BFA] Found failed test case: testSOAP12FaultStringExpression
[BFA] Found failed test case: testSOAP11FaultAttributeResponseFalseWithAddressing
[BFA] Found failed test case: testSOAP11FaultFromOutSequence
[BFA] Found failed test case: testSOAP11FaultStringValue
[BFA] Found failed test case: testSOAP12FaultDetail
[BFA] Found failed test case: testSOAP11FaultAttributeResponseFalse
[BFA] Found failed test case: testSOAP12FaultCodeDataEncodingUnknown
[BFA] Found failed test case: testSOAP11FaultCodeClient
[BFA] Found failed test case: testSOAP12FaultCodeSender
[BFA] Found failed test case: testSOAP12FaultStringValue
[BFA] Found failed test case: testSOAP12FaultDetailAsElement
[BFA] Found failed test case: testSOAP11FaultCodeMustUnderstand
[BFA] Found failed test case: testSOAP12FaultAttributeResponseFalse
[BFA] Found failed test case: testSOAP12FaultCodeMustUnderstand
[BFA] Found failed test case: testSOAP11FaultStringExpression
[BFA] Found failed test case: testSOAP12FaultActor
[BFA] Found failed test case: testSOAP12FaultAttributeResponseTrue
[BFA] Found failed test case: testSOAP12FaultAttributeResponseFalseWithAddressing
[BFA] Found failed test case: testSOAP12FaultNode
[BFA] Found failed test case: testForceErrorOnSoapFault
[BFA] Found failed test case: testSOAP11FaultAttributeResponseTrue
[BFA] Found failed test case: testSOAP11FaultDetailAsElement
[BFA] Found failed test case: filterMediatorWithSourceAndRegexNSTest
[BFA] Found failed test case: filterMediatorWithSourceAndRegexTest
[BFA] Found failed test case: inSequenceTest
[BFA] Found failed test case: inSequenceSample15Test
[BFA] Found failed test case: testSendingToDefinedEndpoint
[BFA] Found failed test case: testSystemLogs
[BFA] Found failed test case: setEnvironment
[BFA] Found failed test case: testMultipleOutMediators
[BFA] Found failed test case: testOutWithoutChildren
[BFA] Found failed test case: maxConcurrentConsumersTest
[BFA] Found failed test case: testOMVal
[BFA] Found failed test case: testXpathURLProperty
[BFA] Found failed test case: testOMVal
[BFA] Found failed test case: setEnvironment
[BFA] Found failed test case: testOMVal
[BFA] Found failed test case: testOMVal
[BFA] Found failed test case: testDisableAddressingForOutMessages
[BFA] Found failed test case: testPRESERVE_WS_ADDRESSINGProperty
[BFA] Found failed test case: testAddingJMSCoorelationID
[BFA] Found failed test case: transformUsingPayloadFactory
[BFA] Found failed test case: transformPayloadByArgsBothValueAndExpression
[BFA] Found failed test case: testSpecialCharactersAtPayloadFactory
[BFA] Found failed test case: setEnvironment
[BFA] Found failed test case: reWriteHostName
[BFA] Found failed test case: reWriteHostName
[BFA] Found failed test case: reWriteHostName
[BFA] Found failed test case: setPath
[BFA] Found failed test case: setPath
[BFA] Found failed test case: setPath
[BFA] Found failed test case: setPath
[BFA] Found failed test case: setPath
[BFA] Found failed test case: setPath
[BFA] Found failed test case: removeAndReWritePort
[BFA] Found failed test case: removeAndReWritePort
[BFA] Found failed test case: removeAndReWriteProtocol
[BFA] Found failed test case: prependFulUrl
[BFA] Found failed test case: prependFulUrl
[BFA] Found failed test case: appendFulUrl
[BFA] Found failed test case: appendFulUrl
[BFA] Found failed test case: reWriteProtocol
[BFA] Found failed test case: invokeService
[BFA] Found failed test case: invokeService
[BFA] Found failed test case: setHostName
[BFA] Found failed test case: setHostName
[BFA] Found failed test case: setHostName
[BFA] Found failed test case: reWriteProtocol
[BFA] Found failed test case: reWriteProtocol
[BFA] Found failed test case: reWriteContext
[BFA] Found failed test case: reWriteContext
[BFA] Found failed test case: reWriteContext
[BFA] Found failed test case: reWriteContext
[BFA] Found failed test case: appendPath
[BFA] Found failed test case: appendPath
[BFA] Found failed test case: prependProtocol
[BFA] Found failed test case: prependProtocol
[BFA] Found failed test case: prependProtocol
[BFA] Found failed test case: appendHostName
[BFA] Found failed test case: appendHostName
[BFA] Found failed test case: reWritePort
[BFA] Found failed test case: reWritePort
[BFA] Found failed test case: removeAndReWritePath
[BFA] Found failed test case: removeAndReWritePath
[BFA] Found failed test case: removeAndReWritePath
[BFA] Found failed test case: removeAndReWritePath
[BFA] Found failed test case: appendProtocol
[BFA] Found failed test case: appendProtocol
[BFA] Found failed test case: appendProtocol
[BFA] Found failed test case: removeAndReWriteFulUrl
[BFA] Found failed test case: removeAndReWriteFulUrl
[BFA] Found failed test case: removeAndReWriteFulUrl
[BFA] Found failed test case: removeAndReWriteFulUrl
[BFA] Found failed test case: removeAndReWriteFulUrl
[BFA] Found failed test case: removeAndReWriteFulUrl
[BFA] Found failed test case: removeAndReWriteFulUrl
[BFA] Found failed test case: prependPath
[BFA] Found failed test case: prependPath
[BFA] Found failed test case: setProtocol
[BFA] Found failed test case: setProtocol
[BFA] Found failed test case: setProtocol
[BFA] Found failed test case: reWriteProtocol
[BFA] Found failed test case: setPort
[BFA] Found failed test case: setPort
[BFA] Found failed test case: setPort
[BFA] Found failed test case: setPort
[BFA] Found failed test case: setPort
[BFA] Found failed test case: prependHostName
[BFA] Found failed test case: prependHostName
[BFA] Found failed test case: reWriteUrl
[BFA] Found failed test case: reWriteUrl
[BFA] Found failed test case: setFulUrl
[BFA] Found failed test case: setFulUrl
[BFA] Found failed test case: setFulUrl
[BFA] Found failed test case: setFulUrl
[BFA] Found failed test case: testEndpoints
[BFA] Found failed test case: close
[BFA] Found failed test case: setEnvironment
[BFA] Found failed test case: testSequences
[BFA] Found failed test case: testLargeMessage
[BFA] Found failed test case: testLargeNumbers
[BFA] Found failed test case: testSmallNumbers
[BFA] Found failed test case: testNestedForEachPropertiesWithID
[BFA] Found failed test case: testSequentialExecution
[BFA] Found failed test case: testForEachInlineSequenceWithIterateEndpoint
[BFA] Found failed test case: testForEachSequenceRefWithIterateEndpoint
[BFA] Found failed test case: testMultipleForEachPropertiesWithID
[BFA] Found failed test case: testMultipleForEachPropertiesWithoutID
[BFA] Found failed test case: testSingleForEachProperties
[BFA] Found failed test case: testForEachMediatorWithJSONPayload
[BFA] Found failed test case: testForEachPropertyMediator
[BFA] Found failed test case: testNestedForEachPropertiesWithID
[BFA] Found failed test case: testNestedForEach
[BFA] Found failed test case: testNestedForEachMediatorWithIterate
[BFA] Found failed test case: testLargeNumbers
[BFA] Found failed test case: testSmallNumbers
[BFA] Found failed test case: testInvokeIBMRule
[BFA] Found failed test case: testInvokeInvalidRule
[BFA] Found failed test case: testInvokeIBMRule
[BFA] Found failed test case: testInvokeInvalidRule
[BFA] Found failed test case: testInvokeMSFTRule
[BFA] Found failed test case: testInvokeSUNRule
[BFA] Found failed test case: testInvokeIBMRule
[BFA] Found failed test case: testInvokeInvalidRule
[BFA] Found failed test case: testInvokeMSFTRule
[BFA] Found failed test case: testInvokeSUNRule
[BFA] Found failed test case: testSequenceWithOutRuleSet
[BFA] Found failed test case: testInvokeIBMRule
[BFA] Found failed test case: testInvokeInvalidRule
[BFA] Found failed test case: testInvokeMSFTRule
[BFA] Found failed test case: testInvokeSUNRule
[BFA] Found failed test case: dbLookupMediatorTestMultipleStatements
[BFA] Found failed test case: dbLookupMediatorTestWithMultipleResults
[BFA] Found failed test case: dbLookupTestSelectRows
[BFA] Found failed test case: dbLookupTestStoredFunctions
[BFA] Found failed test case: dbLookupTestStoredProcedures
[BFA] Found failed test case: DBMediatorReplaceLessThanAndGreaterThanSignTestCase
[BFA] Found failed test case: DBReportUseMessageContentTestCase
[BFA] Found failed test case: testForwardingWithInMemoryStore
[BFA] Found failed test case: init
[BFA] Found failed test case: testXPathOnDifferentSOAPNS
[BFA] Found failed test case: testFurtherProcessingOfSwitch
[BFA] Found failed test case: testSwitchWithoutDefault
[BFA] Found failed test case: testSample2
[BFA] Found failed test case: testSample2
[BFA] Found failed test case: testSample2
[BFA] Found failed test case: testXPathOnDifferentSOAPNS
[BFA] Found failed test case: init
[BFA] Found failed test case: TestWithoutXpath
[BFA] Found failed test case: setEnvironment
[BFA] Found failed test case: validateMediatorDynamicSchemaChangeTest
[BFA] Found failed test case: init
[BFA] Found failed test case: validateMediatorDynamicSchemaChangeTest
[BFA] Found failed test case: setEnvironment
[BFA] Found failed test case: uploadSynapseConfig
[BFA] Found failed test case: xsltTransformationFromConfigRegistry
[BFA] Found failed test case: xsltTransformationFromGovernanceRegistry
[BFA] Found failed test case: testLocalEntryFastXSLTFileFromLocalFile
[BFA] Found failed test case: uploadSynapseConfig
[BFA] Found failed test case: setEnvironment
[BFA] Found failed test case: setEnvironment
[BFA] Found failed test case: setEnvironment
[BFA] Found failed test case: setEnvironment
[BFA] Found failed test case: setEnvironment
[BFA] Found failed test case: setEnvironment
[BFA] Found failed test case: testSetPropertyWithAxis2ScopeInScript
[BFA] Found failed test case: testSetPropertyWithOperationScopeInScript
[BFA] Found failed test case: testSetPropertyWithTransportScopeInScript
[BFA] Found failed test case: setEnvironment
[BFA] Found failed test case: testSerializingJson
[BFA] Found failed test case: setEnvironment
[BFA] Found failed test case: setEnvironment
[BFA] Found failed test case: testSetPropertyWithAxis2ScopeInScript
[BFA] Found failed test case: testSetPropertyWithOperationScopeInScript
[BFA] Found failed test case: testSetPropertyWithTransportScopeInScript
[BFA] Found failed test case: setEnvironment
[BFA] Found failed test case: setEnvironment
[BFA] Found failed test case: setEnvironment
[BFA] Found failed test case: setEnvironment
[BFA] Found failed test case: testSerializingJson
[BFA] Found failed test case: testJRubyScriptMediation
[BFA] Found failed test case: testJRubyScriptMediationScriptFromGovRegistry
[BFA] Found failed test case: setEnvironment
[BFA] Found failed test case: setEnvironment
[BFA] Found failed test case: testWithEmptyMessage
[BFA] Found failed test case: modifyMessageProcessor
[BFA] Found failed test case: testActivateMessageProcessor
[BFA] Found failed test case: testMessagesInMessageProcessor
[BFA] Found failed test case: testMessagePersistenceAfterRestart
[BFA] Found failed test case: testConfigurationEndPoint
[BFA] Found failed test case: testGovernanceEndPoint
[BFA] Found failed test case: testConfigurationSequence
[BFA] Found failed test case: testGovernersSequence
[BFA] Found failed test case: testHTTPS
[BFA] Found failed test case: testNullNameSpaceForAttachPath
[BFA] Found failed test case: testIterateExpressionLessSequenceAdding
[BFA] Found failed test case: testPropertyRetrievalInFaultSequence
[BFA] Found failed test case: setEnvironment
[BFA] Found failed test case: initServers
[BFA] Found failed test case: uploadSynapseConfig
[BFA] Found failed test case: uploadSynapseConfig
[BFA] Found failed test case: uploadSynapseConfig
[BFA] Found failed test case: uploadSynapseConfig
[BFA] Found failed test case: uploadSynapseConfig
[BFA] Found failed test case: uploadSynapseConfig
[BFA] Found failed test case: testOneToOneJsonToJson
[BFA] Found failed test case: testOneToOneXmlToXml
[BFA] Found failed test case: testOneToOneXmlToXmlNotXSLTCompatible
[BFA] Found failed test case: testOneToOneXmlToXmlUsingXSLT
[BFA] Found failed test case: testXmlWithUnderscoreToXmlWithUnderscore
[BFA] Found failed test case: setEnvironment
[BFA] Found failed test case: setEnvironment
[BFA] Found failed test case: setEnvironment
[BFA] Found failed test case: testAfterRemovingProperties
[BFA] Found failed test case: testMediationWithLoadOfProperties
[BFA] Found failed test case: testVerifyLogs
[BFA] Found failed test case: dynamicSequenceMediaTypeTest
[BFA] Found failed test case: dynamicEndpointTemplateMediaTypeTest
[BFA] Found failed test case: dynamicEndpointMediaTypeTest
[BFA] Found failed test case: dynamicSequenceTemplateMediaTypeTest
[BFA] Found failed test case: init
[BFA] Found failed test case: testResourceRetrievalUsingWsdl2Form
[BFA] Found failed test case: testXmlToJsonNil
[BFA] Found failed test case: testDisablingAutoConversionToScientificNotationInJsonStreamFormatter
[BFA] Found failed test case: testXmlToJsonArray
[BFA] Found failed test case: testXmlToJsonAutoPrimitive
[BFA] Found failed test case: testXmlToJsonBuildValidNCNames
[BFA] Found failed test case: testXmlToJsonPreserveNamespace
[BFA] Found failed test case: testEnablingMediationStatistics
[BFA] Found failed test case: testStartupLogs
[BFA] Found failed test case: init
[BFA] Found failed test case: cleanUp
[BFA] Found failed test case: testFunctionStackDeepClone
[BFA] Found failed test case: initialize
[BFA] Found failed test case: initialize
[BFA] Found failed test case: testAPIHotDeployment
[BFA] Found failed test case: testEndpointHotDeployment
[BFA] Found failed test case: testLocalEntryHotDeployment
[BFA] Found failed test case: testMessageStoreHotDeployment
[BFA] Found failed test case: testProxyServiceHotDeployment
[BFA] Found failed test case: testSequenceHotDeployment
[BFA] Found failed test case: testGetAppenderData
[BFA] Found failed test case: testRestoreDefaults
[BFA] Found failed test case: setEnvironment
[BFA] Found failed test case: cleanup
[BFA] Found failed test case: setEnvironment
[BFA] Found failed test case: testURITemplateExpandWithEscapedPercentEncoding
[BFA] Found failed test case: testURITemplateExpandWithEscapedPercentEncodingPathParam
[BFA] Found failed test case: testURITemplateExpandWithPercentEncoding
[BFA] Found failed test case: testURITemplateExpandWithPercentEncodingPathParamCase
[BFA] Found failed test case: testURITemplateParameterDecodingPlusCharacterCase
[BFA] Found failed test case: testURITemplateParameterDecodingSpaceCharacterCase
[BFA] Found failed test case: testURITemplateParameterDecodingWithPercentEncodingEscapedAtExpansion
[BFA] Found failed test case: testURITemplateSpecialCaseVariableWithFullURL
[BFA] Found failed test case: apiDefinitionRequestTest
[BFA] Found failed test case: jsonDefinitionTest
[BFA] Found failed test case: yamlDefinitionTest
[BFA] Found failed test case: testWSAddressingSupport
[BFA] Found failed test case: testForEmptyStackAfterCloned_With_ContinueParent
[BFA] Found failed test case: setEnvironment
[BFA] Found failed test case: testSOAPHeaderHandling
[BFA] Found failed test case: testHttpStatusCodeGettingSuccessfully
[BFA] Found failed test case: testFetchHTTP_SC_After_Callout_Mediator
[BFA] Found failed test case: deployService
[BFA] Found failed test case: unDeployService
[BFA] Found failed test case: testDistributedCachingHeaderSerialization
[BFA] Found failed test case: testRuleMediatorProxyDeployed
[BFA] Found failed test case: testPassParamsToEndpoint
[BFA] Found failed test case: testCorrectFaultSequenceExecution
[BFA] Found failed test case: setEnvironment
[BFA] Found failed test case: init
[BFA] Found failed test case: unDeployService
[BFA] Found failed test case: testCustomStatusDescription
[BFA] Found failed test case: testHttpAccessLogGeneration
[BFA] Found failed test case: testValidationBasedOnMessageSize
[BFA] Found failed test case: testHOST_HEADERPropertyTest
[BFA] Found failed test case: testInvalidJSONMessage
[BFA] Found failed test case: testInvalidXMLMessage
[BFA] Found failed test case: testRemoveCharsetSetEncodingPropertyTrue
[BFA] Found failed test case: testPollingWithSuspensionLimit
[BFA] Found failed test case: testPollingWithSuspensionLimitAsZero
[BFA] Found failed test case: testCalloutJMSHeaders
[BFA] Found failed test case: init
[BFA] Found failed test case: testCalloutJMSHeaders
[BFA] Found failed test case: test
[BFA] Found failed test case: securePasswordTest
[BFA] Found failed test case: securePasswordTest
[BFA] Found failed test case: uploadCarFileTest
[BFA] Found failed test case: testSequenceDeployed
[BFA] Found failed test case: carReDeploymentTest
[BFA] Found failed test case: carReDeploymentTest
[BFA] Found failed test case: deployeService
[BFA] Found failed test case: deployeService
[BFA] Found failed test case: UndeployeService
[BFA] Found failed test case: testWithWrongCredentials
[BFA] Found failed test case: testWithoutAuthHeaders
[BFA] Found failed test case: init
[BFA] Found failed test case: faviconTest
[BFA] Found failed test case: testMultiplePrefixesToSameNamespace
[BFA] Found failed test case: testxsiNilAttributeInElement
[BFA] Found failed test case: testMultiplePrefixesToSameNamespace
[BFA] Found failed test case: testNestedElementsWithSameName
[BFA] Found failed test case: testRoutingMessagesAndAggregatingResponses
[BFA] Found failed test case: setEnvironment
[BFA] Found failed test case: setEnvironment
[BFA] Found failed test case: setEnvironment
[BFA] Found failed test case: setEnvironment
[BFA] Found failed test case: setEnvironment
[BFA] Found failed test case: setEnvironment
[BFA] Found failed test case: setEnvironment
[BFA] Found failed test case: testEndPoints
[BFA] Found failed test case: testLocalEntries
[BFA] Found failed test case: testSendingToDefinedProxies
[BFA] Found failed test case: testSequences
[BFA] Found failed test case: testTasks
[BFA] Found failed test case: setEnvironment
[BFA] Found failed test case: setEnvironment
[BFA] Found failed test case: setEnvironment
[BFA] Found failed test case: destroy
[BFA] Found failed test case: testPassThroughProxy
[BFA] Found failed test case: testInlineEndpointPriorityWithWSAddressing
[BFA] Found failed test case: testProxyWithAddressing
[BFA] Found failed test case: deployProxyService
[BFA] Found failed test case: modifyProxyService
[BFA] Found failed test case: setEnvironment
[BFA] Found failed test case: testMainSequenceForNonExistingProxy
[BFA] Found failed test case: testNonExistingProxyInvocation
[BFA] Found failed test case: setEnvironment
[BFA] Found failed test case: setEnvironment
[BFA] Found failed test case: testHttpPassThroughProxyWithAddressing
[BFA] Found failed test case: testHttpsPassThroughProxyWithAddressing
[BFA] Found failed test case: testHttpsPassThroughProxyWithEndpoint
[BFA] Found failed test case: testHttpsPassThroughProxyWithSendMediatorInInSequence
[BFA] Found failed test case: editProxyService
[BFA] Found failed test case: setEnvironment
[BFA] Found failed test case: setEnvironment
[BFA] Found failed test case: setEnvironment
[BFA] Found failed test case: setEnvironment
[BFA] Found failed test case: setEnvironment
[BFA] Found failed test case: setEnvironment
[BFA] Found failed test case: testWSDLBasedProxy
[BFA] Found failed test case: setEnvironment
[BFA] Found failed test case: testWSDLBasedProxyDeployment
[BFA] Found failed test case: setEnvironment
[BFA] Found failed test case: setEnvironment
[BFA] Found failed test case: testWSDLBasedProxy
[BFA] Found failed test case: setEnvironment
[BFA] Found failed test case: setEnvironment
[BFA] Found failed test case: testWSDLBasedProxy
[BFA] Found failed test case: setEnvironment
[BFA] Found failed test case: setEnvironment
[BFA] Found failed test case: setEnvironment
[BFA] Found failed test case: testWSDLBasedProxy
[BFA] Found failed test case: setEnvironment
[BFA] Found failed test case: testHttpsSoap11EndpointBinding
[BFA] Found failed test case: setEnvironment
[BFA] Found failed test case: setEnvironment
[BFA] Found failed test case: testWSDLBasedProxy
[BFA] Found failed test case: init
[BFA] Found failed test case: init
[BFA] Found failed test case: init
[BFA] Found failed test case: close
[BFA] Found failed test case: testDynamicDelayedTimeoutEndpoint
[BFA] Found failed test case: testDynamicDelayedTimeoutTemplateEndpoint
[BFA] Found failed test case: init
[BFA] Found failed test case: init
[BFA] Found failed test case: TestFailOver
[BFA] Found failed test case: init
[BFA] Found failed test case: init
[BFA] Found failed test case: init
[BFA] Found failed test case: init
[BFA] Found failed test case: testLoadbalancerWithFailedEndpoints
[BFA] Found failed test case: init
[BFA] Found failed test case: init
[BFA] Found failed test case: init
[BFA] Found failed test case: init
[BFA] Found failed test case: testHttpEndpoint
[BFA] Found failed test case: testSendingToHttpEndpoint
[BFA] Found failed test case: testSendingToInvalidHttpEndpoint
[BFA] Found failed test case: testSequenceAsLocalRegistryEntry
[BFA] Found failed test case: testSourceURLLocalEntryAddition
[BFA] Found failed test case: testSourceURLLocalEntryRemoval
[BFA] Found failed test case: testInlineXMLLocalEntryAddition
[BFA] Found failed test case: testThrottlingPolicyAsALocalEntry
[BFA] Found failed test case: testInlineTextLocalEntryRemoval
[BFA] Found failed test case: testInlineXMLLocalEntryRemoval
[BFA] Found failed test case: testInlineTextLocalEntryAddition
[BFA] Found failed test case: restApiAdminServerContext
[BFA] Found failed test case: testCompleteURLWithHTTPMethod
[BFA] Found failed test case: apiHTTPHeadMethodTest
[BFA] Found failed test case: testRESTURITemplateWithAdditionalParam
[BFA] Found failed test case: testRESTURITemplateWithContextURL
[BFA] Found failed test case: testCreateTemplate
[BFA] Found failed test case: testCreateSequence
[BFA] Found failed test case: testCreateAPI
[BFA] Found failed test case: testGetTemplate
[BFA] Found failed test case: getSequence
[BFA] Found failed test case: testCreateAPIForTenant
[BFA] Found failed test case: testUpdateTemplate
[BFA] Found failed test case: testCreateSequenceForTenant
[BFA] Found failed test case: testGetAPI
[BFA] Found failed test case: testEnableStatisticsTemplate
[BFA] Found failed test case: testListSequenceForTenant
[BFA] Found failed test case: testGetAPIForTenant
[BFA] Found failed test case: testDisableStatisticsTemplate
[BFA] Found failed test case: testSequenceStatisticsEnabler
[BFA] Found failed test case: testUpdateAPIFromString
[BFA] Found failed test case: testEnableTracingTemplate
[BFA] Found failed test case: testSequenceStatisticsDisabler
[BFA] Found failed test case: testUpdateAPIFromAPIData
[BFA] Found failed test case: testDisableTracingTemplate
[BFA] Found failed test case: testSequenceTracingEnabler
[BFA] Found failed test case: testUpdateAPIForTenant
[BFA] Found failed test case: testDeleteTemplate
[BFA] Found failed test case: testSequenceTracingDisabler
[BFA] Found failed test case: testEnableStatisticsForInvalidAPI
[BFA] Found failed test case: testGetInvalidTemplate
[BFA] Found failed test case: deleteSequenceForTenant
[BFA] Found failed test case: testEnableTracingForInvalidAPI
[BFA] Found failed test case: testCreateDynamicTemplate
[BFA] Found failed test case: listNonExistentSequence
[BFA] Found failed test case: testGetDynamicTemplate
[BFA] Found failed test case: testCreateDynamicSequence
[BFA] Found failed test case: testUpdateDynamicTemplate
[BFA] Found failed test case: testListDynamicSequence
[BFA] Found failed test case: testCreateEndpointTemplate
[BFA] Found failed test case: testUpdateDynamicSequence
[BFA] Found failed test case: testListEndpointTemplate
[BFA] Found failed test case: testListInvalidEndpointTemplate
[BFA] Found failed test case: testDeleteDynamicSequence
[BFA] Found failed test case: testDeleteAPI
[BFA] Found failed test case: testUpdateEndpointTemplate
[BFA] Found failed test case: testDeleteAPIForTenant
[BFA] Found failed test case: testAPIUpdateWithEmptyAPIFromListPIName
[BFA] Found failed test case: init
[BFA] Found failed test case: init
[BFA] Found failed test case: init
[BFA] Found failed test case: testReturnResponseCode
[BFA] Found failed test case: uploadCarFileTest
[BFA] Found failed test case: uploadCarFileTest
[BFA] Found failed test case: uploadCarFileTest
[BFA] Found failed test case: restoreServerConfiguration
[BFA] Found failed test case: uploadCarFileTest
[BFA] Found failed test case: uploadCar1Test
[BFA] Found failed test case: injectToProxyTest
[BFA] Found failed test case: taskRedeployWithCappTest
[BFA] Found failed test case: testDeployWithLargeIntervalValue
[BFA] Found failed test case: injectToSequenceTest
[BFA] Found failed test case: testTenantIDInTenantResponsePath
[BFA] Found failed test case: setup
[BFA] Found failed test case: setup
[BFA] Found failed test case: init
[BFA] Found failed test case: testPartialReadErrorWithPayloadMediator
[BFA] Found failed test case: testResponseBodyOfHEADRequest
[BFA] Found failed test case: passthroughTransportHttpProxy
[BFA] Found failed test case: testSetHostHttpHeaderTestCase
[BFA] Found failed test case: testSetHostHttpHeaderWithPortTestCase
[BFA] Found failed test case: testMaximumConnections
[BFA] Found failed test case: testMsgBuilderInvokedPropertyWhenContentTypeisEmpty
[BFA] Found failed test case: stop
[BFA] Found failed test case: init
[BFA] Found failed test case: testMessageProcessorCronForwader
[BFA] Found failed test case: destroy
[BFA] Found failed test case: testJMSMessageStoreAndProcessor
[BFA] Found failed test case: init
[BFA] Found failed test case: init
[BFA] Found failed test case: testMessageInjection
[BFA] Found failed test case: proxyServiceDeploymentTest
[BFA] Found failed test case: init
[BFA] Found failed test case: testJMSMessageStoreAndProcessor
[BFA] Found failed test case: updateMessageStoreBeingUsedTest
[BFA] Found failed test case: testJMSEndpointPox
[BFA] Found failed test case: testJMSEndpointSoap11
[BFA] Found failed test case: testJMSEndpointSoap12
[BFA] Found failed test case: deployeService
[BFA] Found failed test case: testJMSProxy
[BFA] Found failed test case: staleConnectionsTestJMSProxy
[BFA] Found failed test case: testAddingOMElementPropertyToMessageStore
[BFA] Found failed test case: testJMSProxy
[BFA] Found failed test case: setEnvironment
[BFA] Found failed test case: setEnvironment
[BFA] Found failed test case: setEnvironment
[BFA] Found failed test case: testVFSListenerHidePasswordInLog
[BFA] Found failed test case: testVFSSenderHidePasswordInLog
[BFA] Found failed test case: TestCreateFileInDirectoryUnderRoot
[BFA] Found failed test case: TestCreateFileInRoot
[BFA] Found failed test case: testVFSFileURI
[BFA] Found failed test case: tcpTransportSplitByCharacterProxy
[BFA] Found failed test case: tcpTransportSplitBySpecialCharacterProxy
[BFA] Found failed test case: tcpTransportSplitByStringProxy
[BFA] Found failed test case: tcpTransportProxy
[BFA] Found failed test case: testLocalTransportScenario
[BFA] Found failed test case: destroy
[BFA] Found failed test case: init
[BFA] Found failed test case: testEmailTransportActionAfterFailureDELETE
[BFA] Found failed test case: testEmailTransportInvalidAddress
[BFA] Found failed test case: testEmailTransportFolder
[BFA] Found failed test case: testEmailRemoveHeaderTransport
[BFA] Found failed test case: testEmailPreserveHeaderTransport
[BFA] Found failed test case: testEmailTransportInvalidFolder
[BFA] Found failed test case: testEmailTransportActionAfterFailureMOVE
[BFA] Found failed test case: testEmailTransportActionAfterProcessMove
[BFA] Found failed test case: testEmailTransportActionAfterProcessDelete
[BFA] Found failed test case: testEmailTransport
[BFA] Found failed test case: testEmailTransport
[BFA] Found failed test case: testEmailTransport
[BFA] Found failed test case: setEnvironment
[BFA] Found failed test case: setEnvironment
[BFA] Found failed test case: testMutualSSLClientCertificate
[BFA] Found failed test case: webSocketInboundTest
[BFA] Found failed test case: testMessageMediationAfterEnablingNhttp
[BFA] Found failed test case: testSetHostHttpHeaderTestCase
[BFA] Found failed test case: testSetHostHttpHeaderWithPortTestCase
[BFA] Found failed test case: testMaximumConnections
[BFA] Found failed test case: init
[BFA] Found failed test case: accessMIMEMessages
Not sending mail to unregistered user [email protected]
Sending e-mails to: [email protected]
Finished: UNSTABLE