Started 1 yr 4 mo ago
Took 1 hr 43 min on ECS_PRODUCTION-8ab952dc2bb678

Aborted Build #537 (Apr 10, 2021 5:22:11 PM)

Build Artifacts
wso2mi-4.0.0-SNAPSHOT.zip153.94 MB view
No changes. Changes in dependency
  1. MI test Module-mediator-1  ? → (detail)
  2. WSO2 MI - Samples  ? → (detail)
  3. WSO2 Enterprise Integrator - Mediation Integration Tests  ? → (detail)
  4. MI test Module-Service  ? → (detail)
  5. MI test Module-Transport  ? → (detail)
  6. WSO2 Micro Integrator - Automation Extensions  ? → (detail)
  7. WSO2 Micro Integrator - Integration Tests  ? → (detail)
  8. WSO2 Micro Integrator - Core Component  ? → (detail)
  9. MI Integration Test Common Utils  ? → (detail)
  10. MI Test Service Module  ? → (detail)
  11. MI Test Common Module  ? → (detail)
  12. WSO2 Micro Integrator - Analytics Data Publisher Util  ? → (detail)
  13. MI Integration Test Admin Clients  ? → (detail)

Started by user Srivathsan Shanmuganathan

Revision: 65dd7c1a4a9c38a3ec8becb4a88baf057a583ec6
  • refs/remotes/origin/test-master
Test Result (23 failures / -602)Show all failed tests >>>

Aborted by user Srivathsan Shanmuganathan

Identified problems

testCollectorTypeMediator

java.lang.NullPointerException at org.wso2.esb.integration.common.utils.clients.stockquoteclient.StockQuoteClient.buildResponse(StockQuoteClient.java:57) at org.wso2.esb.integration.common.utils.clients.stockquoteclient.StockQuoteClient.sendSimpleStockQuoteRequest(StockQuoteClient.java:80) at org.wso2.carbon.esb.mediator.test.cache.CollectorTypeTestCase.testCollectorTypeMediator(CollectorTypeTestCase.java:53)

conditionalRouterMediatorWithBreakRouteTrueTest

java.lang.NullPointerException at org.wso2.esb.integration.common.utils.clients.stockquoteclient.StockQuoteClient.buildResponse(StockQuoteClient.java:57) at org.wso2.esb.integration.common.utils.clients.stockquoteclient.StockQuoteClient.sendSimpleStockQuoteRequest(StockQuoteClient.java:80) at org.wso2.carbon.esb.mediator.test.conditionalRouter.ConditionalRouterIntegrationTest.conditionalRouterMediatorWithBreakRouteTrueTest(ConditionalRouterIntegrationTest.java:163)

conditionalRouterMediatorWithContinueAfterFalseTest

java.lang.NullPointerException at org.wso2.esb.integration.common.utils.clients.stockquoteclient.StockQuoteClient.buildResponse(StockQuoteClient.java:57) at org.wso2.esb.integration.common.utils.clients.stockquoteclient.StockQuoteClient.sendSimpleStockQuoteRequest(StockQuoteClient.java:80) at org.wso2.carbon.esb.mediator.test.conditionalRouter.ConditionalRouterIntegrationTest.conditionalRouterMediatorWithContinueAfterFalseTest(ConditionalRouterIntegrationTest.java:92)

testDropMediator

java.lang.NullPointerException at org.wso2.esb.integration.common.utils.clients.stockquoteclient.StockQuoteClient.buildResponse(StockQuoteClient.java:57) at org.wso2.esb.integration.common.utils.clients.stockquoteclient.StockQuoteClient.sendSimpleStockQuoteRequest(StockQuoteClient.java:80) at org.wso2.carbon.esb.mediator.test.drop.DropIntegrationTest.testDropMediator(DropIntegrationTest.java:60)

testInvalidXpath

java.lang.AssertionError: expected [true] but found [false] at org.testng.Assert.fail(Assert.java:93) at org.testng.Assert.failNotEquals(Assert.java:512) at org.testng.Assert.assertTrue(Assert.java:41) at org.testng.Assert.assertTrue(Assert.java:51) at org.wso2.carbon.esb.mediator.test.property.PropertyIntegrationTestCase.testInvalidXpath(PropertyIntegrationTestCase.java:215)

invokeServiceFromXmlRequest

org.apache.axis2.AxisFault: peer not authenticated at org.apache.axis2.AxisFault.makeFault(AxisFault.java:430) at org.apache.axis2.transport.http.HTTPSender.sendViaPost(HTTPSender.java:227) at org.apache.axis2.transport.http.HTTPSender.send(HTTPSender.java:82) at org.apache.axis2.transport.http.CommonsHTTPTransportSender.writeMessageWithCommons(CommonsHTTPTransportSender.java:459) at org.apache.axis2.transport.http.CommonsHTTPTransportSender.invoke(CommonsHTTPTransportSender.java:286) at org.apache.axis2.engine.AxisEngine.send(AxisEngine.java:442) at org.apache.axis2.description.OutInAxisOperationClient.send(OutInAxisOperation.java:446) at org.apache.axis2.description.OutInAxisOperationClient.executeImpl(OutInAxisOperation.java:232) at org.apache.axis2.client.OperationClient.execute(OperationClient.java:149) at org.apache.axis2.client.ServiceClient.sendRobust(ServiceClient.java:474) at org.apache.axis2.client.ServiceClient.sendRobust(ServiceClient.java:455) at org.wso2.carbon.esb.mediator.test.payload.factory.PayloadFormatValueAndExpressionTestCase.invokeServiceFromXmlRequest(PayloadFormatValueAndExpressionTestCase.java:58) Caused by: javax.net.ssl.SSLPeerUnverifiedException: peer not authenticated at java.base/sun.security.ssl.SSLSessionImpl.getPeerCertificates(SSLSessionImpl.java:558) at org.apache.commons.httpclient.protocol.SSLProtocolSocketFactory.verifyHostName(SSLProtocolSocketFactory.java:276) at org.apache.commons.httpclient.protocol.SSLProtocolSocketFactory.createSocket(SSLProtocolSocketFactory.java:186) at org.apache.commons.httpclient.HttpConnection.open(HttpConnection.java:707) at org.apache.commons.httpclient.MultiThreadedHttpConnectionManager$HttpConnectionAdapter.open(MultiThreadedHttpConnectionManager.java:1361) at org.apache.commons.httpclient.HttpMethodDirector.executeWithRetry(HttpMethodDirector.java:387) at org.apache.commons.httpclient.HttpMethodDirector.executeMethod(HttpMethodDirector.java:171) at org.apache.commons.httpclient.HttpClient.executeMethod(HttpClient.java:397) at org.apache.axis2.transport.http.AbstractHTTPSender.executeMethod(AbstractHTTPSender.java:717) at org.apache.axis2.transport.http.HTTPSender.sendViaPost(HTTPSender.java:223) ... 44 more

checkOnCompleteExecutionInClone

org.apache.axis2.AxisFault: peer not authenticated at org.apache.axis2.AxisFault.makeFault(AxisFault.java:430) at org.apache.axis2.transport.http.HTTPSender.sendViaPost(HTTPSender.java:227) at org.apache.axis2.transport.http.HTTPSender.send(HTTPSender.java:82) at org.apache.axis2.transport.http.CommonsHTTPTransportSender.writeMessageWithCommons(CommonsHTTPTransportSender.java:459) at org.apache.axis2.transport.http.CommonsHTTPTransportSender.invoke(CommonsHTTPTransportSender.java:286) at org.apache.axis2.engine.AxisEngine.send(AxisEngine.java:442) at org.apache.axis2.description.OutInAxisOperationClient.send(OutInAxisOperation.java:446) at org.apache.axis2.description.OutInAxisOperationClient.executeImpl(OutInAxisOperation.java:232) at org.apache.axis2.client.OperationClient.execute(OperationClient.java:149) at org.apache.axis2.client.ServiceClient.sendReceive(ServiceClient.java:554) at org.apache.axis2.client.ServiceClient.sendReceive(ServiceClient.java:530) at org.wso2.esb.integration.common.utils.clients.stockquoteclient.StockQuoteClient.send(StockQuoteClient.java:172) at org.wso2.carbon.esb.mediator.test.aggregate.ESBJAVA4792AggregateTimeoutTestCase.checkOnCompleteExecutionInClone(ESBJAVA4792AggregateTimeoutTestCase.java:75) Caused by: javax.net.ssl.SSLPeerUnverifiedException: peer not authenticated at java.base/sun.security.ssl.SSLSessionImpl.getPeerCertificates(SSLSessionImpl.java:558) at org.apache.commons.httpclient.protocol.SSLProtocolSocketFactory.verifyHostName(SSLProtocolSocketFactory.java:276) at org.apache.commons.httpclient.protocol.SSLProtocolSocketFactory.createSocket(SSLProtocolSocketFactory.java:186) at org.apache.commons.httpclient.HttpConnection.open(HttpConnection.java:707) at org.apache.commons.httpclient.MultiThreadedHttpConnectionManager$HttpConnectionAdapter.open(MultiThreadedHttpConnectionManager.java:1361) at org.apache.commons.httpclient.HttpMethodDirector.executeWithRetry(HttpMethodDirector.java:387) at org.apache.commons.httpclient.HttpMethodDirector.executeMethod(HttpMethodDirector.java:171) at org.apache.commons.httpclient.HttpClient.executeMethod(HttpClient.java:397) at org.apache.axis2.transport.http.AbstractHTTPSender.executeMethod(AbstractHTTPSender.java:717) at org.apache.axis2.transport.http.HTTPSender.sendViaPost(HTTPSender.java:223) ... 45 more

testEnrichMediator

java.lang.NullPointerException at org.wso2.esb.integration.common.utils.clients.stockquoteclient.StockQuoteClient.buildResponse(StockQuoteClient.java:57) at org.wso2.esb.integration.common.utils.clients.stockquoteclient.StockQuoteClient.sendSimpleStockQuoteRequest(StockQuoteClient.java:80) at org.wso2.carbon.esb.mediator.test.sequence.SequenceIntegrationNonExistingSequenceNegativeTestCase.testEnrichMediator(SequenceIntegrationNonExistingSequenceNegativeTestCase.java:42)

testSample2

java.lang.NullPointerException at org.wso2.esb.integration.common.utils.clients.stockquoteclient.StockQuoteClient.buildResponse(StockQuoteClient.java:57) at org.wso2.esb.integration.common.utils.clients.stockquoteclient.StockQuoteClient.sendSimpleStockQuoteRequest(StockQuoteClient.java:80) at org.wso2.carbon.esb.mediator.test.switchMediator.InvalidPrefixTestCase.testSample2(InvalidPrefixTestCase.java:39)

testMatchSubSequenceAtRegexSwitchMediator2

java.lang.NullPointerException at org.wso2.esb.integration.common.utils.clients.stockquoteclient.StockQuoteClient.buildResponse(StockQuoteClient.java:57) at org.wso2.esb.integration.common.utils.clients.stockquoteclient.StockQuoteClient.sendSimpleStockQuoteRequest(StockQuoteClient.java:80) at org.wso2.carbon.esb.mediator.test.switchMediator.SwitchIntegrationSubsequenceMatchingTestCase.testMatchSubSequenceAtRegexSwitchMediator2(SwitchIntegrationSubsequenceMatchingTestCase.java:62)

testMatchSubSequenceAtRegexSwitchMediator3

java.lang.NullPointerException at org.wso2.esb.integration.common.utils.clients.stockquoteclient.StockQuoteClient.buildResponse(StockQuoteClient.java:57) at org.wso2.esb.integration.common.utils.clients.stockquoteclient.StockQuoteClient.sendSimpleStockQuoteRequest(StockQuoteClient.java:80) at org.wso2.carbon.esb.mediator.test.switchMediator.SwitchIntegrationSubsequenceMatchingTestCase.testMatchSubSequenceAtRegexSwitchMediator3(SwitchIntegrationSubsequenceMatchingTestCase.java:76)

testSwitchWithoutDefault

java.lang.NullPointerException at org.wso2.esb.integration.common.utils.clients.stockquoteclient.StockQuoteClient.buildResponse(StockQuoteClient.java:57) at org.wso2.esb.integration.common.utils.clients.stockquoteclient.StockQuoteClient.sendSimpleStockQuoteRequest(StockQuoteClient.java:80) at org.wso2.carbon.esb.mediator.test.switchMediator.WithoutDefaultCase.testSwitchWithoutDefault(WithoutDefaultCase.java:56)

testXPathOnDifferentSOAPNS

java.lang.NullPointerException at org.wso2.esb.integration.common.utils.clients.stockquoteclient.StockQuoteClient.buildResponse(StockQuoteClient.java:57) at org.wso2.esb.integration.common.utils.clients.stockquoteclient.StockQuoteClient.sendSimpleStockQuoteSoap12(StockQuoteClient.java:132) at org.wso2.carbon.esb.mediator.test.switchMediator.SOAPNSBasedSwitchingNegativeCase.testXPathOnDifferentSOAPNS(SOAPNSBasedSwitchingNegativeCase.java:53)

testRespondMediator

java.lang.NullPointerException at org.wso2.esb.integration.common.utils.clients.stockquoteclient.StockQuoteClient.buildResponse(StockQuoteClient.java:57) at org.wso2.esb.integration.common.utils.clients.stockquoteclient.StockQuoteClient.sendSimpleStockQuoteRequest(StockQuoteClient.java:80) at org.wso2.carbon.esb.mediator.test.respond.RespondIntegrationTest.testRespondMediator(RespondIntegrationTest.java:70)

testInvokeNonExistingFunc

java.lang.NullPointerException at org.wso2.esb.integration.common.utils.clients.stockquoteclient.StockQuoteClient.buildResponse(StockQuoteClient.java:57) at org.wso2.esb.integration.common.utils.clients.stockquoteclient.StockQuoteClient.sendCustomQuoteRequest(StockQuoteClient.java:162) at org.wso2.carbon.esb.mediator.test.script.InvokingInvalidFunctionInNashornJsTestCase.testInvokeNonExistingFunc(InvokingInvalidFunctionInNashornJsTestCase.java:38)

testInvokeNonExistingFunc

java.lang.NullPointerException at org.wso2.esb.integration.common.utils.clients.stockquoteclient.StockQuoteClient.buildResponse(StockQuoteClient.java:57) at org.wso2.esb.integration.common.utils.clients.stockquoteclient.StockQuoteClient.sendCustomQuoteRequest(StockQuoteClient.java:162) at org.wso2.carbon.esb.mediator.test.script.InvalidFunctionTestCase.testInvokeNonExistingFunc(InvalidFunctionTestCase.java:35)

testNullNameSpaceForIterateExpression

java.lang.NullPointerException at org.wso2.esb.integration.common.utils.clients.stockquoteclient.StockQuoteClient.buildResponse(StockQuoteClient.java:57) at org.wso2.esb.integration.common.utils.clients.stockquoteclient.StockQuoteClient.sendMultipleQuoteRequest(StockQuoteClient.java:222) at org.wso2.carbon.esb.mediator.test.iterate.NullNameSpaceForIterateExpressionTestCase.testNullNameSpaceForIterateExpression(NullNameSpaceForIterateExpressionTestCase.java:58)

testInvalidXPath

java.lang.NullPointerException at org.wso2.esb.integration.common.utils.clients.stockquoteclient.StockQuoteClient.buildResponse(StockQuoteClient.java:57) at org.wso2.esb.integration.common.utils.clients.stockquoteclient.StockQuoteClient.sendMultipleQuoteRequest(StockQuoteClient.java:222) at org.wso2.carbon.esb.mediator.test.iterate.InvalidXPathTestCase.testInvalidXPath(InvalidXPathTestCase.java:56)

testTransformerProxy

java.lang.NullPointerException at org.wso2.esb.integration.common.utils.clients.stockquoteclient.StockQuoteClient.buildResponse(StockQuoteClient.java:57) at org.wso2.esb.integration.common.utils.clients.stockquoteclient.StockQuoteClient.sendCustomQuoteRequest(StockQuoteClient.java:162) at org.wso2.carbon.esb.proxyservice.test.transformerProxy.InvalidXSLTTestCase.testTransformerProxy(InvalidXSLTTestCase.java:36)

testSendingToDefaultEndpointWithSuspension

java.lang.AssertionError: expected [true] but found [false] at org.testng.Assert.fail(Assert.java:93) at org.testng.Assert.failNotEquals(Assert.java:512) at org.testng.Assert.assertTrue(Assert.java:41) at org.testng.Assert.assertTrue(Assert.java:51) at org.wso2.carbon.esb.endpoint.test.DefaultEndpointTestCase.testSendingToDefaultEndpointWithSuspension(DefaultEndpointTestCase.java:108)

testVFSFileURI

java.lang.NullPointerException at org.wso2.esb.integration.common.utils.clients.stockquoteclient.StockQuoteClient.buildResponse(StockQuoteClient.java:57) at org.wso2.esb.integration.common.utils.clients.stockquoteclient.StockQuoteClient.sendSimpleStockQuoteRequest(StockQuoteClient.java:80) at org.wso2.carbon.esb.vfs.transport.test.VFSQueryParameterAppendESBJAVA2373TestCase.testVFSFileURI(VFSQueryParameterAppendESBJAVA2373TestCase.java:68)

testSecureProxyEndPointThruUri

org.apache.axis2.AxisFault: peer not authenticated at org.apache.axis2.AxisFault.makeFault(AxisFault.java:430) at org.apache.axis2.transport.http.HTTPSender.sendViaPost(HTTPSender.java:227) at org.apache.axis2.transport.http.HTTPSender.send(HTTPSender.java:82) at org.apache.axis2.transport.http.CommonsHTTPTransportSender.writeMessageWithCommons(CommonsHTTPTransportSender.java:459) at org.apache.axis2.transport.http.CommonsHTTPTransportSender.invoke(CommonsHTTPTransportSender.java:286) at org.apache.axis2.engine.AxisEngine.send(AxisEngine.java:442) at org.apache.axis2.description.OutInAxisOperationClient.send(OutInAxisOperation.java:446) at org.apache.axis2.description.OutInAxisOperationClient.executeImpl(OutInAxisOperation.java:232) at org.apache.axis2.client.OperationClient.execute(OperationClient.java:149) at org.apache.axis2.client.ServiceClient.sendReceive(ServiceClient.java:554) at org.apache.axis2.client.ServiceClient.sendReceive(ServiceClient.java:530) at org.wso2.esb.integration.common.utils.clients.axis2client.SecureAxisServiceClient.sendReceive(SecureAxisServiceClient.java:137) at org.wso2.esb.integration.common.utils.clients.SecureServiceClient.sendSecuredStockQuoteRequest(SecureServiceClient.java:105) at org.wso2.carbon.esb.https.inbound.transport.test.HttpsInboundTransportTestCase.testSecureProxyEndPointThruUri(HttpsInboundTransportTestCase.java:55) Caused by: javax.net.ssl.SSLPeerUnverifiedException: peer not authenticated at java.base/sun.security.ssl.SSLSessionImpl.getPeerCertificates(SSLSessionImpl.java:558) at org.apache.commons.httpclient.protocol.SSLProtocolSocketFactory.verifyHostName(SSLProtocolSocketFactory.java:276) at org.apache.commons.httpclient.protocol.SSLProtocolSocketFactory.createSocket(SSLProtocolSocketFactory.java:175) at org.apache.commons.httpclient.HttpConnection.open(HttpConnection.java:707) at org.apache.commons.httpclient.MultiThreadedHttpConnectionManager$HttpConnectionAdapter.open(MultiThreadedHttpConnectionManager.java:1361) at org.apache.commons.httpclient.HttpMethodDirector.executeWithRetry(HttpMethodDirector.java:387) at org.apache.commons.httpclient.HttpMethodDirector.executeMethod(HttpMethodDirector.java:171) at org.apache.commons.httpclient.HttpClient.executeMethod(HttpClient.java:397) at org.apache.axis2.transport.http.AbstractHTTPSender.executeMethod(AbstractHTTPSender.java:717) at org.apache.axis2.transport.http.HTTPSender.sendViaPost(HTTPSender.java:223) ... 46 more

settingOperationContextWithInboundTest

java.lang.AssertionError: Seq deployment failed. expected [true] but found [false] at org.testng.Assert.fail(Assert.java:93) at org.testng.Assert.failNotEquals(Assert.java:512) at org.testng.Assert.assertTrue(Assert.java:41) at org.wso2.carbon.esb.jms.inbound.transport.test.ESBJAVA5094SetOperationContextWithInboundEndpointTestCase.settingOperationContextWithInboundTest(ESBJAVA5094SetOperationContextWithInboundEndpointTestCase.java:123)

Environment Variables(71)27 different
Slave Information(87)10 different
Project Information(14)1 different

Module Builds

Success MI Integration Test Admin Clients5.9 sec
Success WSO2 Micro Integrator - Automation Extensions14 sec
 builtin-mediators (didn’t run)
 MI Integration Test - CLI Tests (didn’t run)
 crypto-service (didn’t run)
 data (didn’t run)
 data-features (didn’t run)
 data-publisher-features (didn’t run)
 data-publishers (didn’t run)
 data-services (didn’t run)
 data-services-feature (didn’t run)
Not built DataServices Clients0.16 sec
Not built MI Data Service Tests0.19 sec
Not built WSO2 DataServices Integration Test0.1 sec
Not built Mi DSS Integration Test Common64 ms
Not built DS Samples Parent0.33 sec
 event-sink (didn’t run)
 extensions (didn’t run)
 inbound-endpoint (didn’t run)
 WSO2 Carbon - Inbound Endpoint Module (didn’t run)
Success MI Test Common Module33 sec
Success MI Integration Test Common Utils11 sec
 mediation (didn’t run)
 mediation-features (didn’t run)
Success WSO2 Enterprise Integrator - Mediation Integration Tests0.52 sec
 mediators (didn’t run)
 WSO2 Enterprise Integrator - Component Parent (didn’t run)
Not built MI DSS Samples Parent0.1 sec
 WSO2 Micro Integrator - Feature Aggregator Module (didn’t run)
Success WSO2 Micro Integrator - Integration Tests4.7 sec
 WSO2 Enterprise Integrator - micro-integrator P2 Profile Generation (didn’t run)
 MI Monitoring Dashboard - Component Parent (didn’t run)
 MI Monitoring Dashboard - Distribution (didn’t run)
 MI Monitoring Dashboard - Feature Aggregator Module (didn’t run)
 MI Monitoring Dashboard - Parent (didn’t run)
Not built MI Integration Test Reporting75 ms
Unstable MI test Module-mediator-113 min
Unstable MI test Module-mediator-216 min
Not built MI test Module-Other0.17 sec
Aborted Mi test Module - Test Patches68 ms
Not built MI Test Module - Platform0.29 sec
Not built MI test Module - Platform - RabbitMQ Transport2.5 sec
 MI test Module - Platform - with WSO2MB (didn’t run)
Not built MI test Module - Sample0.38 sec
Unstable MI test Module-Service7 min 6 sec
Unstable MI test Module-Transport38 min
 WSO2 Carbon - Cache mediator (didn’t run)
 WSO2 Micro Integrator - Core Component (didn’t run)
 WSO2 Micro Integrator - Extensions (didn’t run)
 org.wso2.carbon.micro.integrator.management.apis (didn’t run)
 org.wso2.carbon.micro.integrator.security (didn’t run)
 WSO2 Micro Integrator - Server Component (didn’t run)
 WSO2 Micro Integrator - Core Server Feature (didn’t run)
Not built MI DSS Admin Clients2.5 sec
Not built MI DSS Test Utils0.3 sec
Not built MI DSS Tests0.57 sec
Success WSO2 MI - Samples22 sec
 WSO2 Micro Integrator - Analytics Data Publisher Util (didn’t run)
 WSO2 Micro Integrator Analytics - Message Flow Data Publisher (didn’t run)
 org.wso2.micro.integrator.analytics.messageflow.data.publisher.feature (didn’t run)
 org.wso2.micro.integrator.bootstrap (didn’t run)
Not built MI test Module-Coordination10 ms
 org.wso2.micro.integrator.coordination (didn’t run)
 WSO2 Micro Integrator - Core Component (didn’t run)
 org.wso2.micro.integrator.crypto.feature (didn’t run)
 org.wso2.micro.integrator.crypto.impl (didn’t run)
 org.wso2.micro.integrator.crypto.provider (didn’t run)
 MI Monitoring Dashboard - Web Component (didn’t run)
 MI Monitoring Dashboard - Feature (didn’t run)
 WSO2 Carbon - Data service C-app Deployer implementation (didn’t run)
 WSO2 Carbon - Data Services Common (didn’t run)
 WSO2 Carbon - Data Services Core (didn’t run)
 WSO2 Carbon - Data Services OData (didn’t run)
 WSO2 Carbon - OData Services Endpoint (didn’t run)
 WSO2 Carbon - All Mediators Server Feature (didn’t run)
 WSO2 Carbon - Data Services SQL Driver (didn’t run)
 org.wso2.micro.integrator.event.sink (didn’t run)
 WSO2 Micro Integrator - Extensions (didn’t run)
 WSO2 Micro Integrator - Identity Entitlement Mediator (didn’t run)
 WSO2 Micro Integrator - XACML Mediation Feature (didn’t run)
 org.wso2.micro.integrator.inbound.endpoint (didn’t run)
 org.wso2.micro.integrator.inbound.endpoint.osgi (didn’t run)
 org.wso2.micro.integrator.inbound.endpoint.persistence (didn’t run)
 WSO2 Carbon - Inbound Endpoint Server Feature (didn’t run)
 WSO2 Micro Integrator - Mediation Initializer (didn’t run)
 WSO2 Micro Integrator - Initializer Server Feature (didn’t run)
 org.wso2.micro.integrator.management.apis (didn’t run)
 WSO2 Carbon - ntask Integration core (didn’t run)
 WSO2 Micro Integrator - Mediation NTask Feature (didn’t run)
 WSO2 Carbon - Synapse Security (didn’t run)
 WSO2 Micro Integrator Mediation StartUp (didn’t run)
 WSO2 Carbon - Identity OAuth Mediator (didn’t run)
 WSO2 MI - Publish Event mediator (didn’t run)
 WSO2 MI - Event-Sink Management Server Feature (didn’t run)
 WSO2 Carbon - All Mediators Server Feature (didn’t run)
 WSO2 Carbon - Data source C-app Deployer implementation (didn’t run)
 WSO2 Carbon - New Data Sources Common (didn’t run)
 WSO2 Carbon - New Data Sources Core (didn’t run)
 WSO2 Carbon - New Data Sources RDBMS (didn’t run)
 WSO2 Carbon - Tasks Core (didn’t run)
 WSO2 Carbon - Tasks Core Feature (didn’t run)
 org.wso2.micro.integrator.probes (didn’t run)
 WSO2 Micro Integrator - Prometheus data publisher (didn’t run)
 WSO2 Micro Integrator - Prometheus Publisher Feature (didn’t run)
 WSO2 Micro Integrator - Registry (didn’t run)
 org.wso2.micro.integrator.security (didn’t run)
 org.wso2.micro.integrator.security.handlers (didn’t run)
 WSO2 Micro Integrator Security Feature (didn’t run)
 WSO2 Micro Integrator - Server Component (didn’t run)
 WSO2 Micro Integrator - Core Server Feature (didn’t run)
 WSO2 Carbon - Task BE (didn’t run)
 WSO2 Carbon - Scheduled Tasks Core Feature (didn’t run)
Not built MI test Module-Transaction2 ms
 WSO2 Micro Integrator - Transport Handlers (didn’t run)
Not built MI test Module - UserStore11 ms
 org.wso2.micro.integrator.websocket.feature (didn’t run)
 WSO2 Micro Integrator - WebsocketTransport (didn’t run)
 publishEvent-feature (didn’t run)
 registry (didn’t run)
 scheduled-tasks (didn’t run)
 security (didn’t run)
 security-features (didn’t run)
Success MI Test Service Module1.6 sec
 startup (didn’t run)
 tasks (didn’t run)
 transport-features (didn’t run)
 transports (didn’t run)
 utsecurity (didn’t run)
 WSO2 Micro Integrator (didn’t run)
 WSO2 Micro Integrator - Distribution (didn’t run)