FailedConsole Output

Skipping 470 KB.. Full Log
ax.websocket-all-1.1.pom
Downloading: https://maven.wso2.org/nexus/content/groups/wso2-public/javax/websocket/javax.websocket-all/1.1/javax.websocket-all-1.1.pom
Downloaded: https://maven.wso2.org/nexus/content/groups/wso2-public/javax/websocket/javax.websocket-all/1.1/javax.websocket-all-1.1.pom (10 KB at 172.6 KB/sec)
Downloading: https://maven.wso2.org/nexus/content/repositories/releases/javax/ws/rs/javax.ws.rs-api/2.0/javax.ws.rs-api-2.0.pom
Downloading: https://maven.wso2.org/nexus/content/groups/wso2-public/javax/ws/rs/javax.ws.rs-api/2.0/javax.ws.rs-api-2.0.pom
Downloaded: https://maven.wso2.org/nexus/content/groups/wso2-public/javax/ws/rs/javax.ws.rs-api/2.0/javax.ws.rs-api-2.0.pom (20 KB at 373.6 KB/sec)
Downloading: https://maven.wso2.org/nexus/content/repositories/releases/net/java/jvnet-parent/1/jvnet-parent-1.pom
Downloading: https://maven.wso2.org/nexus/content/groups/wso2-public/net/java/jvnet-parent/1/jvnet-parent-1.pom
Downloaded: https://maven.wso2.org/nexus/content/groups/wso2-public/net/java/jvnet-parent/1/jvnet-parent-1.pom (5 KB at 88.5 KB/sec)
Downloading: https://maven.wso2.org/nexus/content/repositories/releases/org/wso2/msf4j/jaxrs-delegates/2.6.1/jaxrs-delegates-2.6.1.pom
Downloaded: https://maven.wso2.org/nexus/content/repositories/releases/org/wso2/msf4j/jaxrs-delegates/2.6.1/jaxrs-delegates-2.6.1.pom (10 KB at 317.6 KB/sec)
Downloading: https://maven.wso2.org/nexus/content/repositories/releases/org/apache/httpcomponents/httpclient/4.5.2/httpclient-4.5.2.pom
Downloading: https://maven.wso2.org/nexus/content/groups/wso2-public/org/apache/httpcomponents/httpclient/4.5.2/httpclient-4.5.2.pom
Downloaded: https://maven.wso2.org/nexus/content/groups/wso2-public/org/apache/httpcomponents/httpclient/4.5.2/httpclient-4.5.2.pom (7 KB at 120.1 KB/sec)
Downloading: https://maven.wso2.org/nexus/content/repositories/releases/org/apache/httpcomponents/httpcomponents-client/4.5.2/httpcomponents-client-4.5.2.pom
Downloading: https://maven.wso2.org/nexus/content/groups/wso2-public/org/apache/httpcomponents/httpcomponents-client/4.5.2/httpcomponents-client-4.5.2.pom
Downloaded: https://maven.wso2.org/nexus/content/groups/wso2-public/org/apache/httpcomponents/httpcomponents-client/4.5.2/httpcomponents-client-4.5.2.pom (16 KB at 278.2 KB/sec)
Downloading: https://maven.wso2.org/nexus/content/repositories/releases/org/apache/httpcomponents/httpcore/4.4.4/httpcore-4.4.4.pom
Downloading: https://maven.wso2.org/nexus/content/groups/wso2-public/org/apache/httpcomponents/httpcore/4.4.4/httpcore-4.4.4.pom
Downloaded: https://maven.wso2.org/nexus/content/groups/wso2-public/org/apache/httpcomponents/httpcore/4.4.4/httpcore-4.4.4.pom (6 KB at 98.0 KB/sec)
Downloading: https://maven.wso2.org/nexus/content/repositories/releases/org/apache/httpcomponents/httpcomponents-core/4.4.4/httpcomponents-core-4.4.4.pom
Downloading: https://maven.wso2.org/nexus/content/groups/wso2-public/org/apache/httpcomponents/httpcomponents-core/4.4.4/httpcomponents-core-4.4.4.pom
Downloaded: https://maven.wso2.org/nexus/content/groups/wso2-public/org/apache/httpcomponents/httpcomponents-core/4.4.4/httpcomponents-core-4.4.4.pom (13 KB at 237.6 KB/sec)
Downloading: https://maven.wso2.org/nexus/content/repositories/releases/commons-codec/commons-codec/1.9/commons-codec-1.9.pom
Downloading: https://maven.wso2.org/nexus/content/groups/wso2-public/commons-codec/commons-codec/1.9/commons-codec-1.9.pom
Downloaded: https://maven.wso2.org/nexus/content/groups/wso2-public/commons-codec/commons-codec/1.9/commons-codec-1.9.pom (12 KB at 221.0 KB/sec)
Downloading: https://maven.wso2.org/nexus/content/repositories/releases/org/apache/commons/commons-parent/32/commons-parent-32.pom
Downloading: https://maven.wso2.org/nexus/content/groups/wso2-public/org/apache/commons/commons-parent/32/commons-parent-32.pom
Downloaded: https://maven.wso2.org/nexus/content/groups/wso2-public/org/apache/commons/commons-parent/32/commons-parent-32.pom (52 KB at 920.5 KB/sec)
Downloading: https://maven.wso2.org/nexus/content/repositories/releases/com/nimbusds/nimbus-jose-jwt/2.25/nimbus-jose-jwt-2.25.pom
Downloading: https://maven.wso2.org/nexus/content/groups/wso2-public/com/nimbusds/nimbus-jose-jwt/2.25/nimbus-jose-jwt-2.25.pom
Downloaded: https://maven.wso2.org/nexus/content/groups/wso2-public/com/nimbusds/nimbus-jose-jwt/2.25/nimbus-jose-jwt-2.25.pom (9 KB at 160.2 KB/sec)
Downloading: https://maven.wso2.org/nexus/content/repositories/releases/net/jcip/jcip-annotations/1.0/jcip-annotations-1.0.pom
Downloading: https://maven.wso2.org/nexus/content/groups/wso2-public/net/jcip/jcip-annotations/1.0/jcip-annotations-1.0.pom
Downloaded: https://maven.wso2.org/nexus/content/groups/wso2-public/net/jcip/jcip-annotations/1.0/jcip-annotations-1.0.pom (491 B at 9.0 KB/sec)
Downloading: https://maven.wso2.org/nexus/content/repositories/releases/net/minidev/json-smart/1.1.1/json-smart-1.1.1.pom
Downloading: https://maven.wso2.org/nexus/content/groups/wso2-public/net/minidev/json-smart/1.1.1/json-smart-1.1.1.pom
Downloaded: https://maven.wso2.org/nexus/content/groups/wso2-public/net/minidev/json-smart/1.1.1/json-smart-1.1.1.pom (2 KB at 24.5 KB/sec)
Downloading: https://maven.wso2.org/nexus/content/repositories/releases/net/minidev/parent/1.1.1/parent-1.1.1.pom
Downloading: https://maven.wso2.org/nexus/content/groups/wso2-public/net/minidev/parent/1.1.1/parent-1.1.1.pom
Downloaded: https://maven.wso2.org/nexus/content/groups/wso2-public/net/minidev/parent/1.1.1/parent-1.1.1.pom (11 KB at 200.0 KB/sec)
Downloading: https://maven.wso2.org/nexus/content/repositories/releases/commons-io/wso2/commons-io/2.4.0.wso2v1/commons-io-2.4.0.wso2v1.pom
Downloaded: https://maven.wso2.org/nexus/content/repositories/releases/commons-io/wso2/commons-io/2.4.0.wso2v1/commons-io-2.4.0.wso2v1.pom (4 KB at 340.7 KB/sec)
Downloading: https://maven.wso2.org/nexus/content/repositories/releases/io/ballerina/messaging/broker-metrics/0.970.5/broker-metrics-0.970.5.pom
Downloaded: https://maven.wso2.org/nexus/content/repositories/releases/io/ballerina/messaging/broker-metrics/0.970.5/broker-metrics-0.970.5.pom (5 KB at 67.1 KB/sec)
Downloading: https://maven.wso2.org/nexus/content/repositories/releases/org/wso2/carbon/metrics/org.wso2.carbon.metrics.core/2.3.7/org.wso2.carbon.metrics.core-2.3.7.pom
Downloaded: https://maven.wso2.org/nexus/content/repositories/releases/org/wso2/carbon/metrics/org.wso2.carbon.metrics.core/2.3.7/org.wso2.carbon.metrics.core-2.3.7.pom (5 KB at 381.6 KB/sec)
Downloading: https://maven.wso2.org/nexus/content/repositories/releases/org/wso2/carbon/metrics/carbon-metrics/2.3.7/carbon-metrics-2.3.7.pom
Downloaded: https://maven.wso2.org/nexus/content/repositories/releases/org/wso2/carbon/metrics/carbon-metrics/2.3.7/carbon-metrics-2.3.7.pom (41 KB at 1928.2 KB/sec)
Downloading: https://maven.wso2.org/nexus/content/repositories/releases/io/dropwizard/metrics/metrics-core/3.2.5/metrics-core-3.2.5.pom
Downloading: https://maven.wso2.org/nexus/content/groups/wso2-public/io/dropwizard/metrics/metrics-core/3.2.5/metrics-core-3.2.5.pom
Downloaded: https://maven.wso2.org/nexus/content/groups/wso2-public/io/dropwizard/metrics/metrics-core/3.2.5/metrics-core-3.2.5.pom (846 B at 15.0 KB/sec)
Downloading: https://maven.wso2.org/nexus/content/repositories/releases/io/dropwizard/metrics/metrics-parent/3.2.5/metrics-parent-3.2.5.pom
Downloading: https://maven.wso2.org/nexus/content/groups/wso2-public/io/dropwizard/metrics/metrics-parent/3.2.5/metrics-parent-3.2.5.pom
Downloaded: https://maven.wso2.org/nexus/content/groups/wso2-public/io/dropwizard/metrics/metrics-parent/3.2.5/metrics-parent-3.2.5.pom (12 KB at 220.7 KB/sec)
Downloading: https://maven.wso2.org/nexus/content/repositories/releases/io/dropwizard/metrics/metrics-jvm/3.2.5/metrics-jvm-3.2.5.pom
Downloading: https://maven.wso2.org/nexus/content/groups/wso2-public/io/dropwizard/metrics/metrics-jvm/3.2.5/metrics-jvm-3.2.5.pom
Downloaded: https://maven.wso2.org/nexus/content/groups/wso2-public/io/dropwizard/metrics/metrics-jvm/3.2.5/metrics-jvm-3.2.5.pom (967 B at 18.2 KB/sec)
Downloading: https://maven.wso2.org/nexus/content/repositories/releases/org/hdrhistogram/HdrHistogram/2.1.10/HdrHistogram-2.1.10.pom
Downloading: https://maven.wso2.org/nexus/content/groups/wso2-public/org/hdrhistogram/HdrHistogram/2.1.10/HdrHistogram-2.1.10.pom
Downloaded: https://maven.wso2.org/nexus/content/groups/wso2-public/org/hdrhistogram/HdrHistogram/2.1.10/HdrHistogram-2.1.10.pom (10 KB at 177.4 KB/sec)
Downloading: https://maven.wso2.org/nexus/content/repositories/releases/org/wso2/carbon/config/org.wso2.carbon.config/2.1.4/org.wso2.carbon.config-2.1.4.pom
Downloaded: https://maven.wso2.org/nexus/content/repositories/releases/org/wso2/carbon/config/org.wso2.carbon.config/2.1.4/org.wso2.carbon.config-2.1.4.pom (6 KB at 182.2 KB/sec)
Downloading: https://maven.wso2.org/nexus/content/repositories/releases/org/wso2/carbon/config/carbon-config/2.1.4/carbon-config-2.1.4.pom
Downloaded: https://maven.wso2.org/nexus/content/repositories/releases/org/wso2/carbon/config/carbon-config/2.1.4/carbon-config-2.1.4.pom (11 KB at 944.1 KB/sec)
Downloading: https://maven.wso2.org/nexus/content/repositories/releases/org/wso2/orbit/com/lmax/disruptor/3.3.7.wso2v1/disruptor-3.3.7.wso2v1.pom
Downloaded: https://maven.wso2.org/nexus/content/repositories/releases/org/wso2/orbit/com/lmax/disruptor/3.3.7.wso2v1/disruptor-3.3.7.wso2v1.pom (4 KB at 130.9 KB/sec)
Downloading: https://maven.wso2.org/nexus/content/repositories/releases/com/zaxxer/HikariCP/3.3.1/HikariCP-3.3.1.pom
Downloading: https://maven.wso2.org/nexus/content/groups/wso2-public/com/zaxxer/HikariCP/3.3.1/HikariCP-3.3.1.pom
Downloaded: https://maven.wso2.org/nexus/content/groups/wso2-public/com/zaxxer/HikariCP/3.3.1/HikariCP-3.3.1.pom (19 KB at 359.8 KB/sec)
Downloading: https://maven.wso2.org/nexus/content/repositories/releases/info/picocli/picocli/4.0.1/picocli-4.0.1.pom
Downloading: https://maven.wso2.org/nexus/content/groups/wso2-public/info/picocli/picocli/4.0.1/picocli-4.0.1.pom
Downloaded: https://maven.wso2.org/nexus/content/groups/wso2-public/info/picocli/picocli/4.0.1/picocli-4.0.1.pom (2 KB at 13.6 KB/sec)
Downloading: https://maven.wso2.org/nexus/content/repositories/releases/org/testng/testng/6.14.3/testng-6.14.3.pom
Downloading: https://maven.wso2.org/nexus/content/groups/wso2-public/org/testng/testng/6.14.3/testng-6.14.3.pom
Downloaded: https://maven.wso2.org/nexus/content/groups/wso2-public/org/testng/testng/6.14.3/testng-6.14.3.pom (3 KB at 35.9 KB/sec)
Downloading: https://maven.wso2.org/nexus/content/repositories/releases/com/beust/jcommander/1.72/jcommander-1.72.pom
Downloading: https://maven.wso2.org/nexus/content/groups/wso2-public/com/beust/jcommander/1.72/jcommander-1.72.pom
Downloaded: https://maven.wso2.org/nexus/content/groups/wso2-public/com/beust/jcommander/1.72/jcommander-1.72.pom (2 KB at 23.5 KB/sec)
Downloading: https://maven.wso2.org/nexus/content/repositories/releases/org/apache-extras/beanshell/bsh/2.0b6/bsh-2.0b6.pom
Downloading: https://maven.wso2.org/nexus/content/groups/wso2-public/org/apache-extras/beanshell/bsh/2.0b6/bsh-2.0b6.pom
Downloaded: https://maven.wso2.org/nexus/content/groups/wso2-public/org/apache-extras/beanshell/bsh/2.0b6/bsh-2.0b6.pom (5 KB at 35.1 KB/sec)
Downloading: https://maven.wso2.org/nexus/content/repositories/releases/org/ballerinalang/ballerina-config-api/1.0.1/ballerina-config-api-1.0.1.pom
Downloaded: https://maven.wso2.org/nexus/content/repositories/releases/org/ballerinalang/ballerina-config-api/1.0.1/ballerina-config-api-1.0.1.pom (22 KB at 209.4 KB/sec)
Downloading: https://maven.wso2.org/nexus/content/repositories/releases/org/ballerinalang/ballerina-stringutils/1.0.1/ballerina-stringutils-1.0.1.pom
Downloaded: https://maven.wso2.org/nexus/content/repositories/releases/org/ballerinalang/ballerina-stringutils/1.0.1/ballerina-stringutils-1.0.1.pom (22 KB at 306.3 KB/sec)
Downloading: https://maven.wso2.org/nexus/content/repositories/releases/org/ballerinalang/ballerina-io/1.0.1/ballerina-io-1.0.1.pom
Downloaded: https://maven.wso2.org/nexus/content/repositories/releases/org/ballerinalang/ballerina-io/1.0.1/ballerina-io-1.0.1.pom (22 KB at 454.9 KB/sec)
Downloading: https://maven.wso2.org/nexus/content/repositories/releases/org/ballerinalang/ballerina-runtime-api/1.0.1/ballerina-runtime-api-1.0.1.pom
Downloaded: https://maven.wso2.org/nexus/content/repositories/releases/org/ballerinalang/ballerina-runtime-api/1.0.1/ballerina-runtime-api-1.0.1.pom (22 KB at 368.8 KB/sec)
Downloading: https://maven.wso2.org/nexus/content/repositories/releases/org/ballerinalang/ballerina-java/1.0.1/ballerina-java-1.0.1.pom
Downloaded: https://maven.wso2.org/nexus/content/repositories/releases/org/ballerinalang/ballerina-java/1.0.1/ballerina-java-1.0.1.pom (22 KB at 301.2 KB/sec)
Downloading: https://maven.wso2.org/nexus/content/repositories/releases/org/ballerinalang/ballerina-crypto/1.0.1/ballerina-crypto-1.0.1.pom
Downloaded: https://maven.wso2.org/nexus/content/repositories/releases/org/ballerinalang/ballerina-crypto/1.0.1/ballerina-crypto-1.0.1.pom (22 KB at 628.7 KB/sec)
Downloading: https://maven.wso2.org/nexus/content/repositories/releases/org/ballerinalang/ballerina-time/1.0.1/ballerina-time-1.0.1.pom
Downloaded: https://maven.wso2.org/nexus/content/repositories/releases/org/ballerinalang/ballerina-time/1.0.1/ballerina-time-1.0.1.pom (22 KB at 229.9 KB/sec)
Downloading: https://maven.wso2.org/nexus/content/repositories/releases/org/ballerinalang/ballerina-system/1.0.1/ballerina-system-1.0.1.pom
Downloaded: https://maven.wso2.org/nexus/content/repositories/releases/org/ballerinalang/ballerina-system/1.0.1/ballerina-system-1.0.1.pom (22 KB at 479.1 KB/sec)
Downloading: https://maven.wso2.org/nexus/content/repositories/releases/org/ballerinalang/ballerina-cache/1.0.1/ballerina-cache-1.0.1.pom
Downloaded: https://maven.wso2.org/nexus/content/repositories/releases/org/ballerinalang/ballerina-cache/1.0.1/ballerina-cache-1.0.1.pom (22 KB at 491.1 KB/sec)
Downloading: https://maven.wso2.org/nexus/content/repositories/releases/commons-logging/commons-logging/1.1.1/commons-logging-1.1.1.pom
Downloading: https://maven.wso2.org/nexus/content/groups/wso2-public/commons-logging/commons-logging/1.1.1/commons-logging-1.1.1.pom
Downloaded: https://maven.wso2.org/nexus/content/groups/wso2-public/commons-logging/commons-logging/1.1.1/commons-logging-1.1.1.pom (18 KB at 332.1 KB/sec)
Downloading: https://maven.wso2.org/nexus/content/repositories/releases/org/apache/commons/commons-parent/5/commons-parent-5.pom
Downloading: https://maven.wso2.org/nexus/content/groups/wso2-public/org/apache/commons/commons-parent/5/commons-parent-5.pom
Downloaded: https://maven.wso2.org/nexus/content/groups/wso2-public/org/apache/commons/commons-parent/5/commons-parent-5.pom (16 KB at 290.1 KB/sec)
Downloading: https://maven.wso2.org/nexus/content/repositories/releases/org/slf4j/slf4j-jdk14/1.7.26/slf4j-jdk14-1.7.26.pom
Downloading: https://maven.wso2.org/nexus/content/groups/wso2-public/org/slf4j/slf4j-jdk14/1.7.26/slf4j-jdk14-1.7.26.pom
Downloaded: https://maven.wso2.org/nexus/content/groups/wso2-public/org/slf4j/slf4j-jdk14/1.7.26/slf4j-jdk14-1.7.26.pom (1014 B at 19.0 KB/sec)
Downloading: https://maven.wso2.org/nexus/content/repositories/releases/org/slf4j/slf4j-parent/1.7.26/slf4j-parent-1.7.26.pom
Downloading: https://maven.wso2.org/nexus/content/groups/wso2-public/org/slf4j/slf4j-parent/1.7.26/slf4j-parent-1.7.26.pom
Downloaded: https://maven.wso2.org/nexus/content/groups/wso2-public/org/slf4j/slf4j-parent/1.7.26/slf4j-parent-1.7.26.pom (14 KB at 267.2 KB/sec)
Downloading: https://maven.wso2.org/nexus/content/repositories/releases/org/ballerinalang/ballerina-log-api/1.0.1/ballerina-log-api-1.0.1.pom
Downloaded: https://maven.wso2.org/nexus/content/repositories/releases/org/ballerinalang/ballerina-log-api/1.0.1/ballerina-log-api-1.0.1.pom (22 KB at 588.8 KB/sec)
Downloading: https://maven.wso2.org/nexus/content/repositories/releases/org/ballerinalang/ballerina-task/1.0.1/ballerina-task-1.0.1.pom
Downloaded: https://maven.wso2.org/nexus/content/repositories/releases/org/ballerinalang/ballerina-task/1.0.1/ballerina-task-1.0.1.pom (22 KB at 1123.4 KB/sec)
Downloading: https://maven.wso2.org/nexus/content/repositories/releases/org/quartz-scheduler/quartz/2.3.1/quartz-2.3.1.pom
Downloading: https://maven.wso2.org/nexus/content/groups/wso2-public/org/quartz-scheduler/quartz/2.3.1/quartz-2.3.1.pom
Downloaded: https://maven.wso2.org/nexus/content/groups/wso2-public/org/quartz-scheduler/quartz/2.3.1/quartz-2.3.1.pom (9 KB at 179.6 KB/sec)
Downloading: https://maven.wso2.org/nexus/content/repositories/releases/org/quartz-scheduler/quartz-parent/2.3.1/quartz-parent-2.3.1.pom
Downloading: https://maven.wso2.org/nexus/content/groups/wso2-public/org/quartz-scheduler/quartz-parent/2.3.1/quartz-parent-2.3.1.pom
Downloaded: https://maven.wso2.org/nexus/content/groups/wso2-public/org/quartz-scheduler/quartz-parent/2.3.1/quartz-parent-2.3.1.pom (15 KB at 252.4 KB/sec)
Downloading: https://maven.wso2.org/nexus/content/repositories/releases/com/mchange/c3p0/0.9.5.3/c3p0-0.9.5.3.pom
Downloading: https://maven.wso2.org/nexus/content/groups/wso2-public/com/mchange/c3p0/0.9.5.3/c3p0-0.9.5.3.pom
Downloaded: https://maven.wso2.org/nexus/content/groups/wso2-public/com/mchange/c3p0/0.9.5.3/c3p0-0.9.5.3.pom (2 KB at 25.3 KB/sec)
Downloading: https://maven.wso2.org/nexus/content/repositories/releases/com/mchange/mchange-commons-java/0.2.15/mchange-commons-java-0.2.15.pom
Downloading: https://maven.wso2.org/nexus/content/groups/wso2-public/com/mchange/mchange-commons-java/0.2.15/mchange-commons-java-0.2.15.pom
Downloaded: https://maven.wso2.org/nexus/content/groups/wso2-public/com/mchange/mchange-commons-java/0.2.15/mchange-commons-java-0.2.15.pom (4 KB at 67.2 KB/sec)
Downloading: https://maven.wso2.org/nexus/content/repositories/releases/com/zaxxer/HikariCP-java7/2.4.13/HikariCP-java7-2.4.13.pom
Downloading: https://maven.wso2.org/nexus/content/groups/wso2-public/com/zaxxer/HikariCP-java7/2.4.13/HikariCP-java7-2.4.13.pom
Downloaded: https://maven.wso2.org/nexus/content/groups/wso2-public/com/zaxxer/HikariCP-java7/2.4.13/HikariCP-java7-2.4.13.pom (18 KB at 213.9 KB/sec)
Downloading: https://maven.wso2.org/nexus/content/repositories/releases/org/ballerinalang/ballerina-file/1.0.1/ballerina-file-1.0.1.pom
Downloaded: https://maven.wso2.org/nexus/content/repositories/releases/org/ballerinalang/ballerina-file/1.0.1/ballerina-file-1.0.1.pom (19 KB at 318.5 KB/sec)
Downloading: https://maven.wso2.org/nexus/content/repositories/releases/org/ballerinalang/ballerina-math/1.0.1/ballerina-math-1.0.1.pom
Downloaded: https://maven.wso2.org/nexus/content/repositories/releases/org/ballerinalang/ballerina-math/1.0.1/ballerina-math-1.0.1.pom (22 KB at 260.8 KB/sec)
Downloading: https://maven.wso2.org/nexus/content/repositories/releases/org/ballerinalang/ballerina-reflect/1.0.1/ballerina-reflect-1.0.1.pom
Downloaded: https://maven.wso2.org/nexus/content/repositories/releases/org/ballerinalang/ballerina-reflect/1.0.1/ballerina-reflect-1.0.1.pom (22 KB at 428.9 KB/sec)
Downloading: https://maven.wso2.org/nexus/content/repositories/releases/org/ballerinalang/ballerina-mime/1.0.1/ballerina-mime-1.0.1.pom
Downloaded: https://maven.wso2.org/nexus/content/repositories/releases/org/ballerinalang/ballerina-mime/1.0.1/ballerina-mime-1.0.1.pom (23 KB at 616.9 KB/sec)
Downloading: https://maven.wso2.org/nexus/content/repositories/releases/org/wso2/transport/http/org.wso2.transport.http.netty/6.2.25/org.wso2.transport.http.netty-6.2.25.pom
Downloaded: https://maven.wso2.org/nexus/content/repositories/releases/org/wso2/transport/http/org.wso2.transport.http.netty/6.2.25/org.wso2.transport.http.netty-6.2.25.pom (10 KB at 132.5 KB/sec)
Downloading: https://maven.wso2.org/nexus/content/repositories/releases/org/wso2/transport/http/http-parent/6.2.25/http-parent-6.2.25.pom
Downloaded: https://maven.wso2.org/nexus/content/repositories/releases/org/wso2/transport/http/http-parent/6.2.25/http-parent-6.2.25.pom (16 KB at 159.8 KB/sec)
Downloading: https://maven.wso2.org/nexus/content/repositories/releases/org/wso2/eclipse/osgi/org.eclipse.osgi/3.10.2.v20150203-1939/org.eclipse.osgi-3.10.2.v20150203-1939.pom
Downloaded: https://maven.wso2.org/nexus/content/repositories/releases/org/wso2/eclipse/osgi/org.eclipse.osgi/3.10.2.v20150203-1939/org.eclipse.osgi-3.10.2.v20150203-1939.pom (489 B at 16.5 KB/sec)
Downloading: https://maven.wso2.org/nexus/content/repositories/releases/org/wso2/eclipse/osgi/org.eclipse.osgi.services/3.4.0.v20140312-2051/org.eclipse.osgi.services-3.4.0.v20140312-2051.pom
Downloaded: https://maven.wso2.org/nexus/content/repositories/releases/org/wso2/eclipse/osgi/org.eclipse.osgi.services/3.4.0.v20140312-2051/org.eclipse.osgi.services-3.4.0.v20140312-2051.pom (497 B at 20.2 KB/sec)
Downloading: https://maven.wso2.org/nexus/content/repositories/releases/io/netty/netty-handler-proxy/4.1.39.Final/netty-handler-proxy-4.1.39.Final.pom
Downloading: https://maven.wso2.org/nexus/content/groups/wso2-public/io/netty/netty-handler-proxy/4.1.39.Final/netty-handler-proxy-4.1.39.Final.pom
Downloaded: https://maven.wso2.org/nexus/content/groups/wso2-public/io/netty/netty-handler-proxy/4.1.39.Final/netty-handler-proxy-4.1.39.Final.pom (3 KB at 53.4 KB/sec)
Downloading: https://maven.wso2.org/nexus/content/repositories/releases/io/netty/netty-codec-socks/4.1.39.Final/netty-codec-socks-4.1.39.Final.pom
Downloading: https://maven.wso2.org/nexus/content/groups/wso2-public/io/netty/netty-codec-socks/4.1.39.Final/netty-codec-socks-4.1.39.Final.pom
Downloaded: https://maven.wso2.org/nexus/content/groups/wso2-public/io/netty/netty-codec-socks/4.1.39.Final/netty-codec-socks-4.1.39.Final.pom (2 KB at 37.9 KB/sec)
Downloading: https://maven.wso2.org/nexus/content/repositories/releases/io/netty/netty-codec-http2/4.1.39.Final/netty-codec-http2-4.1.39.Final.pom
Downloading: https://maven.wso2.org/nexus/content/groups/wso2-public/io/netty/netty-codec-http2/4.1.39.Final/netty-codec-http2-4.1.39.Final.pom
Downloaded: https://maven.wso2.org/nexus/content/groups/wso2-public/io/netty/netty-codec-http2/4.1.39.Final/netty-codec-http2-4.1.39.Final.pom (3 KB at 48.7 KB/sec)
Downloading: https://maven.wso2.org/nexus/content/repositories/releases/org/wso2/orbit/org/yaml/snakeyaml/1.16.0.wso2v1/snakeyaml-1.16.0.wso2v1.pom
Downloaded: https://maven.wso2.org/nexus/content/repositories/releases/org/wso2/orbit/org/yaml/snakeyaml/1.16.0.wso2v1/snakeyaml-1.16.0.wso2v1.pom (4 KB at 225.7 KB/sec)
Downloading: https://maven.wso2.org/nexus/content/repositories/releases/org/bouncycastle/bcprov-jdk15on/1.61/bcprov-jdk15on-1.61.pom
Downloading: https://maven.wso2.org/nexus/content/groups/wso2-public/org/bouncycastle/bcprov-jdk15on/1.61/bcprov-jdk15on-1.61.pom
Downloaded: https://maven.wso2.org/nexus/content/groups/wso2-public/org/bouncycastle/bcprov-jdk15on/1.61/bcprov-jdk15on-1.61.pom (2 KB at 21.9 KB/sec)
Downloading: https://maven.wso2.org/nexus/content/repositories/releases/org/bouncycastle/bcpkix-jdk15on/1.61/bcpkix-jdk15on-1.61.pom
Downloading: https://maven.wso2.org/nexus/content/groups/wso2-public/org/bouncycastle/bcpkix-jdk15on/1.61/bcpkix-jdk15on-1.61.pom
Downloaded: https://maven.wso2.org/nexus/content/groups/wso2-public/org/bouncycastle/bcpkix-jdk15on/1.61/bcpkix-jdk15on-1.61.pom (2 KB at 27.0 KB/sec)
Downloading: https://maven.wso2.org/nexus/content/repositories/releases/io/netty/netty-tcnative-boringssl-static/2.0.25.Final/netty-tcnative-boringssl-static-2.0.25.Final.pom
Downloading: https://maven.wso2.org/nexus/content/groups/wso2-public/io/netty/netty-tcnative-boringssl-static/2.0.25.Final/netty-tcnative-boringssl-static-2.0.25.Final.pom
Downloaded: https://maven.wso2.org/nexus/content/groups/wso2-public/io/netty/netty-tcnative-boringssl-static/2.0.25.Final/netty-tcnative-boringssl-static-2.0.25.Final.pom (25 KB at 372.8 KB/sec)
Downloading: https://maven.wso2.org/nexus/content/repositories/releases/io/netty/netty-tcnative-parent/2.0.25.Final/netty-tcnative-parent-2.0.25.Final.pom
Downloading: https://maven.wso2.org/nexus/content/groups/wso2-public/io/netty/netty-tcnative-parent/2.0.25.Final/netty-tcnative-parent-2.0.25.Final.pom
Downloaded: https://maven.wso2.org/nexus/content/groups/wso2-public/io/netty/netty-tcnative-parent/2.0.25.Final/netty-tcnative-parent-2.0.25.Final.pom (26 KB at 473.8 KB/sec)
Downloading: https://maven.wso2.org/nexus/content/repositories/releases/io/netty/netty-parent/4.0.29.Final/netty-parent-4.0.29.Final.pom
Downloading: https://maven.wso2.org/nexus/content/groups/wso2-public/io/netty/netty-parent/4.0.29.Final/netty-parent-4.0.29.Final.pom
Downloaded: https://maven.wso2.org/nexus/content/groups/wso2-public/io/netty/netty-parent/4.0.29.Final/netty-parent-4.0.29.Final.pom (50 KB at 922.9 KB/sec)
Downloading: https://maven.wso2.org/nexus/content/repositories/releases/org/jvnet/mimepull/mimepull/1.9.11/mimepull-1.9.11.pom
Downloading: https://maven.wso2.org/nexus/content/groups/wso2-public/org/jvnet/mimepull/mimepull/1.9.11/mimepull-1.9.11.pom
Downloaded: https://maven.wso2.org/nexus/content/groups/wso2-public/org/jvnet/mimepull/mimepull/1.9.11/mimepull-1.9.11.pom (15 KB at 276.7 KB/sec)
Downloading: https://maven.wso2.org/nexus/content/repositories/releases/org/eclipse/ee4j/project/1.0.5/project-1.0.5.pom
Downloading: https://maven.wso2.org/nexus/content/groups/wso2-public/org/eclipse/ee4j/project/1.0.5/project-1.0.5.pom
Downloaded: https://maven.wso2.org/nexus/content/groups/wso2-public/org/eclipse/ee4j/project/1.0.5/project-1.0.5.pom (13 KB at 124.8 KB/sec)
Downloading: https://maven.wso2.org/nexus/content/repositories/releases/org/ballerinalang/ballerina-openapi/1.0.1/ballerina-openapi-1.0.1.pom
Downloaded: https://maven.wso2.org/nexus/content/repositories/releases/org/ballerinalang/ballerina-openapi/1.0.1/ballerina-openapi-1.0.1.pom (22 KB at 431.1 KB/sec)
Downloading: https://maven.wso2.org/nexus/content/repositories/releases/org/ballerinalang/ballerina-jdbc/1.0.1/ballerina-jdbc-1.0.1.pom
Downloaded: https://maven.wso2.org/nexus/content/repositories/releases/org/ballerinalang/ballerina-jdbc/1.0.1/ballerina-jdbc-1.0.1.pom (22 KB at 442.8 KB/sec)
Downloading: https://maven.wso2.org/nexus/content/repositories/releases/org/ballerinalang/ballerina-test-utils/1.0.1/ballerina-test-utils-1.0.1.pom
Downloaded: https://maven.wso2.org/nexus/content/repositories/releases/org/ballerinalang/ballerina-test-utils/1.0.1/ballerina-test-utils-1.0.1.pom (20 KB at 1155.4 KB/sec)
Downloading: https://maven.wso2.org/nexus/content/repositories/releases/org/javassist/javassist/3.24.1-GA/javassist-3.24.1-GA.pom
Downloading: https://maven.wso2.org/nexus/content/groups/wso2-public/org/javassist/javassist/3.24.1-GA/javassist-3.24.1-GA.pom
Downloaded: https://maven.wso2.org/nexus/content/groups/wso2-public/org/javassist/javassist/3.24.1-GA/javassist-3.24.1-GA.pom (11 KB at 206.3 KB/sec)
Downloading: https://maven.wso2.org/nexus/content/repositories/releases/org/ballerinalang/ballerina-transactions/1.0.1/ballerina-transactions-1.0.1.pom
Downloaded: https://maven.wso2.org/nexus/content/repositories/releases/org/ballerinalang/ballerina-transactions/1.0.1/ballerina-transactions-1.0.1.pom (23 KB at 320.9 KB/sec)
Downloading: https://maven.wso2.org/nexus/content/repositories/releases/org/ballerinalang/ballerina-filepath/1.0.1/ballerina-filepath-1.0.1.pom
Downloaded: https://maven.wso2.org/nexus/content/repositories/releases/org/ballerinalang/ballerina-filepath/1.0.1/ballerina-filepath-1.0.1.pom (22 KB at 385.4 KB/sec)
Downloading: https://maven.wso2.org/nexus/content/repositories/releases/org/ballerinalang/ballerina-rabbitmq/1.0.1/ballerina-rabbitmq-1.0.1.pom
Downloaded: https://maven.wso2.org/nexus/content/repositories/releases/org/ballerinalang/ballerina-rabbitmq/1.0.1/ballerina-rabbitmq-1.0.1.pom (23 KB at 356.4 KB/sec)
Downloading: https://maven.wso2.org/nexus/content/repositories/releases/com/rabbitmq/amqp-client/5.6.0/amqp-client-5.6.0.pom
Downloading: https://maven.wso2.org/nexus/content/groups/wso2-public/com/rabbitmq/amqp-client/5.6.0/amqp-client-5.6.0.pom
Downloaded: https://maven.wso2.org/nexus/content/groups/wso2-public/com/rabbitmq/amqp-client/5.6.0/amqp-client-5.6.0.pom (35 KB at 463.6 KB/sec)
Downloading: https://maven.wso2.org/nexus/content/repositories/releases/org/ballerinalang/ballerina-nats/1.0.1/ballerina-nats-1.0.1.pom
Downloaded: https://maven.wso2.org/nexus/content/repositories/releases/org/ballerinalang/ballerina-nats/1.0.1/ballerina-nats-1.0.1.pom (22 KB at 507.7 KB/sec)
Downloading: https://maven.wso2.org/nexus/content/repositories/releases/io/nats/java-nats-streaming/2.2.1/java-nats-streaming-2.2.1.pom
Downloading: https://maven.wso2.org/nexus/content/groups/wso2-public/io/nats/java-nats-streaming/2.2.1/java-nats-streaming-2.2.1.pom
Downloaded: https://maven.wso2.org/nexus/content/groups/wso2-public/io/nats/java-nats-streaming/2.2.1/java-nats-streaming-2.2.1.pom (2 KB at 20.5 KB/sec)
Downloading: https://maven.wso2.org/nexus/content/repositories/releases/com/google/protobuf/protobuf-java/3.9.1/protobuf-java-3.9.1.pom
Downloading: https://maven.wso2.org/nexus/content/groups/wso2-public/com/google/protobuf/protobuf-java/3.9.1/protobuf-java-3.9.1.pom
Downloaded: https://maven.wso2.org/nexus/content/groups/wso2-public/com/google/protobuf/protobuf-java/3.9.1/protobuf-java-3.9.1.pom (6 KB at 101.7 KB/sec)
Downloading: https://maven.wso2.org/nexus/content/repositories/releases/com/google/protobuf/protobuf-parent/3.9.1/protobuf-parent-3.9.1.pom
Downloading: https://maven.wso2.org/nexus/content/groups/wso2-public/com/google/protobuf/protobuf-parent/3.9.1/protobuf-parent-3.9.1.pom
Downloaded: https://maven.wso2.org/nexus/content/groups/wso2-public/com/google/protobuf/protobuf-parent/3.9.1/protobuf-parent-3.9.1.pom (8 KB at 149.8 KB/sec)
Downloading: https://maven.wso2.org/nexus/content/repositories/releases/com/google/protobuf/protobuf-bom/3.9.1/protobuf-bom-3.9.1.pom
Downloading: https://maven.wso2.org/nexus/content/groups/wso2-public/com/google/protobuf/protobuf-bom/3.9.1/protobuf-bom-3.9.1.pom
Downloaded: https://maven.wso2.org/nexus/content/groups/wso2-public/com/google/protobuf/protobuf-bom/3.9.1/protobuf-bom-3.9.1.pom (4 KB at 65.5 KB/sec)
Downloading: https://maven.wso2.org/nexus/content/repositories/releases/io/nats/jnats/maven-metadata.xml
Downloading: https://maven.wso2.org/nexus/content/repositories/thirdparty/io/nats/jnats/maven-metadata.xml
Downloading: https://maven.wso2.org/nexus/content/groups/wso2-public/io/nats/jnats/maven-metadata.xml
Downloading: https://build.shibboleth.net/nexus/content/groups/public/io/nats/jnats/maven-metadata.xml
Downloading: https://build.shibboleth.net/nexus/content/groups/public/io/nats/jnats/maven-metadata.xml
Downloading: http://maven.wso2.org/nexus/content/repositories/snapshots/io/nats/jnats/maven-metadata.xml
Downloading: http://repo.maven.apache.org/maven2/io/nats/jnats/maven-metadata.xml
Downloaded: https://maven.wso2.org/nexus/content/groups/wso2-public/io/nats/jnats/maven-metadata.xml (2 KB at 25.1 KB/sec)
Downloaded: http://repo.maven.apache.org/maven2/io/nats/jnats/maven-metadata.xml (2 KB at 4.3 KB/sec)
[WARNING] Could not transfer metadata io.nats:jnats/maven-metadata.xml from/to shibboleth.internet2.edu (https://build.shibboleth.net/nexus/content/groups/public/): Connection to https://build.shibboleth.net refused
[WARNING] Could not transfer metadata io.nats:jnats/maven-metadata.xml from/to shibboleth-release (https://build.shibboleth.net/nexus/content/groups/public/): Connection to https://build.shibboleth.net refused
Downloading: https://maven.wso2.org/nexus/content/repositories/releases/io/nats/jnats/2.6.0/jnats-2.6.0.pom
Downloading: https://maven.wso2.org/nexus/content/groups/wso2-public/io/nats/jnats/2.6.0/jnats-2.6.0.pom
Downloaded: https://maven.wso2.org/nexus/content/groups/wso2-public/io/nats/jnats/2.6.0/jnats-2.6.0.pom (2 KB at 24.6 KB/sec)
Downloading: https://maven.wso2.org/nexus/content/repositories/releases/net/i2p/crypto/eddsa/0.3.0/eddsa-0.3.0.pom
Downloading: https://maven.wso2.org/nexus/content/groups/wso2-public/net/i2p/crypto/eddsa/0.3.0/eddsa-0.3.0.pom
Downloaded: https://maven.wso2.org/nexus/content/groups/wso2-public/net/i2p/crypto/eddsa/0.3.0/eddsa-0.3.0.pom (7 KB at 129.9 KB/sec)
Downloading: https://maven.wso2.org/nexus/content/repositories/releases/io/nats/jnats/2.6.1/jnats-2.6.1.pom
Downloading: https://maven.wso2.org/nexus/content/groups/wso2-public/io/nats/jnats/2.6.1/jnats-2.6.1.pom
Downloaded: https://maven.wso2.org/nexus/content/groups/wso2-public/io/nats/jnats/2.6.1/jnats-2.6.1.pom (2 KB at 18.4 KB/sec)
Downloading: https://maven.wso2.org/nexus/content/repositories/releases/io/nats/jnats/2.6.2/jnats-2.6.2.pom
Downloading: https://maven.wso2.org/nexus/content/groups/wso2-public/io/nats/jnats/2.6.2/jnats-2.6.2.pom
Downloaded: https://maven.wso2.org/nexus/content/groups/wso2-public/io/nats/jnats/2.6.2/jnats-2.6.2.pom (2 KB at 18.4 KB/sec)
Downloading: https://maven.wso2.org/nexus/content/repositories/releases/io/nats/jnats/2.6.4/jnats-2.6.4.pom
Downloading: https://maven.wso2.org/nexus/content/groups/wso2-public/io/nats/jnats/2.6.4/jnats-2.6.4.pom
Downloaded: https://maven.wso2.org/nexus/content/groups/wso2-public/io/nats/jnats/2.6.4/jnats-2.6.4.pom (2 KB at 17.7 KB/sec)
Downloading: https://maven.wso2.org/nexus/content/repositories/releases/io/nats/jnats/2.6.5/jnats-2.6.5.pom
Downloading: https://maven.wso2.org/nexus/content/groups/wso2-public/io/nats/jnats/2.6.5/jnats-2.6.5.pom
Downloaded: https://maven.wso2.org/nexus/content/groups/wso2-public/io/nats/jnats/2.6.5/jnats-2.6.5.pom (2 KB at 22.5 KB/sec)
Downloading: https://maven.wso2.org/nexus/content/repositories/releases/org/ballerinalang/openapi-to-ballerina-generator/1.0.1/openapi-to-ballerina-generator-1.0.1.pom
Downloaded: https://maven.wso2.org/nexus/content/repositories/releases/org/ballerinalang/openapi-to-ballerina-generator/1.0.1/openapi-to-ballerina-generator-1.0.1.pom (21 KB at 383.8 KB/sec)
[WARNING] The POM for org.ballerinalang:openapi-to-ballerina-generator:jar:1.0.1 is invalid, transitive dependencies (if any) will not be available, enable debug logging for more details
Downloading: https://maven.wso2.org/nexus/content/repositories/releases/org/ballerinalang/ballerina-to-openapi-generator/1.0.1/ballerina-to-openapi-generator-1.0.1.pom
Downloaded: https://maven.wso2.org/nexus/content/repositories/releases/org/ballerinalang/ballerina-to-openapi-generator/1.0.1/ballerina-to-openapi-generator-1.0.1.pom (20 KB at 525.8 KB/sec)
[WARNING] The POM for org.ballerinalang:ballerina-to-openapi-generator:jar:1.0.1 is invalid, transitive dependencies (if any) will not be available, enable debug logging for more details
Downloading: https://maven.wso2.org/nexus/content/repositories/releases/org/ballerinalang/ballerina-bir/1.0.1/ballerina-bir-1.0.1.pom
Downloaded: https://maven.wso2.org/nexus/content/repositories/releases/org/ballerinalang/ballerina-bir/1.0.1/ballerina-bir-1.0.1.pom (22 KB at 1658.1 KB/sec)
Downloading: https://maven.wso2.org/nexus/content/repositories/releases/org/ballerinalang/ballerina-encoding/1.0.1/ballerina-encoding-1.0.1.pom
Downloaded: https://maven.wso2.org/nexus/content/repositories/releases/org/ballerinalang/ballerina-encoding/1.0.1/ballerina-encoding-1.0.1.pom (22 KB at 270.7 KB/sec)
Downloading: https://maven.wso2.org/nexus/content/repositories/releases/org/ballerinalang/ballerina-grpc/1.0.1/ballerina-grpc-1.0.1.pom
Downloaded: https://maven.wso2.org/nexus/content/repositories/releases/org/ballerinalang/ballerina-grpc/1.0.1/ballerina-grpc-1.0.1.pom (23 KB at 553.2 KB/sec)
Downloading: https://maven.wso2.org/nexus/content/repositories/releases/com/github/jknack/handlebars/4.0.6/handlebars-4.0.6.pom
Downloading: https://maven.wso2.org/nexus/content/groups/wso2-public/com/github/jknack/handlebars/4.0.6/handlebars-4.0.6.pom
Downloaded: https://maven.wso2.org/nexus/content/groups/wso2-public/com/github/jknack/handlebars/4.0.6/handlebars-4.0.6.pom (6 KB at 100.4 KB/sec)
Downloading: https://maven.wso2.org/nexus/content/repositories/releases/com/github/jknack/handlebars.java/4.0.6/handlebars.java-4.0.6.pom
Downloading: https://maven.wso2.org/nexus/content/groups/wso2-public/com/github/jknack/handlebars.java/4.0.6/handlebars.java-4.0.6.pom
Downloaded: https://maven.wso2.org/nexus/content/groups/wso2-public/com/github/jknack/handlebars.java/4.0.6/handlebars.java-4.0.6.pom (15 KB at 193.6 KB/sec)
Downloading: https://maven.wso2.org/nexus/content/repositories/releases/org/antlr/antlr4-runtime/4.7.2/antlr4-runtime-4.7.2.pom
Downloading: https://maven.wso2.org/nexus/content/groups/wso2-public/org/antlr/antlr4-runtime/4.7.2/antlr4-runtime-4.7.2.pom
Downloaded: https://maven.wso2.org/nexus/content/groups/wso2-public/org/antlr/antlr4-runtime/4.7.2/antlr4-runtime-4.7.2.pom (4 KB at 69.3 KB/sec)
Downloading: https://maven.wso2.org/nexus/content/repositories/releases/org/antlr/antlr4-master/4.7.2/antlr4-master-4.7.2.pom
Downloading: https://maven.wso2.org/nexus/content/groups/wso2-public/org/antlr/antlr4-master/4.7.2/antlr4-master-4.7.2.pom
Downloaded: https://maven.wso2.org/nexus/content/groups/wso2-public/org/antlr/antlr4-master/4.7.2/antlr4-master-4.7.2.pom (5 KB at 79.6 KB/sec)
Downloading: https://maven.wso2.org/nexus/content/repositories/releases/org/mozilla/rhino/1.7R4/rhino-1.7R4.pom
Downloading: https://maven.wso2.org/nexus/content/groups/wso2-public/org/mozilla/rhino/1.7R4/rhino-1.7R4.pom
Downloaded: https://maven.wso2.org/nexus/content/groups/wso2-public/org/mozilla/rhino/1.7R4/rhino-1.7R4.pom (2 KB at 23.7 KB/sec)
Downloading: https://maven.wso2.org/nexus/content/repositories/releases/org/ballerinalang/ballerina-jwt/1.0.1/ballerina-jwt-1.0.1.pom
Downloaded: https://maven.wso2.org/nexus/content/repositories/releases/org/ballerinalang/ballerina-jwt/1.0.1/ballerina-jwt-1.0.1.pom (23 KB at 345.7 KB/sec)
Downloading: https://maven.wso2.org/nexus/content/repositories/releases/org/ballerinalang/ballerina-ldap/1.0.1/ballerina-ldap-1.0.1.pom
Downloaded: https://maven.wso2.org/nexus/content/repositories/releases/org/ballerinalang/ballerina-ldap/1.0.1/ballerina-ldap-1.0.1.pom (22 KB at 299.5 KB/sec)
Downloading: https://maven.wso2.org/nexus/content/repositories/releases/org/ballerinalang/ballerina-oauth2/1.0.1/ballerina-oauth2-1.0.1.pom
Downloaded: https://maven.wso2.org/nexus/content/repositories/releases/org/ballerinalang/ballerina-oauth2/1.0.1/ballerina-oauth2-1.0.1.pom (23 KB at 1052.7 KB/sec)
Downloading: https://maven.wso2.org/nexus/content/repositories/releases/org/ballerinalang/ballerina-observability/1.0.1/ballerina-observability-1.0.1.pom
Downloaded: https://maven.wso2.org/nexus/content/repositories/releases/org/ballerinalang/ballerina-observability/1.0.1/ballerina-observability-1.0.1.pom (22 KB at 639.1 KB/sec)
Downloading: https://maven.wso2.org/nexus/content/repositories/releases/org/ballerinalang/ballerina-metrics-extension/1.0.1/ballerina-metrics-extension-1.0.1.pom
Downloaded: https://maven.wso2.org/nexus/content/repositories/releases/org/ballerinalang/ballerina-metrics-extension/1.0.1/ballerina-metrics-extension-1.0.1.pom (19 KB at 1302.4 KB/sec)
Downloading: https://maven.wso2.org/nexus/content/repositories/releases/org/hdrhistogram/HdrHistogram/2.1.11/HdrHistogram-2.1.11.pom
Downloading: https://maven.wso2.org/nexus/content/groups/wso2-public/org/hdrhistogram/HdrHistogram/2.1.11/HdrHistogram-2.1.11.pom
Downloaded: https://maven.wso2.org/nexus/content/groups/wso2-public/org/hdrhistogram/HdrHistogram/2.1.11/HdrHistogram-2.1.11.pom (11 KB at 167.4 KB/sec)
Downloading: https://maven.wso2.org/nexus/content/repositories/releases/org/ballerinalang/ballerina-socket/1.0.1/ballerina-socket-1.0.1.pom
Downloaded: https://maven.wso2.org/nexus/content/repositories/releases/org/ballerinalang/ballerina-socket/1.0.1/ballerina-socket-1.0.1.pom (22 KB at 557.7 KB/sec)
Downloading: https://maven.wso2.org/nexus/content/repositories/releases/org/ballerinalang/lib-creator/1.0.1/lib-creator-1.0.1.pom
Downloaded: https://maven.wso2.org/nexus/content/repositories/releases/org/ballerinalang/lib-creator/1.0.1/lib-creator-1.0.1.pom (19 KB at 669.2 KB/sec)
Downloading: https://maven.wso2.org/nexus/content/repositories/releases/org/ballerinalang/ballerina-streams/1.0.1/ballerina-streams-1.0.1.pom
Downloaded: https://maven.wso2.org/nexus/content/repositories/releases/org/ballerinalang/ballerina-streams/1.0.1/ballerina-streams-1.0.1.pom (24 KB at 620.0 KB/sec)
Downloading: https://maven.wso2.org/nexus/content/repositories/releases/org/ballerinalang/testerina-core/1.0.1/testerina-core-1.0.1.pom
Downloaded: https://maven.wso2.org/nexus/content/repositories/releases/org/ballerinalang/testerina-core/1.0.1/testerina-core-1.0.1.pom (26 KB at 443.2 KB/sec)
Downloading: https://maven.wso2.org/nexus/content/repositories/releases/com/fasterxml/jackson/core/jackson-databind/2.9.8/jackson-databind-2.9.8.pom
Downloading: https://maven.wso2.org/nexus/content/groups/wso2-public/com/fasterxml/jackson/core/jackson-databind/2.9.8/jackson-databind-2.9.8.pom
Downloaded: https://maven.wso2.org/nexus/content/groups/wso2-public/com/fasterxml/jackson/core/jackson-databind/2.9.8/jackson-databind-2.9.8.pom (7 KB at 120.8 KB/sec)
Downloading: https://maven.wso2.org/nexus/content/repositories/releases/com/fasterxml/jackson/jackson-base/2.9.8/jackson-base-2.9.8.pom
Downloading: https://maven.wso2.org/nexus/content/groups/wso2-public/com/fasterxml/jackson/jackson-base/2.9.8/jackson-base-2.9.8.pom
Downloaded: https://maven.wso2.org/nexus/content/groups/wso2-public/com/fasterxml/jackson/jackson-base/2.9.8/jackson-base-2.9.8.pom (6 KB at 101.4 KB/sec)
Downloading: https://maven.wso2.org/nexus/content/repositories/releases/com/fasterxml/jackson/jackson-bom/2.9.8/jackson-bom-2.9.8.pom
Downloading: https://maven.wso2.org/nexus/content/groups/wso2-public/com/fasterxml/jackson/jackson-bom/2.9.8/jackson-bom-2.9.8.pom
Downloaded: https://maven.wso2.org/nexus/content/groups/wso2-public/com/fasterxml/jackson/jackson-bom/2.9.8/jackson-bom-2.9.8.pom (13 KB at 224.0 KB/sec)
Downloading: https://maven.wso2.org/nexus/content/repositories/releases/com/fasterxml/jackson/jackson-parent/2.9.1.2/jackson-parent-2.9.1.2.pom
Downloading: https://maven.wso2.org/nexus/content/groups/wso2-public/com/fasterxml/jackson/jackson-parent/2.9.1.2/jackson-parent-2.9.1.2.pom
Downloaded: https://maven.wso2.org/nexus/content/groups/wso2-public/com/fasterxml/jackson/jackson-parent/2.9.1.2/jackson-parent-2.9.1.2.pom (8 KB at 111.8 KB/sec)
Downloading: https://maven.wso2.org/nexus/content/repositories/releases/com/fasterxml/oss-parent/34/oss-parent-34.pom
Downloading: https://maven.wso2.org/nexus/content/groups/wso2-public/com/fasterxml/oss-parent/34/oss-parent-34.pom
Downloaded: https://maven.wso2.org/nexus/content/groups/wso2-public/com/fasterxml/oss-parent/34/oss-parent-34.pom (23 KB at 426.4 KB/sec)
Downloading: https://maven.wso2.org/nexus/content/repositories/releases/com/fasterxml/jackson/core/jackson-core/2.9.8/jackson-core-2.9.8.pom
Downloading: https://maven.wso2.org/nexus/content/groups/wso2-public/com/fasterxml/jackson/core/jackson-core/2.9.8/jackson-core-2.9.8.pom
Downloaded: https://maven.wso2.org/nexus/content/groups/wso2-public/com/fasterxml/jackson/core/jackson-core/2.9.8/jackson-core-2.9.8.pom (4 KB at 72.1 KB/sec)
Downloading: https://maven.wso2.org/nexus/content/repositories/releases/com/fasterxml/jackson/dataformat/jackson-dataformat-yaml/2.9.8/jackson-dataformat-yaml-2.9.8.pom
Downloading: https://maven.wso2.org/nexus/content/groups/wso2-public/com/fasterxml/jackson/dataformat/jackson-dataformat-yaml/2.9.8/jackson-dataformat-yaml-2.9.8.pom
Downloaded: https://maven.wso2.org/nexus/content/groups/wso2-public/com/fasterxml/jackson/dataformat/jackson-dataformat-yaml/2.9.8/jackson-dataformat-yaml-2.9.8.pom (3 KB at 38.3 KB/sec)
Downloading: https://maven.wso2.org/nexus/content/repositories/releases/com/fasterxml/jackson/dataformat/jackson-dataformats-text/2.9.8/jackson-dataformats-text-2.9.8.pom
Downloading: https://maven.wso2.org/nexus/content/groups/wso2-public/com/fasterxml/jackson/dataformat/jackson-dataformats-text/2.9.8/jackson-dataformats-text-2.9.8.pom
Downloaded: https://maven.wso2.org/nexus/content/groups/wso2-public/com/fasterxml/jackson/dataformat/jackson-dataformats-text/2.9.8/jackson-dataformats-text-2.9.8.pom (3 KB at 55.2 KB/sec)
Downloading: https://maven.wso2.org/nexus/content/repositories/releases/org/yaml/snakeyaml/1.23/snakeyaml-1.23.pom
Downloading: https://maven.wso2.org/nexus/content/groups/wso2-public/org/yaml/snakeyaml/1.23/snakeyaml-1.23.pom
Downloaded: https://maven.wso2.org/nexus/content/groups/wso2-public/org/yaml/snakeyaml/1.23/snakeyaml-1.23.pom (37 KB at 659.2 KB/sec)
Downloading: https://maven.wso2.org/nexus/content/repositories/releases/com/h2database/h2/1.4.199/h2-1.4.199.pom
Downloading: https://maven.wso2.org/nexus/content/groups/wso2-public/com/h2database/h2/1.4.199/h2-1.4.199.pom
Downloaded: https://maven.wso2.org/nexus/content/groups/wso2-public/com/h2database/h2/1.4.199/h2-1.4.199.pom (960 B at 17.0 KB/sec)
Downloading: https://maven.wso2.org/nexus/content/repositories/releases/org/ballerinalang/language-server-core/1.0.1/language-server-core-1.0.1.jar
Downloading: https://maven.wso2.org/nexus/content/repositories/releases/org/ballerinalang/annotations/1.0.1/annotations-1.0.1.jar
Downloading: https://maven.wso2.org/nexus/content/repositories/releases/org/ballerinalang/array/1.0.1/array-1.0.1.jar
Downloading: https://maven.wso2.org/nexus/content/repositories/releases/org/ballerinalang/decimal/1.0.1/decimal-1.0.1.jar
Downloading: https://maven.wso2.org/nexus/content/repositories/releases/org/ballerinalang/error/1.0.1/error-1.0.1.jar
Downloaded: https://maven.wso2.org/nexus/content/repositories/releases/org/ballerinalang/language-server-core/1.0.1/language-server-core-1.0.1.jar (674 KB at 11230.2 KB/sec)
Downloading: https://maven.wso2.org/nexus/content/repositories/releases/org/ballerinalang/floatingpoint/1.0.1/floatingpoint-1.0.1.jar
Downloaded: https://maven.wso2.org/nexus/content/repositories/releases/org/ballerinalang/annotations/1.0.1/annotations-1.0.1.jar (261 B at 3.6 KB/sec)
Downloading: https://maven.wso2.org/nexus/content/repositories/releases/org/ballerinalang/future/1.0.1/future-1.0.1.jar
Downloaded: https://maven.wso2.org/nexus/content/repositories/releases/org/ballerinalang/array/1.0.1/array-1.0.1.jar (30 KB at 401.1 KB/sec)
Downloading: https://maven.wso2.org/nexus/content/repositories/releases/org/ballerinalang/integer/1.0.1/integer-1.0.1.jar
Downloaded: https://maven.wso2.org/nexus/content/repositories/releases/org/ballerinalang/decimal/1.0.1/decimal-1.0.1.jar (10 KB at 123.2 KB/sec)
Downloading: https://maven.wso2.org/nexus/content/repositories/releases/org/ballerinalang/map/1.0.1/map-1.0.1.jar
Downloaded: https://maven.wso2.org/nexus/content/repositories/releases/org/ballerinalang/error/1.0.1/error-1.0.1.jar (7 KB at 86.2 KB/sec)
Downloading: https://maven.wso2.org/nexus/content/repositories/releases/org/ballerinalang/object/1.0.1/object-1.0.1.jar
Downloaded: https://maven.wso2.org/nexus/content/repositories/releases/org/ballerinalang/floatingpoint/1.0.1/floatingpoint-1.0.1.jar (27 KB at 1181.9 KB/sec)
Downloading: https://maven.wso2.org/nexus/content/repositories/releases/org/ballerinalang/stream/1.0.1/stream-1.0.1.jar
Downloaded: https://maven.wso2.org/nexus/content/repositories/releases/org/ballerinalang/map/1.0.1/map-1.0.1.jar (19 KB at 1438.0 KB/sec)
Downloading: https://maven.wso2.org/nexus/content/repositories/releases/org/ballerinalang/string/1.0.1/string-1.0.1.jar
Downloaded: https://maven.wso2.org/nexus/content/repositories/releases/org/ballerinalang/future/1.0.1/future-1.0.1.jar (4 KB at 87.2 KB/sec)
Downloading: https://maven.wso2.org/nexus/content/repositories/releases/org/ballerinalang/table/1.0.1/table-1.0.1.jar
Downloaded: https://maven.wso2.org/nexus/content/repositories/releases/org/ballerinalang/integer/1.0.1/integer-1.0.1.jar (9 KB at 250.1 KB/sec)
Downloading: https://maven.wso2.org/nexus/content/repositories/releases/org/ballerinalang/typedesc/1.0.1/typedesc-1.0.1.jar
Downloaded: https://maven.wso2.org/nexus/content/repositories/releases/org/ballerinalang/stream/1.0.1/stream-1.0.1.jar (5 KB at 129.7 KB/sec)
Downloading: https://maven.wso2.org/nexus/content/repositories/releases/org/ballerinalang/value/1.0.1/value-1.0.1.jar
Downloaded: https://maven.wso2.org/nexus/content/repositories/releases/org/ballerinalang/object/1.0.1/object-1.0.1.jar (261 B at 5.8 KB/sec)
Downloading: https://maven.wso2.org/nexus/content/repositories/releases/org/ballerinalang/xml/1.0.1/xml-1.0.1.jar
Downloaded: https://maven.wso2.org/nexus/content/repositories/releases/org/ballerinalang/value/1.0.1/value-1.0.1.jar (9 KB at 542.3 KB/sec)
Downloading: https://maven.wso2.org/nexus/content/repositories/releases/org/ballerinalang/ballerina-utils/1.0.1/ballerina-utils-1.0.1.jar
Downloaded: https://maven.wso2.org/nexus/content/repositories/releases/org/ballerinalang/string/1.0.1/string-1.0.1.jar (21 KB at 532.4 KB/sec)
Downloaded: https://maven.wso2.org/nexus/content/repositories/releases/org/ballerinalang/table/1.0.1/table-1.0.1.jar (11 KB at 445.5 KB/sec)
Downloading: https://maven.wso2.org/nexus/content/repositories/releases/org/ballerinalang/internal/1.0.1/internal-1.0.1.jar
Downloading: https://maven.wso2.org/nexus/content/repositories/releases/org/ballerinalang/openapi-to-ballerina-generator/1.0.1/openapi-to-ballerina-generator-1.0.1.jar
Downloaded: https://maven.wso2.org/nexus/content/repositories/releases/org/ballerinalang/typedesc/1.0.1/typedesc-1.0.1.jar (5 KB at 187.6 KB/sec)
Downloading: https://maven.wso2.org/nexus/content/repositories/releases/org/ballerinalang/ballerina-to-openapi-generator/1.0.1/ballerina-to-openapi-generator-1.0.1.jar
Downloaded: https://maven.wso2.org/nexus/content/repositories/releases/org/ballerinalang/xml/1.0.1/xml-1.0.1.jar (41 KB at 3127.7 KB/sec)
Downloading: https://maven.wso2.org/nexus/content/repositories/releases/org/ballerinalang/ballerina-auth/1.0.1/ballerina-auth-1.0.1.jar
Downloaded: https://maven.wso2.org/nexus/content/repositories/releases/org/ballerinalang/ballerina-utils/1.0.1/ballerina-utils-1.0.1.jar (15 KB at 642.5 KB/sec)
Downloading: https://maven.wso2.org/nexus/content/repositories/releases/org/ballerinalang/ballerina-runtime-api/1.0.1/ballerina-runtime-api-1.0.1.jar
Downloaded: https://maven.wso2.org/nexus/content/repositories/releases/org/ballerinalang/openapi-to-ballerina-generator/1.0.1/openapi-to-ballerina-generator-1.0.1.jar (73 KB at 2406.8 KB/sec)
Downloading: https://maven.wso2.org/nexus/content/repositories/releases/org/ballerinalang/ballerina-stringutils/1.0.1/ballerina-stringutils-1.0.1.jar
Downloaded: https://maven.wso2.org/nexus/content/repositories/releases/org/ballerinalang/ballerina-runtime-api/1.0.1/ballerina-runtime-api-1.0.1.jar (8 KB at 641.4 KB/sec)
Downloading: https://maven.wso2.org/nexus/content/repositories/releases/org/ballerinalang/ballerina-bir/1.0.1/ballerina-bir-1.0.1.jar
Downloaded: https://maven.wso2.org/nexus/content/repositories/releases/org/ballerinalang/internal/1.0.1/internal-1.0.1.jar (261 B at 6.7 KB/sec)
Downloading: https://maven.wso2.org/nexus/content/repositories/releases/org/ballerinalang/ballerina-cache/1.0.1/ballerina-cache-1.0.1.jar
Downloaded: https://maven.wso2.org/nexus/content/repositories/releases/org/ballerinalang/ballerina-stringutils/1.0.1/ballerina-stringutils-1.0.1.jar (261 B at 23.2 KB/sec)
Downloading: https://maven.wso2.org/nexus/content/repositories/releases/commons-logging/commons-logging/1.1.1/commons-logging-1.1.1.jar
Downloading: https://maven.wso2.org/nexus/content/repositories/releases/org/ballerinalang/ballerina-config-api/1.0.1/ballerina-config-api-1.0.1.jar
Downloaded: https://maven.wso2.org/nexus/content/repositories/releases/org/ballerinalang/ballerina-to-openapi-generator/1.0.1/ballerina-to-openapi-generator-1.0.1.jar (36 KB at 670.9 KB/sec)
Downloading: https://maven.wso2.org/nexus/content/repositories/releases/org/ballerinalang/ballerina-crypto/1.0.1/ballerina-crypto-1.0.1.jar
Downloaded: https://maven.wso2.org/nexus/content/repositories/releases/org/ballerinalang/ballerina-bir/1.0.1/ballerina-bir-1.0.1.jar (261 B at 6.5 KB/sec)
Downloaded: https://maven.wso2.org/nexus/content/repositories/releases/org/ballerinalang/ballerina-auth/1.0.1/ballerina-auth-1.0.1.jar (261 B at 3.9 KB/sec)
Downloading: https://maven.wso2.org/nexus/content/repositories/releases/org/ballerinalang/ballerina-jdbc/1.0.1/ballerina-jdbc-1.0.1.jar
Downloading: https://maven.wso2.org/nexus/content/repositories/releases/org/ballerinalang/ballerina-test-utils/1.0.1/ballerina-test-utils-1.0.1.jar
Downloaded: https://maven.wso2.org/nexus/content/repositories/releases/org/ballerinalang/ballerina-cache/1.0.1/ballerina-cache-1.0.1.jar (261 B at 5.4 KB/sec)
Downloading: https://maven.wso2.org/nexus/content/repositories/releases/org/javassist/javassist/3.24.1-GA/javassist-3.24.1-GA.jar
Downloaded: https://maven.wso2.org/nexus/content/repositories/releases/org/ballerinalang/ballerina-crypto/1.0.1/ballerina-crypto-1.0.1.jar (44 KB at 1390.2 KB/sec)
Downloading: https://maven.wso2.org/nexus/content/repositories/releases/com/zaxxer/HikariCP/3.3.1/HikariCP-3.3.1.jar
Downloading: https://maven.wso2.org/nexus/content/repositories/releases/org/ballerinalang/ballerina-java/1.0.1/ballerina-java-1.0.1.jar
Downloading: https://maven.wso2.org/nexus/content/repositories/releases/org/ballerinalang/ballerina-encoding/1.0.1/ballerina-encoding-1.0.1.jar
Downloaded: https://maven.wso2.org/nexus/content/repositories/releases/org/ballerinalang/ballerina-jdbc/1.0.1/ballerina-jdbc-1.0.1.jar (94 KB at 2922.2 KB/sec)
Downloading: https://maven.wso2.org/nexus/content/repositories/releases/org/ballerinalang/ballerina-file/1.0.1/ballerina-file-1.0.1.jar
Downloaded: https://maven.wso2.org/nexus/content/repositories/releases/org/ballerinalang/ballerina-config-api/1.0.1/ballerina-config-api-1.0.1.jar (6 KB at 63.3 KB/sec)
Downloading: https://maven.wso2.org/nexus/content/repositories/releases/org/ballerinalang/ballerina-filepath/1.0.1/ballerina-filepath-1.0.1.jar
Downloaded: https://maven.wso2.org/nexus/content/repositories/releases/org/ballerinalang/ballerina-file/1.0.1/ballerina-file-1.0.1.jar (22 KB at 573.3 KB/sec)
Downloading: https://maven.wso2.org/nexus/content/repositories/releases/org/ballerinalang/ballerina-grpc/1.0.1/ballerina-grpc-1.0.1.jar
Downloaded: https://maven.wso2.org/nexus/content/repositories/releases/org/ballerinalang/ballerina-java/1.0.1/ballerina-java-1.0.1.jar (10 KB at 177.4 KB/sec)
Downloading: https://maven.wso2.org/nexus/content/repositories/releases/com/google/protobuf/protobuf-java/3.9.1/protobuf-java-3.9.1.jar
Downloaded: https://maven.wso2.org/nexus/content/repositories/releases/org/ballerinalang/ballerina-filepath/1.0.1/ballerina-filepath-1.0.1.jar (8 KB at 440.9 KB/sec)
Downloading: https://maven.wso2.org/nexus/content/repositories/releases/com/github/jknack/handlebars/4.0.6/handlebars-4.0.6.jar
Downloading: https://maven.wso2.org/nexus/content/repositories/releases/org/mozilla/rhino/1.7R4/rhino-1.7R4.jar
Downloading: https://maven.wso2.org/nexus/content/repositories/releases/io/netty/netty-codec-http/4.1.39.Final/netty-codec-http-4.1.39.Final.jar
Downloaded: https://maven.wso2.org/nexus/content/repositories/releases/org/ballerinalang/ballerina-encoding/1.0.1/ballerina-encoding-1.0.1.jar (8 KB at 91.5 KB/sec)
Downloading: https://maven.wso2.org/nexus/content/repositories/releases/io/netty/netty-transport/4.1.39.Final/netty-transport-4.1.39.Final.jar
Downloaded: https://maven.wso2.org/nexus/content/repositories/releases/org/ballerinalang/ballerina-grpc/1.0.1/ballerina-grpc-1.0.1.jar (295 KB at 8647.3 KB/sec)
Downloading: https://maven.wso2.org/nexus/content/repositories/releases/io/netty/netty-codec/4.1.39.Final/netty-codec-4.1.39.Final.jar
Downloading: https://maven.wso2.org/nexus/content/repositories/releases/io/netty/netty-handler/4.1.39.Final/netty-handler-4.1.39.Final.jar
Downloading: https://maven.wso2.org/nexus/content/repositories/releases/org/wso2/transport/http/org.wso2.transport.http.netty/6.2.25/org.wso2.transport.http.netty-6.2.25.jar
Downloading: https://maven.wso2.org/nexus/content/repositories/releases/org/wso2/eclipse/osgi/org.eclipse.osgi/3.10.2.v20150203-1939/org.eclipse.osgi-3.10.2.v20150203-1939.jar
Downloading: https://maven.wso2.org/nexus/content/repositories/releases/org/wso2/eclipse/osgi/org.eclipse.osgi.services/3.4.0.v20140312-2051/org.eclipse.osgi.services-3.4.0.v20140312-2051.jar
Downloading: https://maven.wso2.org/nexus/content/repositories/releases/io/netty/netty-handler-proxy/4.1.39.Final/netty-handler-proxy-4.1.39.Final.jar
Downloaded: https://maven.wso2.org/nexus/content/repositories/releases/org/wso2/eclipse/osgi/org.eclipse.osgi.services/3.4.0.v20140312-2051/org.eclipse.osgi.services-3.4.0.v20140312-2051.jar (89 KB at 1446.9 KB/sec)
Downloading: https://maven.wso2.org/nexus/content/repositories/releases/io/netty/netty-codec-socks/4.1.39.Final/netty-codec-socks-4.1.39.Final.jar
Downloading: https://maven.wso2.org/nexus/content/repositories/releases/io/netty/netty-codec-http2/4.1.39.Final/netty-codec-http2-4.1.39.Final.jar
Downloading: https://maven.wso2.org/nexus/content/repositories/releases/io/netty/netty-resolver/4.1.39.Final/netty-resolver-4.1.39.Final.jar
Downloaded: https://maven.wso2.org/nexus/content/repositories/releases/org/wso2/transport/http/org.wso2.transport.http.netty/6.2.25/org.wso2.transport.http.netty-6.2.25.jar (477 KB at 3973.0 KB/sec)
Downloading: https://maven.wso2.org/nexus/content/repositories/releases/commons-pool/wso2/commons-pool/1.5.6.wso2v1/commons-pool-1.5.6.wso2v1.jar
Downloaded: https://maven.wso2.org/nexus/content/repositories/releases/org/wso2/eclipse/osgi/org.eclipse.osgi/3.10.2.v20150203-1939/org.eclipse.osgi-3.10.2.v20150203-1939.jar (1234 KB at 12463.5 KB/sec)
Downloading: https://maven.wso2.org/nexus/content/repositories/releases/commons-pool/commons-pool/1.5.6/commons-pool-1.5.6.jar
Downloading: https://maven.wso2.org/nexus/content/repositories/releases/org/wso2/orbit/org/yaml/snakeyaml/1.16.0.wso2v1/snakeyaml-1.16.0.wso2v1.jar
Downloading: https://maven.wso2.org/nexus/content/repositories/releases/io/netty/netty-tcnative-boringssl-static/2.0.25.Final/netty-tcnative-boringssl-static-2.0.25.Final.jar
Downloading: https://maven.wso2.org/nexus/content/repositories/releases/org/ballerinalang/ballerina-http/1.0.1/ballerina-http-1.0.1.jar
Downloading: https://maven.wso2.org/nexus/content/repositories/releases/org/wso2/carbon/messaging/org.wso2.carbon.messaging/2.3.7/org.wso2.carbon.messaging-2.3.7.jar
Downloading: https://maven.wso2.org/nexus/content/repositories/releases/org/wso2/carbon/org.wso2.carbon.launcher/5.2.0-m3/org.wso2.carbon.launcher-5.2.0-m3.jar
Downloaded: https://maven.wso2.org/nexus/content/repositories/releases/org/wso2/orbit/org/yaml/snakeyaml/1.16.0.wso2v1/snakeyaml-1.16.0.wso2v1.jar (261 KB at 3954.3 KB/sec)
Downloading: https://maven.wso2.org/nexus/content/repositories/releases/org/osgi/org.osgi.core/6.0.0/org.osgi.core-6.0.0.jar
Downloaded: https://maven.wso2.org/nexus/content/repositories/releases/org/wso2/carbon/messaging/org.wso2.carbon.messaging/2.3.7/org.wso2.carbon.messaging-2.3.7.jar (45 KB at 827.0 KB/sec)
Downloading: https://maven.wso2.org/nexus/content/repositories/releases/org/wso2/carbon/org.wso2.carbon.kernel.feature/5.2.0-m3/org.wso2.carbon.kernel.feature-5.2.0-m3.zip
Downloading: https://maven.wso2.org/nexus/content/repositories/releases/org/wso2/carbon/org.wso2.carbon.core/5.2.0-m3/org.wso2.carbon.core-5.2.0-m3.jar
Downloaded: https://maven.wso2.org/nexus/content/repositories/releases/org/ballerinalang/ballerina-http/1.0.1/ballerina-http-1.0.1.jar (279 KB at 3166.2 KB/sec)
Downloading: https://maven.wso2.org/nexus/content/repositories/releases/org/wso2/carbon/org.wso2.carbon.tools.core/5.2.0-m3/org.wso2.carbon.tools.core-5.2.0-m3.jar
Downloaded: https://maven.wso2.org/nexus/content/repositories/releases/org/wso2/carbon/org.wso2.carbon.launcher/5.2.0-m3/org.wso2.carbon.launcher-5.2.0-m3.jar (44 KB at 812.2 KB/sec)
Downloading: https://maven.wso2.org/nexus/content/repositories/releases/org/json/wso2/json/3.0.0.wso2v1/json-3.0.0.wso2v1.jar
Downloaded: https://maven.wso2.org/nexus/content/repositories/releases/org/wso2/carbon/org.wso2.carbon.tools.core/5.2.0-m3/org.wso2.carbon.tools.core-5.2.0-m3.jar (34 KB at 3070.9 KB/sec)
Downloading: https://maven.wso2.org/nexus/content/repositories/releases/org/json/json/20140107/json-20140107.jar
Downloaded: https://maven.wso2.org/nexus/content/repositories/releases/org/wso2/carbon/org.wso2.carbon.kernel.feature/5.2.0-m3/org.wso2.carbon.kernel.feature-5.2.0-m3.zip (973 KB at 22613.7 KB/sec)
Downloading: https://maven.wso2.org/nexus/content/repositories/releases/org/wso2/carbon/org.wso2.carbon.runtime.feature/5.2.0-m3/org.wso2.carbon.runtime.feature-5.2.0-m3.zip
Downloading: https://maven.wso2.org/nexus/content/repositories/releases/org/wso2/eclipse/equinox/org.eclipse.equinox.launcher.gtk.linux.x86/1.1.400.v20160518-1444/org.eclipse.equinox.launcher.gtk.linux.x86-1.1.400.v20160518-1444.jar
Downloaded: https://maven.wso2.org/nexus/content/repositories/releases/org/json/wso2/json/3.0.0.wso2v1/json-3.0.0.wso2v1.jar (64 KB at 5329.8 KB/sec)
Downloading: https://maven.wso2.org/nexus/content/repositories/releases/org/wso2/eclipse/equinox/org.eclipse.equinox.common/3.8.0.v20160509-1230/org.eclipse.equinox.common-3.8.0.v20160509-1230.jar
Downloaded: https://maven.wso2.org/nexus/content/repositories/releases/org/wso2/eclipse/equinox/org.eclipse.equinox.common/3.8.0.v20160509-1230/org.eclipse.equinox.common-3.8.0.v20160509-1230.jar (118 KB at 6534.0 KB/sec)
Downloading: https://maven.wso2.org/nexus/content/repositories/releases/org/wso2/eclipse/equinox/org.eclipse.equinox.simpleconfigurator/1.1.200.v20160504-1450/org.eclipse.equinox.simpleconfigurator-1.1.200.v20160504-1450.jar
Downloaded: https://maven.wso2.org/nexus/content/repositories/releases/org/wso2/carbon/org.wso2.carbon.core/5.2.0-m3/org.wso2.carbon.core-5.2.0-m3.jar (167 KB at 2560.8 KB/sec)
Downloading: https://maven.wso2.org/nexus/content/repositories/releases/org/wso2/eclipse/equinox/org.eclipse.equinox.util/1.0.500.v20130404-1337/org.eclipse.equinox.util-1.0.500.v20130404-1337.jar
Downloaded: https://maven.wso2.org/nexus/content/repositories/releases/org/wso2/eclipse/equinox/org.eclipse.equinox.simpleconfigurator/1.1.200.v20160504-1450/org.eclipse.equinox.simpleconfigurator-1.1.200.v20160504-1450.jar (44 KB at 3098.8 KB/sec)
Downloading: https://maven.wso2.org/nexus/content/repositories/releases/org/wso2/eclipse/equinox/org.eclipse.equinox.ds/1.4.400.v20160226-2036/org.eclipse.equinox.ds-1.4.400.v20160226-2036.jar
Downloaded: https://maven.wso2.org/nexus/content/repositories/releases/org/wso2/eclipse/equinox/org.eclipse.equinox.util/1.0.500.v20130404-1337/org.eclipse.equinox.util-1.0.500.v20130404-1337.jar (76 KB at 5414.8 KB/sec)
Downloading: https://maven.wso2.org/nexus/content/repositories/releases/org/wso2/eclipse/equinox/org.eclipse.equinox.launcher/1.3.200.v20160318-1642/org.eclipse.equinox.launcher-1.3.200.v20160318-1642.jar
Downloaded: https://maven.wso2.org/nexus/content/repositories/releases/org/wso2/eclipse/equinox/org.eclipse.equinox.launcher/1.3.200.v20160318-1642/org.eclipse.equinox.launcher-1.3.200.v20160318-1642.jar (51 KB at 3365.2 KB/sec)
Downloading: https://maven.wso2.org/nexus/content/repositories/releases/org/wso2/eclipse/equinox/org.eclipse.equinox.concurrent/1.1.0.v20130327-1442/org.eclipse.equinox.concurrent-1.1.0.v20130327-1442.jar
Downloaded: https://maven.wso2.org/nexus/content/repositories/releases/org/wso2/eclipse/equinox/org.eclipse.equinox.ds/1.4.400.v20160226-2036/org.eclipse.equinox.ds-1.4.400.v20160226-2036.jar (193 KB at 9614.0 KB/sec)
Downloading: https://maven.wso2.org/nexus/content/repositories/releases/org/wso2/eclipse/equinox/org.eclipse.equinox.frameworkadmin/2.0.300.v20160504-1450/org.eclipse.equinox.frameworkadmin-2.0.300.v20160504-1450.jar
Downloaded: https://maven.wso2.org/nexus/content/repositories/releases/org/wso2/eclipse/equinox/org.eclipse.equinox.launcher.gtk.linux.x86/1.1.400.v20160518-1444/org.eclipse.equinox.launcher.gtk.linux.x86-1.1.400.v20160518-1444.jar (79 KB at 1310.8 KB/sec)
Downloading: https://maven.wso2.org/nexus/content/repositories/releases/org/wso2/eclipse/equinox/org.eclipse.equinox.frameworkadmin.equinox/1.0.700.v20160102-2223/org.eclipse.equinox.frameworkadmin.equinox-1.0.700.v20160102-2223.jar
Downloaded: https://maven.wso2.org/nexus/content/repositories/releases/org/wso2/eclipse/equinox/org.eclipse.equinox.concurrent/1.1.0.v20130327-1442/org.eclipse.equinox.concurrent-1.1.0.v20130327-1442.jar (25 KB at 2065.8 KB/sec)
Downloading: https://maven.wso2.org/nexus/content/repositories/releases/org/wso2/eclipse/equinox/org.eclipse.equinox.console/1.1.200.v20150929-1405/org.eclipse.equinox.console-1.1.200.v20150929-1405.jar
Downloaded: https://maven.wso2.org/nexus/content/repositories/releases/org/wso2/eclipse/equinox/org.eclipse.equinox.frameworkadmin/2.0.300.v20160504-1450/org.eclipse.equinox.frameworkadmin-2.0.300.v20160504-1450.jar (37 KB at 2436.7 KB/sec)
Downloading: https://maven.wso2.org/nexus/content/repositories/releases/org/apache/felix/org.apache.felix.gogo.command/0.10.0.v201209301215/org.apache.felix.gogo.command-0.10.0.v201209301215.jar
Downloaded: https://maven.wso2.org/nexus/content/repositories/releases/org/wso2/eclipse/equinox/org.eclipse.equinox.frameworkadmin.equinox/1.0.700.v20160102-2223/org.eclipse.equinox.frameworkadmin.equinox-1.0.700.v20160102-2223.jar (64 KB at 3712.6 KB/sec)
Downloading: https://maven.wso2.org/nexus/content/repositories/releases/org/apache/felix/org.apache.felix.gogo.shell/0.10.0.v201212101605/org.apache.felix.gogo.shell-0.10.0.v201212101605.jar
Downloading: https://maven.wso2.org/nexus/content/repositories/releases/org/apache/felix/org.apache.felix.gogo.runtime/0.10.0.v201209301036/org.apache.felix.gogo.runtime-0.10.0.v201209301036.jar
Downloading: https://maven.wso2.org/nexus/content/repositories/releases/org/ops4j/pax/logging/pax-logging-api/1.9.0/pax-logging-api-1.9.0.jar
Downloaded: https://maven.wso2.org/nexus/content/repositories/releases/org/wso2/eclipse/equinox/org.eclipse.equinox.console/1.1.200.v20150929-1405/org.eclipse.equinox.console-1.1.200.v20150929-1405.jar (118 KB at 6196.5 KB/sec)
Downloading: https://maven.wso2.org/nexus/content/repositories/releases/org/ops4j/pax/logging/pax-logging-log4j2/1.9.0/pax-logging-log4j2-1.9.0.jar
Downloading: https://maven.wso2.org/nexus/content/repositories/releases/org/wso2/eclipse/equinox/org.eclipse.equinox.cm/1.1.200.v20160324-1850/org.eclipse.equinox.cm-1.1.200.v20160324-1850.jar
Downloading: https://maven.wso2.org/nexus/content/repositories/releases/org/wso2/eclipse/equinox/org.eclipse.equinox.preferences/3.6.0.v20160120-1756/org.eclipse.equinox.preferences-3.6.0.v20160120-1756.jar
Downloading: https://maven.wso2.org/nexus/content/repositories/releases/org/wso2/eclipse/equinox/org.eclipse.equinox.simpleconfigurator.manipulator/2.0.200.v20160504-1450/org.eclipse.equinox.simpleconfigurator.manipulator-2.0.200.v20160504-1450.jar
Downloaded: https://maven.wso2.org/nexus/content/repositories/releases/org/wso2/eclipse/equinox/org.eclipse.equinox.cm/1.1.200.v20160324-1850/org.eclipse.equinox.cm-1.1.200.v20160324-1850.jar (73 KB at 1313.3 KB/sec)
Downloading: https://maven.wso2.org/nexus/content/repositories/releases/org/wso2/eclipse/osgi/org.eclipse.osgi.compatibility.state/1.0.200.v20160504-1419/org.eclipse.osgi.compatibility.state-1.0.200.v20160504-1419.jar
Downloaded: https://maven.wso2.org/nexus/content/repositories/releases/org/wso2/carbon/org.wso2.carbon.runtime.feature/5.2.0-m3/org.wso2.carbon.runtime.feature-5.2.0-m3.zip (4134 KB at 27015.1 KB/sec)
Downloading: https://maven.wso2.org/nexus/content/repositories/releases/org/jvnet/mimepull/mimepull/1.9.11/mimepull-1.9.11.jar
Downloading: https://maven.wso2.org/nexus/content/repositories/releases/org/bouncycastle/bcprov-jdk15on/1.61/bcprov-jdk15on-1.61.jar
Downloaded: https://maven.wso2.org/nexus/content/repositories/releases/org/wso2/eclipse/osgi/org.eclipse.osgi.compatibility.state/1.0.200.v20160504-1419/org.eclipse.osgi.compatibility.state-1.0.200.v20160504-1419.jar (239 KB at 11348.7 KB/sec)
Downloading: https://maven.wso2.org/nexus/content/repositories/releases/org/bouncycastle/bcpkix-jdk15on/1.61/bcpkix-jdk15on-1.61.jar
Downloading: https://maven.wso2.org/nexus/content/repositories/releases/org/ballerinalang/ballerina-io/1.0.1/ballerina-io-1.0.1.jar
Downloaded: https://maven.wso2.org/nexus/content/repositories/releases/org/wso2/eclipse/equinox/org.eclipse.equinox.simpleconfigurator.manipulator/2.0.200.v20160504-1450/org.eclipse.equinox.simpleconfigurator.manipulator-2.0.200.v20160504-1450.jar (26 KB at 477.1 KB/sec)
Downloading: https://maven.wso2.org/nexus/content/repositories/releases/org/ballerinalang/ballerina-jwt/1.0.1/ballerina-jwt-1.0.1.jar
Downloaded: https://maven.wso2.org/nexus/content/repositories/releases/org/wso2/eclipse/equinox/org.eclipse.equinox.preferences/3.6.0.v20160120-1756/org.eclipse.equinox.preferences-3.6.0.v20160120-1756.jar (130 KB at 2096.6 KB/sec)
Downloading: https://maven.wso2.org/nexus/content/repositories/releases/org/ballerinalang/ballerina-ldap/1.0.1/ballerina-ldap-1.0.1.jar
Downloaded: https://maven.wso2.org/nexus/content/repositories/releases/org/ballerinalang/ballerina-jwt/1.0.1/ballerina-jwt-1.0.1.jar (261 B at 19.6 KB/sec)
Downloading: https://maven.wso2.org/nexus/content/repositories/releases/org/ballerinalang/ballerina-log-api/1.0.1/ballerina-log-api-1.0.1.jar
Downloading: https://maven.wso2.org/nexus/content/repositories/releases/org/ballerinalang/ballerina-math/1.0.1/ballerina-math-1.0.1.jar
Downloaded: https://maven.wso2.org/nexus/content/repositories/releases/org/ballerinalang/ballerina-ldap/1.0.1/ballerina-ldap-1.0.1.jar (27 KB at 1396.3 KB/sec)
Downloading: https://maven.wso2.org/nexus/content/repositories/releases/org/ballerinalang/ballerina-rabbitmq/1.0.1/ballerina-rabbitmq-1.0.1.jar
Downloaded: https://maven.wso2.org/nexus/content/repositories/releases/org/ballerinalang/ballerina-log-api/1.0.1/ballerina-log-api-1.0.1.jar (11 KB at 904.9 KB/sec)
Downloading: https://maven.wso2.org/nexus/content/repositories/releases/com/rabbitmq/amqp-client/5.6.0/amqp-client-5.6.0.jar
Downloading: https://maven.wso2.org/nexus/content/repositories/releases/org/ballerinalang/ballerina-mime/1.0.1/ballerina-mime-1.0.1.jar
Downloaded: https://maven.wso2.org/nexus/content/repositories/releases/org/ballerinalang/ballerina-io/1.0.1/ballerina-io-1.0.1.jar (110 KB at 1192.5 KB/sec)
Downloading: https://maven.wso2.org/nexus/content/repositories/releases/org/ballerinalang/ballerina-nats/1.0.1/ballerina-nats-1.0.1.jar
Downloaded: https://maven.wso2.org/nexus/content/repositories/releases/org/ballerinalang/ballerina-math/1.0.1/ballerina-math-1.0.1.jar (35 KB at 557.6 KB/sec)
Downloading: https://maven.wso2.org/nexus/content/repositories/releases/io/nats/java-nats-streaming/2.2.1/java-nats-streaming-2.2.1.jar
Downloading: https://maven.wso2.org/nexus/content/repositories/releases/net/i2p/crypto/eddsa/0.3.0/eddsa-0.3.0.jar
Downloaded: https://maven.wso2.org/nexus/content/repositories/releases/org/ballerinalang/ballerina-rabbitmq/1.0.1/ballerina-rabbitmq-1.0.1.jar (71 KB at 1136.8 KB/sec)
Downloading: https://maven.wso2.org/nexus/content/repositories/releases/org/ballerinalang/ballerina-oauth2/1.0.1/ballerina-oauth2-1.0.1.jar
Downloaded: https://maven.wso2.org/nexus/content/repositories/releases/org/ballerinalang/ballerina-mime/1.0.1/ballerina-mime-1.0.1.jar (70 KB at 1127.6 KB/sec)
Downloading: https://maven.wso2.org/nexus/content/repositories/releases/org/ballerinalang/ballerina-observability/1.0.1/ballerina-observability-1.0.1.jar
Downloaded: https://maven.wso2.org/nexus/content/repositories/releases/org/ballerinalang/ballerina-observability/1.0.1/ballerina-observability-1.0.1.jar (34 KB at 2366.0 KB/sec)
Downloading: https://maven.wso2.org/nexus/content/repositories/releases/org/ballerinalang/ballerina-metrics-extension/1.0.1/ballerina-metrics-extension-1.0.1.jar
Downloaded: https://maven.wso2.org/nexus/content/repositories/releases/org/ballerinalang/ballerina-nats/1.0.1/ballerina-nats-1.0.1.jar (61 KB at 1832.5 KB/sec)
Downloading: https://maven.wso2.org/nexus/content/repositories/releases/org/hdrhistogram/HdrHistogram/2.1.11/HdrHistogram-2.1.11.jar
Downloaded: https://maven.wso2.org/nexus/content/repositories/releases/org/ballerinalang/ballerina-oauth2/1.0.1/ballerina-oauth2-1.0.1.jar (261 B at 10.6 KB/sec)
Downloading: https://maven.wso2.org/nexus/content/repositories/releases/org/ballerinalang/ballerina-openapi/1.0.1/ballerina-openapi-1.0.1.jar
Downloading: https://maven.wso2.org/nexus/content/repositories/releases/org/ballerinalang/ballerina-reflect/1.0.1/ballerina-reflect-1.0.1.jar
Downloading: https://maven.wso2.org/nexus/content/repositories/releases/org/ballerinalang/ballerina-socket/1.0.1/ballerina-socket-1.0.1.jar
Downloaded: https://maven.wso2.org/nexus/content/repositories/releases/org/ballerinalang/ballerina-metrics-extension/1.0.1/ballerina-metrics-extension-1.0.1.jar (10 KB at 466.7 KB/sec)
Downloading: https://maven.wso2.org/nexus/content/repositories/releases/org/ballerinalang/lib-creator/1.0.1/lib-creator-1.0.1.jar
Downloaded: https://maven.wso2.org/nexus/content/repositories/releases/org/ballerinalang/lib-creator/1.0.1/lib-creator-1.0.1.jar (5 KB at 362.2 KB/sec)
Downloading: https://maven.wso2.org/nexus/content/repositories/releases/org/ballerinalang/ballerina-streams/1.0.1/ballerina-streams-1.0.1.jar
Downloaded: https://maven.wso2.org/nexus/content/repositories/releases/org/ballerinalang/ballerina-openapi/1.0.1/ballerina-openapi-1.0.1.jar (261 B at 7.5 KB/sec)
Downloading: https://maven.wso2.org/nexus/content/repositories/releases/org/ballerinalang/ballerina-system/1.0.1/ballerina-system-1.0.1.jar
Downloaded: https://maven.wso2.org/nexus/content/repositories/releases/org/ballerinalang/ballerina-test-utils/1.0.1/ballerina-test-utils-1.0.1.jar (19365 KB at 27506.1 KB/sec)
Downloading: https://maven.wso2.org/nexus/content/repositories/releases/org/ballerinalang/ballerina-task/1.0.1/ballerina-task-1.0.1.jar
Downloaded: https://maven.wso2.org/nexus/content/repositories/releases/org/ballerinalang/ballerina-reflect/1.0.1/ballerina-reflect-1.0.1.jar (6 KB at 96.7 KB/sec)
Downloading: https://maven.wso2.org/nexus/content/repositories/releases/org/quartz-scheduler/quartz/2.3.1/quartz-2.3.1.jar
Downloaded: https://maven.wso2.org/nexus/content/repositories/releases/org/ballerinalang/ballerina-streams/1.0.1/ballerina-streams-1.0.1.jar (5 KB at 179.5 KB/sec)
Downloading: https://maven.wso2.org/nexus/content/repositories/releases/com/mchange/c3p0/0.9.5.3/c3p0-0.9.5.3.jar
Downloading: https://maven.wso2.org/nexus/content/repositories/releases/com/mchange/mchange-commons-java/0.2.15/mchange-commons-java-0.2.15.jar
Downloading: https://maven.wso2.org/nexus/content/repositories/releases/com/zaxxer/HikariCP-java7/2.4.13/HikariCP-java7-2.4.13.jar
Downloaded: https://maven.wso2.org/nexus/content/repositories/releases/org/ballerinalang/ballerina-system/1.0.1/ballerina-system-1.0.1.jar (17 KB at 564.2 KB/sec)
Downloading: https://maven.wso2.org/nexus/content/repositories/releases/org/ballerinalang/ballerina-time/1.0.1/ballerina-time-1.0.1.jar
Downloaded: https://maven.wso2.org/nexus/content/repositories/releases/org/ballerinalang/ballerina-socket/1.0.1/ballerina-socket-1.0.1.jar (61 KB at 1054.4 KB/sec)
Downloading: https://maven.wso2.org/nexus/content/repositories/releases/org/ballerinalang/ballerina-transactions/1.0.1/ballerina-transactions-1.0.1.jar
Downloaded: https://maven.wso2.org/nexus/content/repositories/releases/org/ballerinalang/ballerina-task/1.0.1/ballerina-task-1.0.1.jar (32 KB at 1493.3 KB/sec)
Downloading: https://maven.wso2.org/nexus/content/repositories/releases/org/ballerinalang/testerina-core/1.0.1/testerina-core-1.0.1.jar
Downloaded: https://maven.wso2.org/nexus/content/repositories/releases/org/ballerinalang/ballerina-transactions/1.0.1/ballerina-transactions-1.0.1.jar (20 KB at 886.7 KB/sec)
Downloading: https://maven.wso2.org/nexus/content/repositories/releases/org/ballerinalang/ballerina-core/1.0.1/ballerina-core-1.0.1.jar
Downloading: https://maven.wso2.org/nexus/content/repositories/releases/org/apache/geronimo/specs/geronimo-stax-api_1.0_spec/1.0.1/geronimo-stax-api_1.0_spec-1.0.1.jar
Downloading: https://maven.wso2.org/nexus/content/repositories/releases/org/wso2/staxon/staxon-core/1.2.0.wso2v2/staxon-core-1.2.0.wso2v2.jar
Downloaded: https://maven.wso2.org/nexus/content/repositories/releases/org/ballerinalang/testerina-core/1.0.1/testerina-core-1.0.1.jar (50 KB at 1228.4 KB/sec)
Downloading: https://maven.wso2.org/nexus/content/repositories/releases/org/wso2/staxon/staxon/1.2.0-wso2v2/staxon-1.2.0-wso2v2.jar
Downloading: https://maven.wso2.org/nexus/content/repositories/releases/javax/transaction/javax.transaction-api/1.3/javax.transaction-api-1.3.jar
Downloaded: https://maven.wso2.org/nexus/content/repositories/releases/org/ballerinalang/ballerina-time/1.0.1/ballerina-time-1.0.1.jar (25 KB at 397.5 KB/sec)
Downloading: https://maven.wso2.org/nexus/content/repositories/releases/io/ballerina/messaging/broker-common/0.970.5/broker-common-0.970.5.jar
Downloaded: https://maven.wso2.org/nexus/content/repositories/releases/org/ballerinalang/ballerina-core/1.0.1/ballerina-core-1.0.1.jar (301 KB at 5101.7 KB/sec)
Downloading: https://maven.wso2.org/nexus/content/repositories/releases/org/wso2/carbon/config/org.wso2.carbon.config/2.1.5/org.wso2.carbon.config-2.1.5.jar
Downloading: https://maven.wso2.org/nexus/content/repositories/releases/org/wso2/carbon/secvault/org.wso2.carbon.secvault/5.0.8/org.wso2.carbon.secvault-5.0.8.jar
Downloading: https://maven.wso2.org/nexus/content/repositories/releases/org/wso2/carbon/utils/org.wso2.carbon.utils/2.0.2/org.wso2.carbon.utils-2.0.2.jar
Downloading: https://maven.wso2.org/nexus/content/repositories/releases/io/ballerina/messaging/broker-core/0.970.5/broker-core-0.970.5.jar
Downloaded: https://maven.wso2.org/nexus/content/repositories/releases/io/ballerina/messaging/broker-common/0.970.5/broker-common-0.970.5.jar (46 KB at 543.1 KB/sec)
Downloading: https://maven.wso2.org/nexus/content/repositories/releases/io/ballerina/messaging/broker-auth/0.970.5/broker-auth-0.970.5.jar
Downloaded: https://maven.wso2.org/nexus/content/repositories/releases/org/wso2/carbon/utils/org.wso2.carbon.utils/2.0.2/org.wso2.carbon.utils-2.0.2.jar (21 KB at 383.5 KB/sec)
Downloading: https://maven.wso2.org/nexus/content/repositories/releases/io/ballerina/messaging/broker-coordination/0.970.5/broker-coordination-0.970.5.jar
Downloaded: https://maven.wso2.org/nexus/content/repositories/releases/org/wso2/carbon/config/org.wso2.carbon.config/2.1.5/org.wso2.carbon.config-2.1.5.jar (38 KB at 665.7 KB/sec)
Downloading: https://maven.wso2.org/nexus/content/repositories/releases/io/ballerina/messaging/broker-rest-runner/0.970.5/broker-rest-runner-0.970.5.jar
Downloaded: https://maven.wso2.org/nexus/content/repositories/releases/org/wso2/carbon/secvault/org.wso2.carbon.secvault/5.0.8/org.wso2.carbon.secvault-5.0.8.jar (47 KB at 709.6 KB/sec)
Downloading: https://maven.wso2.org/nexus/content/repositories/releases/org/wso2/msf4j/msf4j-core/2.6.1/msf4j-core-2.6.1.jar
Downloaded: https://maven.wso2.org/nexus/content/repositories/releases/io/ballerina/messaging/broker-core/0.970.5/broker-core-0.970.5.jar (295 KB at 3822.5 KB/sec)
Downloading: https://maven.wso2.org/nexus/content/repositories/releases/javax/ws/rs/javax.ws.rs-api/2.0/javax.ws.rs-api-2.0.jar
Downloading: https://maven.wso2.org/nexus/content/repositories/releases/org/wso2/msf4j/jaxrs-delegates/2.6.1/jaxrs-delegates-2.6.1.jar
Downloaded: https://maven.wso2.org/nexus/content/repositories/releases/io/ballerina/messaging/broker-coordination/0.970.5/broker-coordination-0.970.5.jar (38 KB at 916.3 KB/sec)
Downloading: https://maven.wso2.org/nexus/content/repositories/releases/org/apache/httpcomponents/httpclient/4.5.2/httpclient-4.5.2.jar
Downloading: https://maven.wso2.org/nexus/content/repositories/releases/org/apache/httpcomponents/httpcore/4.4.4/httpcore-4.4.4.jar
Downloaded: https://maven.wso2.org/nexus/content/repositories/releases/org/wso2/msf4j/msf4j-core/2.6.1/msf4j-core-2.6.1.jar (242 KB at 6046.9 KB/sec)
Downloading: https://maven.wso2.org/nexus/content/repositories/releases/commons-codec/commons-codec/1.9/commons-codec-1.9.jar
Downloading: https://maven.wso2.org/nexus/content/repositories/releases/com/nimbusds/nimbus-jose-jwt/2.25/nimbus-jose-jwt-2.25.jar
Downloaded: https://maven.wso2.org/nexus/content/repositories/releases/io/ballerina/messaging/broker-auth/0.970.5/broker-auth-0.970.5.jar (101 KB at 1568.2 KB/sec)
Downloading: https://maven.wso2.org/nexus/content/repositories/releases/net/jcip/jcip-annotations/1.0/jcip-annotations-1.0.jar
Downloaded: https://maven.wso2.org/nexus/content/repositories/releases/io/ballerina/messaging/broker-rest-runner/0.970.5/broker-rest-runner-0.970.5.jar (27 KB at 447.5 KB/sec)
Downloading: https://maven.wso2.org/nexus/content/repositories/releases/net/minidev/json-smart/1.1.1/json-smart-1.1.1.jar
Downloading: https://maven.wso2.org/nexus/content/repositories/releases/commons-io/wso2/commons-io/2.4.0.wso2v1/commons-io-2.4.0.wso2v1.jar
Downloading: https://maven.wso2.org/nexus/content/repositories/releases/io/ballerina/messaging/broker-metrics/0.970.5/broker-metrics-0.970.5.jar
Downloading: https://maven.wso2.org/nexus/content/repositories/releases/org/wso2/carbon/metrics/org.wso2.carbon.metrics.core/2.3.7/org.wso2.carbon.metrics.core-2.3.7.jar
Downloading: https://maven.wso2.org/nexus/content/repositories/releases/io/dropwizard/metrics/metrics-core/3.2.5/metrics-core-3.2.5.jar
Downloaded: https://maven.wso2.org/nexus/content/repositories/releases/commons-io/wso2/commons-io/2.4.0.wso2v1/commons-io-2.4.0.wso2v1.jar (178 KB at 3051.9 KB/sec)
Downloading: https://maven.wso2.org/nexus/content/repositories/releases/io/dropwizard/metrics/metrics-jvm/3.2.5/metrics-jvm-3.2.5.jar
Downloading: https://maven.wso2.org/nexus/content/repositories/releases/com/google/guava/guava/23.0/guava-23.0.jar
Downloaded: https://maven.wso2.org/nexus/content/repositories/releases/org/wso2/msf4j/jaxrs-delegates/2.6.1/jaxrs-delegates-2.6.1.jar (21 KB at 228.3 KB/sec)
Downloading: https://maven.wso2.org/nexus/content/repositories/releases/com/google/errorprone/error_prone_annotations/2.0.18/error_prone_annotations-2.0.18.jar
Downloading: https://maven.wso2.org/nexus/content/repositories/releases/com/google/j2objc/j2objc-annotations/1.1/j2objc-annotations-1.1.jar
Downloaded: https://maven.wso2.org/nexus/content/repositories/releases/io/ballerina/messaging/broker-metrics/0.970.5/broker-metrics-0.970.5.jar (11 KB at 142.7 KB/sec)
Downloading: https://maven.wso2.org/nexus/content/repositories/releases/org/codehaus/mojo/animal-sniffer-annotations/1.14/animal-sniffer-annotations-1.14.jar
Downloading: https://maven.wso2.org/nexus/content/repositories/releases/org/wso2/orbit/com/lmax/disruptor/3.3.7.wso2v1/disruptor-3.3.7.wso2v1.jar
Downloading: https://maven.wso2.org/nexus/content/repositories/releases/info/picocli/picocli/4.0.1/picocli-4.0.1.jar
Downloaded: https://maven.wso2.org/nexus/content/repositories/releases/org/wso2/carbon/metrics/org.wso2.carbon.metrics.core/2.3.7/org.wso2.carbon.metrics.core-2.3.7.jar (116 KB at 1644.2 KB/sec)
Downloading: https://maven.wso2.org/nexus/content/repositories/releases/org/testng/testng/6.14.3/testng-6.14.3.jar
Downloading: https://maven.wso2.org/nexus/content/repositories/releases/com/beust/jcommander/1.72/jcommander-1.72.jar
Downloading: https://maven.wso2.org/nexus/content/repositories/releases/org/apache-extras/beanshell/bsh/2.0b6/bsh-2.0b6.jar
Downloading: https://maven.wso2.org/nexus/content/repositories/releases/org/ballerinalang/ballerina-tool/1.0.1/ballerina-tool-1.0.1.jar
Downloading: https://maven.wso2.org/nexus/content/repositories/releases/com/fasterxml/jackson/core/jackson-databind/2.9.8/jackson-databind-2.9.8.jar
Downloading: https://maven.wso2.org/nexus/content/repositories/releases/com/fasterxml/jackson/core/jackson-core/2.9.8/jackson-core-2.9.8.jar
Downloading: https://maven.wso2.org/nexus/content/repositories/releases/com/fasterxml/jackson/dataformat/jackson-dataformat-yaml/2.9.8/jackson-dataformat-yaml-2.9.8.jar
Downloading: https://maven.wso2.org/nexus/content/repositories/releases/org/yaml/snakeyaml/1.23/snakeyaml-1.23.jar
Downloaded: https://maven.wso2.org/nexus/content/repositories/releases/org/wso2/orbit/com/lmax/disruptor/3.3.7.wso2v1/disruptor-3.3.7.wso2v1.jar (88 KB at 813.6 KB/sec)
Downloading: https://maven.wso2.org/nexus/content/repositories/releases/io/netty/netty-buffer/4.1.39.Final/netty-buffer-4.1.39.Final.jar
Downloading: https://maven.wso2.org/nexus/content/repositories/releases/io/netty/netty-common/4.1.39.Final/netty-common-4.1.39.Final.jar
Downloading: https://maven.wso2.org/nexus/content/repositories/releases/org/slf4j/slf4j-jdk14/1.7.26/slf4j-jdk14-1.7.26.jar
Downloading: https://maven.wso2.org/nexus/content/repositories/releases/com/google/code/findbugs/jsr305/3.0.2/jsr305-3.0.2.jar
Downloaded: https://maven.wso2.org/nexus/content/repositories/releases/org/ballerinalang/ballerina-tool/1.0.1/ballerina-tool-1.0.1.jar (74 KB at 826.1 KB/sec)
Downloading: https://maven.wso2.org/nexus/content/repositories/releases/com/h2database/h2/1.4.199/h2-1.4.199.jar
Downloading: https://maven.wso2.org/nexus/content/repositories/releases/org/eclipse/lsp4j/org.eclipse.lsp4j.jsonrpc/0.6.0/org.eclipse.lsp4j.jsonrpc-0.6.0.jar
Downloading: https://maven.wso2.org/nexus/content/repositories/releases/org/wso2/orbit/org/antlr/antlr4-runtime/4.5.1.wso2v1/antlr4-runtime-4.5.1.wso2v1.jar
Downloading: https://maven.wso2.org/nexus/content/repositories/releases/org/apache/commons/commons-lang3/3.8.1/commons-lang3-3.8.1.jar
Downloading: https://maven.wso2.org/nexus/content/repositories/releases/org/ballerinalang/language-server-compiler/1.0.1/language-server-compiler-1.0.1.jar
Downloading: https://maven.wso2.org/nexus/content/repositories/releases/org/eclipse/lsp4j/org.eclipse.lsp4j/0.6.0/org.eclipse.lsp4j-0.6.0.jar
Downloading: https://maven.wso2.org/nexus/content/repositories/releases/org/eclipse/lsp4j/org.eclipse.lsp4j.generator/0.6.0/org.eclipse.lsp4j.generator-0.6.0.jar
Downloading: https://maven.wso2.org/nexus/content/repositories/releases/org/eclipse/xtext/org.eclipse.xtext.xbase.lib/2.19.0/org.eclipse.xtext.xbase.lib-2.19.0.jar
Downloaded: https://maven.wso2.org/nexus/content/repositories/releases/org/wso2/orbit/org/antlr/antlr4-runtime/4.5.1.wso2v1/antlr4-runtime-4.5.1.wso2v1.jar (299 KB at 4670.6 KB/sec)
Downloading: https://maven.wso2.org/nexus/content/repositories/releases/org/eclipse/xtend/org.eclipse.xtend.lib.macro/2.19.0/org.eclipse.xtend.lib.macro-2.19.0.jar
Downloading: https://maven.wso2.org/nexus/content/repositories/releases/org/ballerinalang/ballerina-runtime/1.0.1/ballerina-runtime-1.0.1.jar
Downloading: https://maven.wso2.org/nexus/content/repositories/releases/org/apache/ws/commons/axiom/axiom-impl/1.2.22/axiom-impl-1.2.22.jar
Downloading: https://maven.wso2.org/nexus/content/repositories/releases/org/apache/ws/commons/axiom/axiom-api/1.2.22/axiom-api-1.2.22.jar
Downloaded: https://maven.wso2.org/nexus/content/repositories/releases/org/ballerinalang/language-server-compiler/1.0.1/language-server-compiler-1.0.1.jar (155 KB at 2343.4 KB/sec)
Downloading: https://maven.wso2.org/nexus/content/repositories/releases/org/apache/geronimo/specs/geronimo-activation_1.1_spec/1.1/geronimo-activation_1.1_spec-1.1.jar
Downloading: https://maven.wso2.org/nexus/content/repositories/releases/jaxen/jaxen/1.1.6/jaxen-1.1.6.jar
Downloading: https://maven.wso2.org/nexus/content/repositories/releases/org/apache/james/apache-mime4j-core/0.7.2/apache-mime4j-core-0.7.2.jar
Downloading: https://maven.wso2.org/nexus/content/repositories/releases/org/codehaus/woodstox/woodstox-core-asl/4.2.0/woodstox-core-asl-4.2.0.jar
Downloading: https://maven.wso2.org/nexus/content/repositories/releases/org/codehaus/woodstox/stax2-api/3.1.1/stax2-api-3.1.1.jar
Downloading: https://maven.wso2.org/nexus/content/repositories/releases/org/apache/ws/commons/axiom/axiom-dom/1.2.22/axiom-dom-1.2.22.jar
Downloaded: https://maven.wso2.org/nexus/content/repositories/releases/org/ballerinalang/ballerina-runtime/1.0.1/ballerina-runtime-1.0.1.jar (427 KB at 5402.9 KB/sec)
Downloading: https://maven.wso2.org/nexus/content/repositories/releases/org/apache/ws/commons/axiom/axiom-c14n/1.2.22/axiom-c14n-1.2.22.jar
Downloading: https://maven.wso2.org/nexus/content/repositories/releases/io/opentracing/opentracing-api/0.31.0/opentracing-api-0.31.0.jar
Downloading: https://maven.wso2.org/nexus/content/repositories/releases/io/opentracing/opentracing-util/0.31.0/opentracing-util-0.31.0.jar
Downloading: https://maven.wso2.org/nexus/content/repositories/releases/io/opentracing/opentracing-noop/0.31.0/opentracing-noop-0.31.0.jar
Downloading: https://maven.wso2.org/nexus/content/repositories/releases/org/awaitility/awaitility/3.1.6/awaitility-3.1.6.jar
Downloading: https://maven.wso2.org/nexus/content/repositories/releases/org/hamcrest/hamcrest-library/1.3/hamcrest-library-1.3.jar
Downloading: https://maven.wso2.org/nexus/content/repositories/releases/org/hamcrest/hamcrest-core/1.3/hamcrest-core-1.3.jar
Downloading: https://maven.wso2.org/nexus/content/repositories/releases/org/objenesis/objenesis/2.6/objenesis-2.6.jar
Downloading: https://maven.wso2.org/nexus/content/repositories/releases/org/ballerinalang/ballerina-config/1.0.1/ballerina-config-1.0.1.jar
Downloading: https://maven.wso2.org/nexus/content/repositories/releases/org/ballerinalang/ballerina-logging/1.0.1/ballerina-logging-1.0.1.jar
Downloading: https://maven.wso2.org/nexus/content/repositories/releases/org/antlr/antlr4-runtime/4.7.2/antlr4-runtime-4.7.2.jar
Downloading: https://maven.wso2.org/nexus/content/repositories/releases/org/ballerinalang/ballerina-lang/1.0.1/ballerina-lang-1.0.1.jar
Downloading: https://maven.wso2.org/nexus/content/repositories/releases/org/ballerinalang/toml-parser/1.0.1/toml-parser-1.0.1.jar
Downloading: https://maven.wso2.org/nexus/content/repositories/releases/com/moandjiezana/toml/toml4j/0.7.2/toml4j-0.7.2.jar
Downloaded: https://maven.wso2.org/nexus/content/repositories/releases/org/ballerinalang/ballerina-logging/1.0.1/ballerina-logging-1.0.1.jar (21 KB at 303.4 KB/sec)
Downloaded: https://maven.wso2.org/nexus/content/repositories/releases/org/ballerinalang/ballerina-config/1.0.1/ballerina-config-1.0.1.jar (19 KB at 231.7 KB/sec)
Downloaded: https://maven.wso2.org/nexus/content/repositories/releases/org/ballerinalang/toml-parser/1.0.1/toml-parser-1.0.1.jar (116 KB at 1059.6 KB/sec)
Downloaded: https://maven.wso2.org/nexus/content/repositories/releases/org/ballerinalang/ballerina-lang/1.0.1/ballerina-lang-1.0.1.jar (2167 KB at 10995.4 KB/sec)
Downloading: https://maven.wso2.org/nexus/content/groups/wso2-public/org/javassist/javassist/3.24.1-GA/javassist-3.24.1-GA.jar
Downloading: https://maven.wso2.org/nexus/content/groups/wso2-public/com/zaxxer/HikariCP/3.3.1/HikariCP-3.3.1.jar
Downloading: https://maven.wso2.org/nexus/content/groups/wso2-public/com/google/protobuf/protobuf-java/3.9.1/protobuf-java-3.9.1.jar
Downloading: https://maven.wso2.org/nexus/content/groups/wso2-public/commons-logging/commons-logging/1.1.1/commons-logging-1.1.1.jar
Downloading: https://maven.wso2.org/nexus/content/groups/wso2-public/com/github/jknack/handlebars/4.0.6/handlebars-4.0.6.jar
Downloaded: https://maven.wso2.org/nexus/content/groups/wso2-public/commons-logging/commons-logging/1.1.1/commons-logging-1.1.1.jar (60 KB at 3704.0 KB/sec)
Downloading: https://maven.wso2.org/nexus/content/groups/wso2-public/org/mozilla/rhino/1.7R4/rhino-1.7R4.jar
Downloaded: https://maven.wso2.org/nexus/content/groups/wso2-public/com/zaxxer/HikariCP/3.3.1/HikariCP-3.3.1.jar (136 KB at 7153.0 KB/sec)
Downloading: https://maven.wso2.org/nexus/content/groups/wso2-public/io/netty/netty-codec-http/4.1.39.Final/netty-codec-http-4.1.39.Final.jar
Downloaded: https://maven.wso2.org/nexus/content/groups/wso2-public/org/javassist/javassist/3.24.1-GA/javassist-3.24.1-GA.jar (760 KB at 21700.0 KB/sec)
Downloading: https://maven.wso2.org/nexus/content/groups/wso2-public/io/netty/netty-transport/4.1.39.Final/netty-transport-4.1.39.Final.jar
Downloaded: https://maven.wso2.org/nexus/content/groups/wso2-public/io/netty/netty-codec-http/4.1.39.Final/netty-codec-http-4.1.39.Final.jar (579 KB at 14120.4 KB/sec)
Downloading: https://maven.wso2.org/nexus/content/groups/wso2-public/io/netty/netty-codec/4.1.39.Final/netty-codec-4.1.39.Final.jar
Downloaded: https://maven.wso2.org/nexus/content/groups/wso2-public/com/google/protobuf/protobuf-java/3.9.1/protobuf-java-3.9.1.jar (1598 KB at 24204.3 KB/sec)
Downloading: https://maven.wso2.org/nexus/content/groups/wso2-public/io/netty/netty-handler/4.1.39.Final/netty-handler-4.1.39.Final.jar
Downloaded: https://maven.wso2.org/nexus/content/groups/wso2-public/org/mozilla/rhino/1.7R4/rhino-1.7R4.jar (1109 KB at 21310.9 KB/sec)
Downloading: https://maven.wso2.org/nexus/content/groups/wso2-public/io/netty/netty-handler-proxy/4.1.39.Final/netty-handler-proxy-4.1.39.Final.jar
Downloaded: https://maven.wso2.org/nexus/content/groups/wso2-public/io/netty/netty-transport/4.1.39.Final/netty-transport-4.1.39.Final.jar (464 KB at 12197.5 KB/sec)
Downloading: https://maven.wso2.org/nexus/content/groups/wso2-public/io/netty/netty-codec-socks/4.1.39.Final/netty-codec-socks-4.1.39.Final.jar
Downloaded: https://maven.wso2.org/nexus/content/groups/wso2-public/io/netty/netty-codec-socks/4.1.39.Final/netty-codec-socks-4.1.39.Final.jar (117 KB at 7772.8 KB/sec)
Downloading: https://maven.wso2.org/nexus/content/groups/wso2-public/io/netty/netty-codec-http2/4.1.39.Final/netty-codec-http2-4.1.39.Final.jar
Downloaded: https://maven.wso2.org/nexus/content/groups/wso2-public/io/netty/netty-codec/4.1.39.Final/netty-codec-4.1.39.Final.jar (311 KB at 10715.0 KB/sec)
Downloading: https://maven.wso2.org/nexus/content/groups/wso2-public/io/netty/netty-resolver/4.1.39.Final/netty-resolver-4.1.39.Final.jar
Downloaded: https://maven.wso2.org/nexus/content/groups/wso2-public/io/netty/netty-handler-proxy/4.1.39.Final/netty-handler-proxy-4.1.39.Final.jar (22 KB at 1027.3 KB/sec)
Downloading: https://maven.wso2.org/nexus/content/groups/wso2-public/commons-pool/wso2/commons-pool/1.5.6.wso2v1/commons-pool-1.5.6.wso2v1.jar
Downloaded: https://maven.wso2.org/nexus/content/groups/wso2-public/com/github/jknack/handlebars/4.0.6/handlebars-4.0.6.jar (325 KB at 3217.4 KB/sec)
Downloading: https://maven.wso2.org/nexus/content/groups/wso2-public/commons-pool/commons-pool/1.5.6/commons-pool-1.5.6.jar
Downloaded: https://maven.wso2.org/nexus/content/groups/wso2-public/io/netty/netty-handler/4.1.39.Final/netty-handler-4.1.39.Final.jar (427 KB at 11846.9 KB/sec)
Downloading: https://maven.wso2.org/nexus/content/groups/wso2-public/io/netty/netty-tcnative-boringssl-static/2.0.25.Final/netty-tcnative-boringssl-static-2.0.25.Final.jar
Downloaded: https://maven.wso2.org/nexus/content/groups/wso2-public/commons-pool/wso2/commons-pool/1.5.6.wso2v1/commons-pool-1.5.6.wso2v1.jar (94 KB at 6682.1 KB/sec)
Downloading: https://maven.wso2.org/nexus/content/groups/wso2-public/org/osgi/org.osgi.core/6.0.0/org.osgi.core-6.0.0.jar
Downloaded: https://maven.wso2.org/nexus/content/groups/wso2-public/commons-pool/commons-pool/1.5.6/commons-pool-1.5.6.jar (99 KB at 6132.3 KB/sec)
Downloading: https://maven.wso2.org/nexus/content/groups/wso2-public/org/json/json/20140107/json-20140107.jar
Downloaded: https://maven.wso2.org/nexus/content/groups/wso2-public/io/netty/netty-resolver/4.1.39.Final/netty-resolver-4.1.39.Final.jar (33 KB at 1002.3 KB/sec)
Downloading: https://maven.wso2.org/nexus/content/groups/wso2-public/org/apache/felix/org.apache.felix.gogo.command/0.10.0.v201209301215/org.apache.felix.gogo.command-0.10.0.v201209301215.jar
Downloaded: https://maven.wso2.org/nexus/content/groups/wso2-public/org/osgi/org.osgi.core/6.0.0/org.osgi.core-6.0.0.jar (465 KB at 18564.7 KB/sec)
Downloading: https://maven.wso2.org/nexus/content/groups/wso2-public/org/apache/felix/org.apache.felix.gogo.shell/0.10.0.v201212101605/org.apache.felix.gogo.shell-0.10.0.v201212101605.jar
Downloaded: https://maven.wso2.org/nexus/content/groups/wso2-public/org/json/json/20140107/json-20140107.jar (64 KB at 4879.2 KB/sec)
Downloading: https://maven.wso2.org/nexus/content/groups/wso2-public/org/apache/felix/org.apache.felix.gogo.runtime/0.10.0.v201209301036/org.apache.felix.gogo.runtime-0.10.0.v201209301036.jar
Downloaded: https://maven.wso2.org/nexus/content/groups/wso2-public/org/apache/felix/org.apache.felix.gogo.command/0.10.0.v201209301215/org.apache.felix.gogo.command-0.10.0.v201209301215.jar (57 KB at 3753.0 KB/sec)
Downloading: https://maven.wso2.org/nexus/content/groups/wso2-public/org/ops4j/pax/logging/pax-logging-api/1.9.0/pax-logging-api-1.9.0.jar
Downloaded: https://maven.wso2.org/nexus/content/groups/wso2-public/io/netty/netty-codec-http2/4.1.39.Final/netty-codec-http2-4.1.39.Final.jar (446 KB at 9281.9 KB/sec)
Downloading: https://maven.wso2.org/nexus/content/groups/wso2-public/org/ops4j/pax/logging/pax-logging-log4j2/1.9.0/pax-logging-log4j2-1.9.0.jar
Downloaded: https://maven.wso2.org/nexus/content/groups/wso2-public/org/apache/felix/org.apache.felix.gogo.shell/0.10.0.v201212101605/org.apache.felix.gogo.shell-0.10.0.v201212101605.jar (60 KB at 2970.1 KB/sec)
Downloading: https://maven.wso2.org/nexus/content/groups/wso2-public/org/jvnet/mimepull/mimepull/1.9.11/mimepull-1.9.11.jar
Downloaded: https://maven.wso2.org/nexus/content/groups/wso2-public/org/apache/felix/org.apache.felix.gogo.runtime/0.10.0.v201209301036/org.apache.felix.gogo.runtime-0.10.0.v201209301036.jar (79 KB at 3562.2 KB/sec)
Downloading: https://maven.wso2.org/nexus/content/groups/wso2-public/org/bouncycastle/bcprov-jdk15on/1.61/bcprov-jdk15on-1.61.jar
Downloaded: https://maven.wso2.org/nexus/content/groups/wso2-public/org/jvnet/mimepull/mimepull/1.9.11/mimepull-1.9.11.jar (66 KB at 5462.6 KB/sec)
Downloading: https://maven.wso2.org/nexus/content/groups/wso2-public/org/bouncycastle/bcpkix-jdk15on/1.61/bcpkix-jdk15on-1.61.jar
Downloaded: https://maven.wso2.org/nexus/content/groups/wso2-public/org/ops4j/pax/logging/pax-logging-api/1.9.0/pax-logging-api-1.9.0.jar (273 KB at 10464.5 KB/sec)
Downloading: https://maven.wso2.org/nexus/content/groups/wso2-public/com/rabbitmq/amqp-client/5.6.0/amqp-client-5.6.0.jar
Downloaded: https://maven.wso2.org/nexus/content/groups/wso2-public/org/bouncycastle/bcpkix-jdk15on/1.61/bcpkix-jdk15on-1.61.jar (847 KB at 22866.0 KB/sec)
Downloading: https://maven.wso2.org/nexus/content/groups/wso2-public/io/nats/java-nats-streaming/2.2.1/java-nats-streaming-2.2.1.jar
Downloaded: https://maven.wso2.org/nexus/content/groups/wso2-public/org/ops4j/pax/logging/pax-logging-log4j2/1.9.0/pax-logging-log4j2-1.9.0.jar (1385 KB at 22693.8 KB/sec)
Downloading: https://maven.wso2.org/nexus/content/groups/wso2-public/io/nats/jnats/2.6.0/jnats-2.6.0.jar
Downloaded: https://maven.wso2.org/nexus/content/groups/wso2-public/com/rabbitmq/amqp-client/5.6.0/amqp-client-5.6.0.jar (587 KB at 14308.7 KB/sec)
Downloading: https://maven.wso2.org/nexus/content/groups/wso2-public/net/i2p/crypto/eddsa/0.3.0/eddsa-0.3.0.jar
Downloaded: https://maven.wso2.org/nexus/content/groups/wso2-public/io/nats/java-nats-streaming/2.2.1/java-nats-streaming-2.2.1.jar (181 KB at 11278.1 KB/sec)
Downloading: https://maven.wso2.org/nexus/content/groups/wso2-public/org/hdrhistogram/HdrHistogram/2.1.11/HdrHistogram-2.1.11.jar
Downloaded: https://maven.wso2.org/nexus/content/groups/wso2-public/net/i2p/crypto/eddsa/0.3.0/eddsa-0.3.0.jar (62 KB at 4754.5 KB/sec)
Downloading: https://maven.wso2.org/nexus/content/groups/wso2-public/org/quartz-scheduler/quartz/2.3.1/quartz-2.3.1.jar
Downloaded: https://maven.wso2.org/nexus/content/groups/wso2-public/io/netty/netty-tcnative-boringssl-static/2.0.25.Final/netty-tcnative-boringssl-static-2.0.25.Final.jar (3036 KB at 26626.9 KB/sec)
Downloading: https://maven.wso2.org/nexus/content/groups/wso2-public/com/mchange/c3p0/0.9.5.3/c3p0-0.9.5.3.jar
Downloaded: https://maven.wso2.org/nexus/content/groups/wso2-public/io/nats/jnats/2.6.0/jnats-2.6.0.jar (96 KB at 2508.4 KB/sec)
Downloading: https://maven.wso2.org/nexus/content/groups/wso2-public/com/mchange/mchange-commons-java/0.2.15/mchange-commons-java-0.2.15.jar
Downloaded: https://maven.wso2.org/nexus/content/groups/wso2-public/org/hdrhistogram/HdrHistogram/2.1.11/HdrHistogram-2.1.11.jar (121 KB at 5018.2 KB/sec)
Downloading: https://maven.wso2.org/nexus/content/groups/wso2-public/com/zaxxer/HikariCP-java7/2.4.13/HikariCP-java7-2.4.13.jar
Downloaded: https://maven.wso2.org/nexus/content/groups/wso2-public/com/zaxxer/HikariCP-java7/2.4.13/HikariCP-java7-2.4.13.jar (131 KB at 9348.3 KB/sec)
Downloading: https://maven.wso2.org/nexus/content/groups/wso2-public/org/apache/geronimo/specs/geronimo-stax-api_1.0_spec/1.0.1/geronimo-stax-api_1.0_spec-1.0.1.jar
Downloaded: https://maven.wso2.org/nexus/content/groups/wso2-public/com/mchange/c3p0/0.9.5.3/c3p0-0.9.5.3.jar (487 KB at 13515.4 KB/sec)
Downloading: https://maven.wso2.org/nexus/content/groups/wso2-public/org/wso2/staxon/staxon-core/1.2.0.wso2v2/staxon-core-1.2.0.wso2v2.jar
Downloaded: https://maven.wso2.org/nexus/content/groups/wso2-public/org/quartz-scheduler/quartz/2.3.1/quartz-2.3.1.jar (677 KB at 16903.1 KB/sec)
Downloading: https://maven.wso2.org/nexus/content/groups/wso2-public/org/wso2/staxon/staxon/1.2.0-wso2v2/staxon-1.2.0-wso2v2.jar
Downloaded: https://maven.wso2.org/nexus/content/groups/wso2-public/org/apache/geronimo/specs/geronimo-stax-api_1.0_spec/1.0.1/geronimo-stax-api_1.0_spec-1.0.1.jar (29 KB at 2344.1 KB/sec)
Downloading: https://maven.wso2.org/nexus/content/groups/wso2-public/javax/transaction/javax.transaction-api/1.3/javax.transaction-api-1.3.jar
Downloaded: https://maven.wso2.org/nexus/content/groups/wso2-public/com/mchange/mchange-commons-java/0.2.15/mchange-commons-java-0.2.15.jar (610 KB at 20313.7 KB/sec)
Downloading: https://maven.wso2.org/nexus/content/groups/wso2-public/javax/ws/rs/javax.ws.rs-api/2.0/javax.ws.rs-api-2.0.jar
Downloaded: https://maven.wso2.org/nexus/content/groups/wso2-public/javax/ws/rs/javax.ws.rs-api/2.0/javax.ws.rs-api-2.0.jar (111 KB at 7865.4 KB/sec)
Downloading: https://maven.wso2.org/nexus/content/groups/wso2-public/org/apache/httpcomponents/httpclient/4.5.2/httpclient-4.5.2.jar
Downloaded: https://maven.wso2.org/nexus/content/groups/wso2-public/org/wso2/staxon/staxon-core/1.2.0.wso2v2/staxon-core-1.2.0.wso2v2.jar (164 KB at 4412.6 KB/sec)
Downloading: https://maven.wso2.org/nexus/content/groups/wso2-public/org/apache/httpcomponents/httpcore/4.4.4/httpcore-4.4.4.jar
Downloaded: https://maven.wso2.org/nexus/content/groups/wso2-public/javax/transaction/javax.transaction-api/1.3/javax.transaction-api-1.3.jar (28 KB at 781.7 KB/sec)
Downloading: https://maven.wso2.org/nexus/content/groups/wso2-public/commons-codec/commons-codec/1.9/commons-codec-1.9.jar
Downloaded: https://maven.wso2.org/nexus/content/groups/wso2-public/org/bouncycastle/bcprov-jdk15on/1.61/bcprov-jdk15on-1.61.jar (4438 KB at 28443.4 KB/sec)
Downloading: https://maven.wso2.org/nexus/content/groups/wso2-public/com/nimbusds/nimbus-jose-jwt/2.25/nimbus-jose-jwt-2.25.jar
Downloaded: https://maven.wso2.org/nexus/content/groups/wso2-public/org/apache/httpcomponents/httpcore/4.4.4/httpcore-4.4.4.jar (320 KB at 16793.0 KB/sec)
Downloading: https://maven.wso2.org/nexus/content/groups/wso2-public/net/jcip/jcip-annotations/1.0/jcip-annotations-1.0.jar
Downloaded: https://maven.wso2.org/nexus/content/groups/wso2-public/org/apache/httpcomponents/httpclient/4.5.2/httpclient-4.5.2.jar (720 KB at 19983.1 KB/sec)
Downloading: https://maven.wso2.org/nexus/content/groups/wso2-public/net/minidev/json-smart/1.1.1/json-smart-1.1.1.jar
Downloaded: https://maven.wso2.org/nexus/content/groups/wso2-public/commons-codec/commons-codec/1.9/commons-codec-1.9.jar (258 KB at 15163.4 KB/sec)
Downloading: https://maven.wso2.org/nexus/content/groups/wso2-public/io/dropwizard/metrics/metrics-core/3.2.5/metrics-core-3.2.5.jar
Downloaded: https://maven.wso2.org/nexus/content/groups/wso2-public/org/wso2/staxon/staxon/1.2.0-wso2v2/staxon-1.2.0-wso2v2.jar (161 KB at 2631.0 KB/sec)
Downloading: https://maven.wso2.org/nexus/content/groups/wso2-public/io/dropwizard/metrics/metrics-jvm/3.2.5/metrics-jvm-3.2.5.jar
Downloaded: https://maven.wso2.org/nexus/content/groups/wso2-public/net/jcip/jcip-annotations/1.0/jcip-annotations-1.0.jar (3 KB at 244.6 KB/sec)
Downloading: https://maven.wso2.org/nexus/content/groups/wso2-public/com/google/guava/guava/23.0/guava-23.0.jar
Downloaded: https://maven.wso2.org/nexus/content/groups/wso2-public/com/nimbusds/nimbus-jose-jwt/2.25/nimbus-jose-jwt-2.25.jar (140 KB at 10726.5 KB/sec)
Downloading: https://maven.wso2.org/nexus/content/groups/wso2-public/com/google/errorprone/error_prone_annotations/2.0.18/error_prone_annotations-2.0.18.jar
Downloaded: https://maven.wso2.org/nexus/content/groups/wso2-public/net/minidev/json-smart/1.1.1/json-smart-1.1.1.jar (51 KB at 2793.2 KB/sec)
Downloading: https://maven.wso2.org/nexus/content/groups/wso2-public/com/google/j2objc/j2objc-annotations/1.1/j2objc-annotations-1.1.jar
Downloaded: https://maven.wso2.org/nexus/content/groups/wso2-public/io/dropwizard/metrics/metrics-jvm/3.2.5/metrics-jvm-3.2.5.jar (40 KB at 2065.4 KB/sec)
Downloading: https://maven.wso2.org/nexus/content/groups/wso2-public/org/codehaus/mojo/animal-sniffer-annotations/1.14/animal-sniffer-annotations-1.14.jar
Downloaded: https://maven.wso2.org/nexus/content/groups/wso2-public/io/dropwizard/metrics/metrics-core/3.2.5/metrics-core-3.2.5.jar (134 KB at 5788.3 KB/sec)
Downloading: https://maven.wso2.org/nexus/content/groups/wso2-public/info/picocli/picocli/4.0.1/picocli-4.0.1.jar
Downloaded: https://maven.wso2.org/nexus/content/groups/wso2-public/com/google/errorprone/error_prone_annotations/2.0.18/error_prone_annotations-2.0.18.jar (12 KB at 620.8 KB/sec)
Downloading: https://maven.wso2.org/nexus/content/groups/wso2-public/org/testng/testng/6.14.3/testng-6.14.3.jar
Downloaded: https://maven.wso2.org/nexus/content/groups/wso2-public/com/google/j2objc/j2objc-annotations/1.1/j2objc-annotations-1.1.jar (9 KB at 857.6 KB/sec)
Downloading: https://maven.wso2.org/nexus/content/groups/wso2-public/com/beust/jcommander/1.72/jcommander-1.72.jar
Downloaded: https://maven.wso2.org/nexus/content/groups/wso2-public/org/codehaus/mojo/animal-sniffer-annotations/1.14/animal-sniffer-annotations-1.14.jar (4 KB at 170.0 KB/sec)
Downloading: https://maven.wso2.org/nexus/content/groups/wso2-public/org/apache-extras/beanshell/bsh/2.0b6/bsh-2.0b6.jar
Downloaded: https://maven.wso2.org/nexus/content/groups/wso2-public/info/picocli/picocli/4.0.1/picocli-4.0.1.jar (337 KB at 16045.5 KB/sec)
Downloading: https://maven.wso2.org/nexus/content/groups/wso2-public/com/fasterxml/jackson/core/jackson-databind/2.9.8/jackson-databind-2.9.8.jar
Downloaded: https://maven.wso2.org/nexus/content/groups/wso2-public/com/beust/jcommander/1.72/jcommander-1.72.jar (68 KB at 3381.5 KB/sec)
Downloading: https://maven.wso2.org/nexus/content/groups/wso2-public/com/fasterxml/jackson/core/jackson-core/2.9.8/jackson-core-2.9.8.jar
Downloaded: https://maven.wso2.org/nexus/content/groups/wso2-public/org/testng/testng/6.14.3/testng-6.14.3.jar (821 KB at 21030.9 KB/sec)
Downloading: https://maven.wso2.org/nexus/content/groups/wso2-public/com/fasterxml/jackson/dataformat/jackson-dataformat-yaml/2.9.8/jackson-dataformat-yaml-2.9.8.jar
Downloaded: https://maven.wso2.org/nexus/content/groups/wso2-public/org/apache-extras/beanshell/bsh/2.0b6/bsh-2.0b6.jar (380 KB at 11512.6 KB/sec)
Downloading: https://maven.wso2.org/nexus/content/groups/wso2-public/org/yaml/snakeyaml/1.23/snakeyaml-1.23.jar
Downloaded: https://maven.wso2.org/nexus/content/groups/wso2-public/com/fasterxml/jackson/dataformat/jackson-dataformat-yaml/2.9.8/jackson-dataformat-yaml-2.9.8.jar (41 KB at 3367.6 KB/sec)
Downloading: https://maven.wso2.org/nexus/content/groups/wso2-public/io/netty/netty-buffer/4.1.39.Final/netty-buffer-4.1.39.Final.jar
Downloaded: https://maven.wso2.org/nexus/content/groups/wso2-public/com/fasterxml/jackson/core/jackson-core/2.9.8/jackson-core-2.9.8.jar (318 KB at 10965.1 KB/sec)
Downloading: https://maven.wso2.org/nexus/content/groups/wso2-public/io/netty/netty-common/4.1.39.Final/netty-common-4.1.39.Final.jar
Downloaded: https://maven.wso2.org/nexus/content/groups/wso2-public/org/yaml/snakeyaml/1.23/snakeyaml-1.23.jar (295 KB at 14711.8 KB/sec)
Downloading: https://maven.wso2.org/nexus/content/groups/wso2-public/org/slf4j/slf4j-jdk14/1.7.26/slf4j-jdk14-1.7.26.jar
Downloaded: https://maven.wso2.org/nexus/content/groups/wso2-public/com/fasterxml/jackson/core/jackson-databind/2.9.8/jackson-databind-2.9.8.jar (1316 KB at 24364.1 KB/sec)
Downloading: https://maven.wso2.org/nexus/content/groups/wso2-public/com/google/code/findbugs/jsr305/3.0.2/jsr305-3.0.2.jar
Downloaded: https://maven.wso2.org/nexus/content/groups/wso2-public/com/google/guava/guava/23.0/guava-23.0.jar (2554 KB at 25792.2 KB/sec)
Downloading: https://maven.wso2.org/nexus/content/groups/wso2-public/com/h2database/h2/1.4.199/h2-1.4.199.jar
Downloaded: https://maven.wso2.org/nexus/content/groups/wso2-public/org/slf4j/slf4j-jdk14/1.7.26/slf4j-jdk14-1.7.26.jar (9 KB at 551.8 KB/sec)
Downloading: https://maven.wso2.org/nexus/content/groups/wso2-public/org/eclipse/lsp4j/org.eclipse.lsp4j.jsonrpc/0.6.0/org.eclipse.lsp4j.jsonrpc-0.6.0.jar
Downloaded: https://maven.wso2.org/nexus/content/groups/wso2-public/com/google/code/findbugs/jsr305/3.0.2/jsr305-3.0.2.jar (20 KB at 1769.9 KB/sec)
Downloading: https://maven.wso2.org/nexus/content/groups/wso2-public/org/apache/commons/commons-lang3/3.8.1/commons-lang3-3.8.1.jar
Downloaded: https://maven.wso2.org/nexus/content/groups/wso2-public/io/netty/netty-buffer/4.1.39.Final/netty-buffer-4.1.39.Final.jar (270 KB at 7289.5 KB/sec)
Downloading: https://maven.wso2.org/nexus/content/groups/wso2-public/org/eclipse/lsp4j/org.eclipse.lsp4j/0.6.0/org.eclipse.lsp4j-0.6.0.jar
Downloaded: https://maven.wso2.org/nexus/content/groups/wso2-public/io/netty/netty-common/4.1.39.Final/netty-common-4.1.39.Final.jar (586 KB at 13619.2 KB/sec)
Downloading: https://maven.wso2.org/nexus/content/groups/wso2-public/org/eclipse/lsp4j/org.eclipse.lsp4j.generator/0.6.0/org.eclipse.lsp4j.generator-0.6.0.jar
Downloaded: https://maven.wso2.org/nexus/content/groups/wso2-public/org/apache/commons/commons-lang3/3.8.1/commons-lang3-3.8.1.jar (491 KB at 18850.6 KB/sec)
Downloading: https://maven.wso2.org/nexus/content/groups/wso2-public/org/eclipse/xtend/org.eclipse.xtend.lib/2.19.0/org.eclipse.xtend.lib-2.19.0.jar
Downloaded: https://maven.wso2.org/nexus/content/groups/wso2-public/org/eclipse/xtend/org.eclipse.xtend.lib/2.19.0/org.eclipse.xtend.lib-2.19.0.jar (105 KB at 7429.9 KB/sec)
Downloading: https://maven.wso2.org/nexus/content/groups/wso2-public/org/eclipse/xtext/org.eclipse.xtext.xbase.lib/2.19.0/org.eclipse.xtext.xbase.lib-2.19.0.jar
Downloaded: https://maven.wso2.org/nexus/content/groups/wso2-public/org/eclipse/lsp4j/org.eclipse.lsp4j.jsonrpc/0.6.0/org.eclipse.lsp4j.jsonrpc-0.6.0.jar (118 KB at 2877.6 KB/sec)
Downloading: https://maven.wso2.org/nexus/content/groups/wso2-public/org/eclipse/xtend/org.eclipse.xtend.lib.macro/2.19.0/org.eclipse.xtend.lib.macro-2.19.0.jar
Downloaded: https://maven.wso2.org/nexus/content/groups/wso2-public/org/eclipse/lsp4j/org.eclipse.lsp4j.generator/0.6.0/org.eclipse.lsp4j.generator-0.6.0.jar (49 KB at 1432.2 KB/sec)
Downloading: https://maven.wso2.org/nexus/content/groups/wso2-public/org/apache/ws/commons/axiom/axiom-impl/1.2.22/axiom-impl-1.2.22.jar
Downloaded: https://maven.wso2.org/nexus/content/groups/wso2-public/org/eclipse/xtend/org.eclipse.xtend.lib.macro/2.19.0/org.eclipse.xtend.lib.macro-2.19.0.jar (76 KB at 5053.0 KB/sec)
Downloading: https://maven.wso2.org/nexus/content/groups/wso2-public/org/apache/ws/commons/axiom/axiom-api/1.2.22/axiom-api-1.2.22.jar
Downloaded: https://maven.wso2.org/nexus/content/groups/wso2-public/org/eclipse/lsp4j/org.eclipse.lsp4j/0.6.0/org.eclipse.lsp4j-0.6.0.jar (513 KB at 9487.8 KB/sec)
Downloading: https://maven.wso2.org/nexus/content/groups/wso2-public/org/apache/geronimo/specs/geronimo-activation_1.1_spec/1.1/geronimo-activation_1.1_spec-1.1.jar
Downloaded: https://maven.wso2.org/nexus/content/groups/wso2-public/org/eclipse/xtext/org.eclipse.xtext.xbase.lib/2.19.0/org.eclipse.xtext.xbase.lib-2.19.0.jar (160 KB at 8402.7 KB/sec)
Downloading: https://maven.wso2.org/nexus/content/groups/wso2-public/jaxen/jaxen/1.1.6/jaxen-1.1.6.jar
Downloaded: https://maven.wso2.org/nexus/content/groups/wso2-public/org/apache/geronimo/specs/geronimo-activation_1.1_spec/1.1/geronimo-activation_1.1_spec-1.1.jar (47 KB at 3862.7 KB/sec)
Downloading: https://maven.wso2.org/nexus/content/groups/wso2-public/org/apache/james/apache-mime4j-core/0.7.2/apache-mime4j-core-0.7.2.jar
Downloaded: https://maven.wso2.org/nexus/content/groups/wso2-public/com/h2database/h2/1.4.199/h2-1.4.199.jar (2128 KB at 26925.7 KB/sec)
Downloading: https://maven.wso2.org/nexus/content/groups/wso2-public/org/codehaus/woodstox/woodstox-core-asl/4.2.0/woodstox-core-asl-4.2.0.jar
Downloaded: https://maven.wso2.org/nexus/content/groups/wso2-public/org/apache/ws/commons/axiom/axiom-impl/1.2.22/axiom-impl-1.2.22.jar (561 KB at 19316.5 KB/sec)
Downloading: https://maven.wso2.org/nexus/content/groups/wso2-public/org/codehaus/woodstox/stax2-api/3.1.1/stax2-api-3.1.1.jar
Downloaded: https://maven.wso2.org/nexus/content/groups/wso2-public/jaxen/jaxen/1.1.6/jaxen-1.1.6.jar (227 KB at 11918.3 KB/sec)
Downloading: https://maven.wso2.org/nexus/content/groups/wso2-public/org/apache/ws/commons/axiom/axiom-dom/1.2.22/axiom-dom-1.2.22.jar
Downloaded: https://maven.wso2.org/nexus/content/groups/wso2-public/org/apache/ws/commons/axiom/axiom-api/1.2.22/axiom-api-1.2.22.jar (417 KB at 16641.1 KB/sec)
Downloading: https://maven.wso2.org/nexus/content/groups/wso2-public/org/apache/ws/commons/axiom/axiom-c14n/1.2.22/axiom-c14n-1.2.22.jar
Downloaded: https://maven.wso2.org/nexus/content/groups/wso2-public/org/apache/ws/commons/axiom/axiom-c14n/1.2.22/axiom-c14n-1.2.22.jar (59 KB at 4173.7 KB/sec)
Downloading: https://maven.wso2.org/nexus/content/groups/wso2-public/io/opentracing/opentracing-api/0.31.0/opentracing-api-0.31.0.jar
Downloaded: https://maven.wso2.org/nexus/content/groups/wso2-public/org/codehaus/woodstox/woodstox-core-asl/4.2.0/woodstox-core-asl-4.2.0.jar (471 KB at 18113.2 KB/sec)
Downloading: https://maven.wso2.org/nexus/content/groups/wso2-public/io/opentracing/opentracing-util/0.31.0/opentracing-util-0.31.0.jar
Downloaded: https://maven.wso2.org/nexus/content/groups/wso2-public/org/codehaus/woodstox/stax2-api/3.1.1/stax2-api-3.1.1.jar (178 KB at 6132.5 KB/sec)
Downloading: https://maven.wso2.org/nexus/content/groups/wso2-public/io/opentracing/opentracing-noop/0.31.0/opentracing-noop-0.31.0.jar
Downloaded: https://maven.wso2.org/nexus/content/groups/wso2-public/io/opentracing/opentracing-api/0.31.0/opentracing-api-0.31.0.jar (14 KB at 1196.0 KB/sec)
Downloading: https://maven.wso2.org/nexus/content/groups/wso2-public/org/awaitility/awaitility/3.1.6/awaitility-3.1.6.jar
Downloaded: https://maven.wso2.org/nexus/content/groups/wso2-public/io/opentracing/opentracing-util/0.31.0/opentracing-util-0.31.0.jar (8 KB at 784.1 KB/sec)
Downloading: https://maven.wso2.org/nexus/content/groups/wso2-public/org/hamcrest/hamcrest-library/1.3/hamcrest-library-1.3.jar
Downloaded: https://maven.wso2.org/nexus/content/groups/wso2-public/org/apache/ws/commons/axiom/axiom-dom/1.2.22/axiom-dom-1.2.22.jar (700 KB at 22578.0 KB/sec)
Downloading: https://maven.wso2.org/nexus/content/groups/wso2-public/org/hamcrest/hamcrest-core/1.3/hamcrest-core-1.3.jar
Downloaded: https://maven.wso2.org/nexus/content/groups/wso2-public/org/apache/james/apache-mime4j-core/0.7.2/apache-mime4j-core-0.7.2.jar (94 KB at 2275.5 KB/sec)
Downloading: https://maven.wso2.org/nexus/content/groups/wso2-public/org/objenesis/objenesis/2.6/objenesis-2.6.jar
Downloaded: https://maven.wso2.org/nexus/content/groups/wso2-public/io/opentracing/opentracing-noop/0.31.0/opentracing-noop-0.31.0.jar (11 KB at 1128.6 KB/sec)
Downloading: https://maven.wso2.org/nexus/content/groups/wso2-public/org/antlr/antlr4-runtime/4.7.2/antlr4-runtime-4.7.2.jar
Downloaded: https://maven.wso2.org/nexus/content/groups/wso2-public/org/hamcrest/hamcrest-library/1.3/hamcrest-library-1.3.jar (52 KB at 4711.5 KB/sec)
Downloading: https://maven.wso2.org/nexus/content/groups/wso2-public/com/moandjiezana/toml/toml4j/0.7.2/toml4j-0.7.2.jar
Downloaded: https://maven.wso2.org/nexus/content/groups/wso2-public/org/awaitility/awaitility/3.1.6/awaitility-3.1.6.jar (101 KB at 7211.0 KB/sec)
Downloaded: https://maven.wso2.org/nexus/content/groups/wso2-public/org/objenesis/objenesis/2.6/objenesis-2.6.jar (55 KB at 4531.6 KB/sec)
Downloaded: https://maven.wso2.org/nexus/content/groups/wso2-public/org/hamcrest/hamcrest-core/1.3/hamcrest-core-1.3.jar (44 KB at 3382.2 KB/sec)
Downloaded: https://maven.wso2.org/nexus/content/groups/wso2-public/com/moandjiezana/toml/toml4j/0.7.2/toml4j-0.7.2.jar (62 KB at 5559.4 KB/sec)
Downloaded: https://maven.wso2.org/nexus/content/groups/wso2-public/org/antlr/antlr4-runtime/4.7.2/antlr4-runtime-4.7.2.jar (330 KB at 16499.2 KB/sec)
[INFO] 
[INFO] --- maven-clean-plugin:2.4.1:clean (default-clean) @ ei-snippets ---
[INFO] 
[INFO] --- build-helper-maven-plugin:3.0.0:add-source (add-source) @ ei-snippets ---
Downloading: http://repo.maven.apache.org/maven2/org/codehaus/plexus/plexus-utils/3.0.24/plexus-utils-3.0.24.pom
Downloaded: http://repo.maven.apache.org/maven2/org/codehaus/plexus/plexus-utils/3.0.24/plexus-utils-3.0.24.pom (5 KB at 12.4 KB/sec)
Downloading: http://repo.maven.apache.org/maven2/org/beanshell/bsh/2.0b4/bsh-2.0b4.pom
Downloaded: http://repo.maven.apache.org/maven2/org/beanshell/bsh/2.0b4/bsh-2.0b4.pom (2 KB at 3.6 KB/sec)
Downloading: http://repo.maven.apache.org/maven2/org/beanshell/beanshell/2.0b4/beanshell-2.0b4.pom
Downloaded: http://repo.maven.apache.org/maven2/org/beanshell/beanshell/2.0b4/beanshell-2.0b4.pom (2 KB at 4.3 KB/sec)
Downloading: http://repo.maven.apache.org/maven2/org/apache/maven/shared/file-management/3.0.0/file-management-3.0.0.pom
Downloaded: http://repo.maven.apache.org/maven2/org/apache/maven/shared/file-management/3.0.0/file-management-3.0.0.pom (5 KB at 14.2 KB/sec)
Downloading: http://repo.maven.apache.org/maven2/org/apache/maven/shared/maven-shared-components/22/maven-shared-components-22.pom
Downloaded: http://repo.maven.apache.org/maven2/org/apache/maven/shared/maven-shared-components/22/maven-shared-components-22.pom (5 KB at 15.4 KB/sec)
Downloading: http://repo.maven.apache.org/maven2/org/apache/maven/maven-parent/27/maven-parent-27.pom
Downloaded: http://repo.maven.apache.org/maven2/org/apache/maven/maven-parent/27/maven-parent-27.pom (40 KB at 122.7 KB/sec)
Downloading: http://repo.maven.apache.org/maven2/org/apache/apache/17/apache-17.pom
Downloaded: http://repo.maven.apache.org/maven2/org/apache/apache/17/apache-17.pom (16 KB at 48.4 KB/sec)
Downloading: http://repo.maven.apache.org/maven2/org/apache/maven/shared/maven-shared-io/3.0.0/maven-shared-io-3.0.0.pom
Downloaded: http://repo.maven.apache.org/maven2/org/apache/maven/shared/maven-shared-io/3.0.0/maven-shared-io-3.0.0.pom (5 KB at 12.6 KB/sec)
Downloading: http://repo.maven.apache.org/maven2/org/apache/maven/maven-compat/3.0/maven-compat-3.0.pom
Downloaded: http://repo.maven.apache.org/maven2/org/apache/maven/maven-compat/3.0/maven-compat-3.0.pom (4 KB at 12.2 KB/sec)
Downloading: http://repo.maven.apache.org/maven2/org/apache/maven/wagon/wagon-provider-api/1.0-beta-6/wagon-provider-api-1.0-beta-6.pom
Downloaded: http://repo.maven.apache.org/maven2/org/apache/maven/wagon/wagon-provider-api/1.0-beta-6/wagon-provider-api-1.0-beta-6.pom (2 KB at 5.3 KB/sec)
Downloading: http://repo.maven.apache.org/maven2/org/apache/maven/wagon/wagon/1.0-beta-6/wagon-1.0-beta-6.pom
Downloaded: http://repo.maven.apache.org/maven2/org/apache/maven/wagon/wagon/1.0-beta-6/wagon-1.0-beta-6.pom (13 KB at 37.4 KB/sec)
Downloading: http://repo.maven.apache.org/maven2/org/codehaus/plexus/plexus-utils/1.4.2/plexus-utils-1.4.2.pom
Downloaded: http://repo.maven.apache.org/maven2/org/codehaus/plexus/plexus-utils/1.4.2/plexus-utils-1.4.2.pom (2 KB at 5.9 KB/sec)
Downloading: http://repo.maven.apache.org/maven2/org/apache/maven/wagon/wagon-provider-api/2.10/wagon-provider-api-2.10.pom
Downloaded: http://repo.maven.apache.org/maven2/org/apache/maven/wagon/wagon-provider-api/2.10/wagon-provider-api-2.10.pom (2 KB at 5.2 KB/sec)
Downloading: http://repo.maven.apache.org/maven2/org/apache/maven/wagon/wagon/2.10/wagon-2.10.pom
Downloaded: http://repo.maven.apache.org/maven2/org/apache/maven/wagon/wagon/2.10/wagon-2.10.pom (21 KB at 60.0 KB/sec)
Downloading: http://repo.maven.apache.org/maven2/org/codehaus/plexus/plexus-utils/3.0.15/plexus-utils-3.0.15.pom
Downloaded: http://repo.maven.apache.org/maven2/org/codehaus/plexus/plexus-utils/3.0.15/plexus-utils-3.0.15.pom (4 KB at 9.5 KB/sec)
Downloading: http://repo.maven.apache.org/maven2/org/apache/maven/shared/maven-shared-utils/3.0.0/maven-shared-utils-3.0.0.pom
Downloaded: http://repo.maven.apache.org/maven2/org/apache/maven/shared/maven-shared-utils/3.0.0/maven-shared-utils-3.0.0.pom (6 KB at 16.9 KB/sec)
Downloading: http://repo.maven.apache.org/maven2/org/apache/maven/shared/maven-shared-components/21/maven-shared-components-21.pom
Downloaded: http://repo.maven.apache.org/maven2/org/apache/maven/shared/maven-shared-components/21/maven-shared-components-21.pom (5 KB at 15.4 KB/sec)
Downloading: http://repo.maven.apache.org/maven2/org/apache/maven/maven-parent/25/maven-parent-25.pom
Downloaded: http://repo.maven.apache.org/maven2/org/apache/maven/maven-parent/25/maven-parent-25.pom (37 KB at 112.8 KB/sec)
Downloading: http://repo.maven.apache.org/maven2/commons-io/commons-io/2.4/commons-io-2.4.pom
Downloaded: http://repo.maven.apache.org/maven2/commons-io/commons-io/2.4/commons-io-2.4.pom (10 KB at 30.7 KB/sec)
Downloading: http://repo.maven.apache.org/maven2/org/apache/commons/commons-parent/25/commons-parent-25.pom
Downloaded: http://repo.maven.apache.org/maven2/org/apache/commons/commons-parent/25/commons-parent-25.pom (48 KB at 145.6 KB/sec)
Downloading: http://repo.maven.apache.org/maven2/org/codehaus/plexus/plexus-utils/3.0.24/plexus-utils-3.0.24.jar
Downloading: http://repo.maven.apache.org/maven2/org/beanshell/bsh/2.0b4/bsh-2.0b4.jar
Downloading: http://repo.maven.apache.org/maven2/org/apache/maven/shared/file-management/3.0.0/file-management-3.0.0.jar
Downloading: http://repo.maven.apache.org/maven2/org/apache/maven/shared/maven-shared-io/3.0.0/maven-shared-io-3.0.0.jar
Downloading: http://repo.maven.apache.org/maven2/org/apache/maven/shared/maven-shared-utils/3.0.0/maven-shared-utils-3.0.0.jar
Downloaded: http://repo.maven.apache.org/maven2/org/apache/maven/shared/maven-shared-io/3.0.0/maven-shared-io-3.0.0.jar (41 KB at 128.9 KB/sec)
Downloading: http://repo.maven.apache.org/maven2/commons-io/commons-io/2.4/commons-io-2.4.jar
Downloaded: http://repo.maven.apache.org/maven2/org/apache/maven/shared/file-management/3.0.0/file-management-3.0.0.jar (35 KB at 106.8 KB/sec)
Downloading: http://repo.maven.apache.org/maven2/com/google/code/findbugs/jsr305/2.0.1/jsr305-2.0.1.jar
Downloaded: http://repo.maven.apache.org/maven2/org/codehaus/plexus/plexus-utils/3.0.24/plexus-utils-3.0.24.jar (242 KB at 743.2 KB/sec)
Downloaded: http://repo.maven.apache.org/maven2/org/apache/maven/shared/maven-shared-utils/3.0.0/maven-shared-utils-3.0.0.jar (152 KB at 464.9 KB/sec)
Downloaded: http://repo.maven.apache.org/maven2/org/beanshell/bsh/2.0b4/bsh-2.0b4.jar (276 KB at 843.8 KB/sec)
Downloaded: http://repo.maven.apache.org/maven2/commons-io/commons-io/2.4/commons-io-2.4.jar (181 KB at 575.8 KB/sec)
Downloaded: http://repo.maven.apache.org/maven2/com/google/code/findbugs/jsr305/2.0.1/jsr305-2.0.1.jar (32 KB at 96.6 KB/sec)
[INFO] Source directory: /home/jenkins/workspace/products/ballerina-integrator/vscode/snippets/ei-snippets/org.wso2.integration.ballerina.util added.
[INFO] Source directory: /home/jenkins/workspace/products/ballerina-integrator/vscode/snippets/ei-snippets/some directory added.
[INFO] 
[INFO] --- maven-resources-plugin:2.5:resources (default-resources) @ ei-snippets ---
[debug] execute contextualize
[INFO] Using 'UTF-8' encoding to copy filtered resources.
[INFO] skip non existing resourceDirectory /home/jenkins/workspace/products/ballerina-integrator/vscode/snippets/ei-snippets/src/main/resources
[INFO] 
[INFO] --- maven-compiler-plugin:2.3.2:compile (default-compile) @ ei-snippets ---
[INFO] Compiling 5 source files to /home/jenkins/workspace/products/ballerina-integrator/vscode/snippets/ei-snippets/target/classes
[INFO] 
[INFO] --- maven-resources-plugin:2.5:testResources (default-testResources) @ ei-snippets ---
[debug] execute contextualize
[INFO] Using 'UTF-8' encoding to copy filtered resources.
[INFO] skip non existing resourceDirectory /home/jenkins/workspace/products/ballerina-integrator/vscode/snippets/ei-snippets/src/test/resources
[INFO] 
[INFO] --- maven-compiler-plugin:2.3.2:testCompile (default-testCompile) @ ei-snippets ---
[INFO] No sources to compile
[INFO] 
[INFO] --- maven-surefire-plugin:2.10:test (default-test) @ ei-snippets ---
[INFO] No tests to run.
[INFO] Surefire report directory: /home/jenkins/workspace/products/ballerina-integrator/vscode/snippets/ei-snippets/target/surefire-reports
Downloading: http://repo.maven.apache.org/maven2/org/apache/maven/surefire/surefire-testng/2.10/surefire-testng-2.10.pom
Downloaded: http://repo.maven.apache.org/maven2/org/apache/maven/surefire/surefire-testng/2.10/surefire-testng-2.10.pom (4 KB at 10.4 KB/sec)
Downloading: http://repo.maven.apache.org/maven2/org/apache/maven/maven-artifact/2.0/maven-artifact-2.0.pom
Downloaded: http://repo.maven.apache.org/maven2/org/apache/maven/maven-artifact/2.0/maven-artifact-2.0.pom (723 B at 2.2 KB/sec)
Downloading: http://repo.maven.apache.org/maven2/org/apache/maven/maven/2.0/maven-2.0.pom
Downloaded: http://repo.maven.apache.org/maven2/org/apache/maven/maven/2.0/maven-2.0.pom (9 KB at 26.5 KB/sec)
Downloading: http://repo.maven.apache.org/maven2/org/apache/maven/surefire/surefire-testng-utils/2.10/surefire-testng-utils-2.10.pom
Downloaded: http://repo.maven.apache.org/maven2/org/apache/maven/surefire/surefire-testng-utils/2.10/surefire-testng-utils-2.10.pom (3 KB at 8.3 KB/sec)
Downloading: http://repo.maven.apache.org/maven2/org/testng/testng/5.7/testng-5.7.pom
Downloaded: http://repo.maven.apache.org/maven2/org/testng/testng/5.7/testng-5.7.pom (12 KB at 36.1 KB/sec)
Downloading: http://repo.maven.apache.org/maven2/org/apache/maven/surefire/surefire-testng/2.10/surefire-testng-2.10.jar
Downloading: http://repo.maven.apache.org/maven2/org/apache/maven/surefire/surefire-testng-utils/2.10/surefire-testng-utils-2.10.jar
Downloading: http://repo.maven.apache.org/maven2/org/apache/maven/maven-artifact/2.0/maven-artifact-2.0.jar
Downloading: http://repo.maven.apache.org/maven2/org/codehaus/plexus/plexus-utils/1.0.4/plexus-utils-1.0.4.jar
Downloaded: http://repo.maven.apache.org/maven2/org/apache/maven/surefire/surefire-testng/2.10/surefire-testng-2.10.jar (32 KB at 99.7 KB/sec)
Downloaded: http://repo.maven.apache.org/maven2/org/apache/maven/maven-artifact/2.0/maven-artifact-2.0.jar (77 KB at 237.4 KB/sec)
Downloaded: http://repo.maven.apache.org/maven2/org/apache/maven/surefire/surefire-testng-utils/2.10/surefire-testng-utils-2.10.jar (19 KB at 58.1 KB/sec)
Downloaded: http://repo.maven.apache.org/maven2/org/codehaus/plexus/plexus-utils/1.0.4/plexus-utils-1.0.4.jar (160 KB at 492.2 KB/sec)

-------------------------------------------------------
 T E S T S
-------------------------------------------------------

Results :

Tests run: 0, Failures: 0, Errors: 0, Skipped: 0

[JENKINS] Recording test results
[INFO] 
[INFO] --- maven-jar-plugin:2.3.2:jar (default-jar) @ ei-snippets ---
[INFO] Building jar: /home/jenkins/workspace/products/ballerina-integrator/vscode/snippets/ei-snippets/target/ei-snippets-1.0.0.jar
[INFO] 
[INFO] --- maven-install-plugin:2.3.1:install (default-install) @ ei-snippets ---
[INFO] Installing /home/jenkins/workspace/products/ballerina-integrator/vscode/snippets/ei-snippets/target/ei-snippets-1.0.0.jar to /home/jenkins/workspace/products/ballerina-integrator/.repository/org/wso2/ballerina-integrator/ei-snippets/1.0.0/ei-snippets-1.0.0.jar
[INFO] Installing /home/jenkins/workspace/products/ballerina-integrator/vscode/snippets/ei-snippets/pom.xml to /home/jenkins/workspace/products/ballerina-integrator/.repository/org/wso2/ballerina-integrator/ei-snippets/1.0.0/ei-snippets-1.0.0.pom
[INFO] ------------------------------------------------------------------------
[INFO] Reactor Summary:
[INFO] 
[INFO] Ballerina Integrator .............................. SUCCESS [15.031s]
[INFO] doc-content ....................................... SUCCESS [12:14.231s]
[INFO] doc-generator ..................................... SUCCESS [58.351s]
[INFO] docs .............................................. SUCCESS [0.016s]
[INFO] ballerina-integrator-vscode-plugin ................ SUCCESS [46.052s]
[INFO] snippets .......................................... SUCCESS [0.014s]
[INFO] snippets-gen ...................................... SUCCESS [5.509s]
[INFO] ei-snippets ....................................... SUCCESS [4:00.611s]
[INFO] ------------------------------------------------------------------------
[INFO] BUILD SUCCESS
[INFO] ------------------------------------------------------------------------
[INFO] Total time: 18:24.453s
[INFO] Finished at: Thu Oct 03 17:13:27 UTC 2019
[INFO] Final Memory: 44M/189M
[INFO] ------------------------------------------------------------------------
Waiting for Jenkins to finish collecting data
ERROR: Asynchronous execution failure
java.util.concurrent.ExecutionException: java.io.IOException: Failed to create a temporary file in /build/jenkins-home/fingerprints/5a/eb
	at hudson.remoting.Channel$2.adapt(Channel.java:862)
	at hudson.remoting.Channel$2.adapt(Channel.java:857)
	at hudson.remoting.FutureAdapter.get(FutureAdapter.java:55)
	at hudson.maven.AbstractMavenBuilder.waitForAsynchronousExecutions(AbstractMavenBuilder.java:186)
	at hudson.maven.Maven3Builder.call(Maven3Builder.java:140)
	at hudson.maven.Maven3Builder.call(Maven3Builder.java:68)
	at hudson.remoting.UserRequest.perform(UserRequest.java:153)
	at hudson.remoting.UserRequest.perform(UserRequest.java:50)
	at hudson.remoting.Request$2.run(Request.java:336)
	at hudson.remoting.InterceptingExecutorService$1.call(InterceptingExecutorService.java:68)
	at java.util.concurrent.FutureTask.run(FutureTask.java:266)
	at java.util.concurrent.ThreadPoolExecutor.runWorker(ThreadPoolExecutor.java:1149)
	at java.util.concurrent.ThreadPoolExecutor$Worker.run(ThreadPoolExecutor.java:624)
	at java.lang.Thread.run(Thread.java:748)
Caused by: java.io.IOException: Failed to create a temporary file in /build/jenkins-home/fingerprints/5a/eb
	at hudson.util.AtomicFileWriter.<init>(AtomicFileWriter.java:68)
	at hudson.util.AtomicFileWriter.<init>(AtomicFileWriter.java:55)
	at hudson.model.Fingerprint.save(Fingerprint.java:1256)
	at hudson.model.Fingerprint.save(Fingerprint.java:1245)
	at hudson.model.Fingerprint.<init>(Fingerprint.java:882)
	at hudson.model.FingerprintMap.create(FingerprintMap.java:93)
	at hudson.model.FingerprintMap.create(FingerprintMap.java:47)
	at hudson.util.KeyedDataStorage.get(KeyedDataStorage.java:163)
	at hudson.model.FingerprintMap.get(FingerprintMap.java:82)
	at hudson.model.FingerprintMap.get(FingerprintMap.java:47)
	at hudson.util.KeyedDataStorage.getOrCreate(KeyedDataStorage.java:111)
	at hudson.model.FingerprintMap.getOrCreate(FingerprintMap.java:68)
	at hudson.maven.reporters.MavenFingerprinter$1.call(MavenFingerprinter.java:125)
	at hudson.maven.reporters.MavenFingerprinter$1.call(MavenFingerprinter.java:112)
	at hudson.maven.MavenBuild$ProxyImpl.execute(MavenBuild.java:424)
	at hudson.maven.MavenBuild$ProxyImpl2.execute(MavenBuild.java:556)
	at sun.reflect.GeneratedMethodAccessor657.invoke(Unknown Source)
	at sun.reflect.DelegatingMethodAccessorImpl.invoke(DelegatingMethodAccessorImpl.java:43)
	at java.lang.reflect.Method.invoke(Method.java:498)
	at hudson.model.Executor$2.call(Executor.java:913)
	at hudson.util.InterceptingProxy$1.invoke(InterceptingProxy.java:23)
	at com.sun.proxy.$Proxy110.execute(Unknown Source)
	at hudson.maven.MavenBuildProxy$Filter$AsyncInvoker.call(MavenBuildProxy.java:294)
	at hudson.remoting.UserRequest.perform(UserRequest.java:153)
	at hudson.remoting.UserRequest.perform(UserRequest.java:50)
	at hudson.remoting.Request$2.run(Request.java:336)
	at hudson.remoting.InterceptingExecutorService$1.call(InterceptingExecutorService.java:68)
	at org.jenkinsci.remoting.CallableDecorator.call(CallableDecorator.java:19)
	at hudson.remoting.CallableDecoratorList$1.call(CallableDecoratorList.java:21)
	at jenkins.util.ContextResettingExecutorService$2.call(ContextResettingExecutorService.java:46)
	at java.util.concurrent.FutureTask.run(FutureTask.java:266)
	at java.util.concurrent.ThreadPoolExecutor.runWorker(ThreadPoolExecutor.java:1142)
	at java.util.concurrent.ThreadPoolExecutor$Worker.run(ThreadPoolExecutor.java:617)
	at java.lang.Thread.run(Thread.java:748)
	at ......remote call to channel(Native Method)
	at hudson.remoting.Channel.attachCallSiteStackTrace(Channel.java:1545)
	at hudson.remoting.UserResponse.retrieve(UserRequest.java:253)
	at hudson.remoting.Channel$2.adapt(Channel.java:860)
	... 13 more
Caused by: java.io.IOException: Permission denied
	at java.io.UnixFileSystem.createFileExclusively(Native Method)
	at java.io.File.createTempFile(File.java:2024)
	at hudson.util.AtomicFileWriter.<init>(AtomicFileWriter.java:66)
	at hudson.util.AtomicFileWriter.<init>(AtomicFileWriter.java:55)
	at hudson.model.Fingerprint.save(Fingerprint.java:1256)
	at hudson.model.Fingerprint.save(Fingerprint.java:1245)
	at hudson.model.Fingerprint.<init>(Fingerprint.java:882)
	at hudson.model.FingerprintMap.create(FingerprintMap.java:93)
	at hudson.model.FingerprintMap.create(FingerprintMap.java:47)
	at hudson.util.KeyedDataStorage.get(KeyedDataStorage.java:163)
	at hudson.model.FingerprintMap.get(FingerprintMap.java:82)
	at hudson.model.FingerprintMap.get(FingerprintMap.java:47)
	at hudson.util.KeyedDataStorage.getOrCreate(KeyedDataStorage.java:111)
	at hudson.model.FingerprintMap.getOrCreate(FingerprintMap.java:68)
	at hudson.maven.reporters.MavenFingerprinter$1.call(MavenFingerprinter.java:125)
	at hudson.maven.reporters.MavenFingerprinter$1.call(MavenFingerprinter.java:112)
	at hudson.maven.MavenBuild$ProxyImpl.execute(MavenBuild.java:424)
	at hudson.maven.MavenBuild$ProxyImpl2.execute(MavenBuild.java:556)
	at sun.reflect.GeneratedMethodAccessor657.invoke(Unknown Source)
	at sun.reflect.DelegatingMethodAccessorImpl.invoke(DelegatingMethodAccessorImpl.java:43)
	at java.lang.reflect.Method.invoke(Method.java:498)
	at hudson.model.Executor$2.call(Executor.java:913)
	at hudson.util.InterceptingProxy$1.invoke(InterceptingProxy.java:23)
	at com.sun.proxy.$Proxy110.execute(Unknown Source)
	at hudson.maven.MavenBuildProxy$Filter$AsyncInvoker.call(MavenBuildProxy.java:294)
	at hudson.remoting.UserRequest.perform(UserRequest.java:153)
	at hudson.remoting.UserRequest.perform(UserRequest.java:50)
	at hudson.remoting.Request$2.run(Request.java:336)
	at hudson.remoting.InterceptingExecutorService$1.call(InterceptingExecutorService.java:68)
	at org.jenkinsci.remoting.CallableDecorator.call(CallableDecorator.java:19)
	at hudson.remoting.CallableDecoratorList$1.call(CallableDecoratorList.java:21)
	at jenkins.util.ContextResettingExecutorService$2.call(ContextResettingExecutorService.java:46)
	at java.util.concurrent.FutureTask.run(FutureTask.java:266)
	at java.util.concurrent.ThreadPoolExecutor.runWorker(ThreadPoolExecutor.java:1142)
	at java.util.concurrent.ThreadPoolExecutor$Worker.run(ThreadPoolExecutor.java:617)
	... 1 more
ERROR: Asynchronous execution failure
java.util.concurrent.ExecutionException: java.io.IOException: Failed to create a temporary file in /build/jenkins-home/fingerprints/5a/eb
	at hudson.remoting.Channel$2.adapt(Channel.java:862)
	at hudson.remoting.Channel$2.adapt(Channel.java:857)
	at hudson.remoting.FutureAdapter.get(FutureAdapter.java:55)
	at hudson.maven.AbstractMavenBuilder.waitForAsynchronousExecutions(AbstractMavenBuilder.java:186)
	at hudson.maven.Maven3Builder.call(Maven3Builder.java:140)
	at hudson.maven.Maven3Builder.call(Maven3Builder.java:68)
	at hudson.remoting.UserRequest.perform(UserRequest.java:153)
	at hudson.remoting.UserRequest.perform(UserRequest.java:50)
	at hudson.remoting.Request$2.run(Request.java:336)
	at hudson.remoting.InterceptingExecutorService$1.call(InterceptingExecutorService.java:68)
	at java.util.concurrent.FutureTask.run(FutureTask.java:266)
	at java.util.concurrent.ThreadPoolExecutor.runWorker(ThreadPoolExecutor.java:1149)
	at java.util.concurrent.ThreadPoolExecutor$Worker.run(ThreadPoolExecutor.java:624)
	at java.lang.Thread.run(Thread.java:748)
Caused by: java.io.IOException: Failed to create a temporary file in /build/jenkins-home/fingerprints/5a/eb
	at hudson.util.AtomicFileWriter.<init>(AtomicFileWriter.java:68)
	at hudson.util.AtomicFileWriter.<init>(AtomicFileWriter.java:55)
	at hudson.model.Fingerprint.save(Fingerprint.java:1256)
	at hudson.model.Fingerprint.save(Fingerprint.java:1245)
	at hudson.model.Fingerprint.<init>(Fingerprint.java:882)
	at hudson.model.FingerprintMap.create(FingerprintMap.java:93)
	at hudson.model.FingerprintMap.create(FingerprintMap.java:47)
	at hudson.util.KeyedDataStorage.get(KeyedDataStorage.java:163)
	at hudson.model.FingerprintMap.get(FingerprintMap.java:82)
	at hudson.model.FingerprintMap.get(FingerprintMap.java:47)
	at hudson.util.KeyedDataStorage.getOrCreate(KeyedDataStorage.java:111)
	at hudson.model.FingerprintMap.getOrCreate(FingerprintMap.java:68)
	at hudson.maven.reporters.MavenFingerprinter$1.call(MavenFingerprinter.java:125)
	at hudson.maven.reporters.MavenFingerprinter$1.call(MavenFingerprinter.java:112)
	at hudson.maven.MavenBuild$ProxyImpl.execute(MavenBuild.java:424)
	at hudson.maven.MavenBuild$ProxyImpl2.execute(MavenBuild.java:556)
	at sun.reflect.GeneratedMethodAccessor657.invoke(Unknown Source)
	at sun.reflect.DelegatingMethodAccessorImpl.invoke(DelegatingMethodAccessorImpl.java:43)
	at java.lang.reflect.Method.invoke(Method.java:498)
	at hudson.model.Executor$2.call(Executor.java:913)
	at hudson.util.InterceptingProxy$1.invoke(InterceptingProxy.java:23)
	at com.sun.proxy.$Proxy110.execute(Unknown Source)
	at hudson.maven.MavenBuildProxy$Filter$AsyncInvoker.call(MavenBuildProxy.java:294)
	at hudson.remoting.UserRequest.perform(UserRequest.java:153)
	at hudson.remoting.UserRequest.perform(UserRequest.java:50)
	at hudson.remoting.Request$2.run(Request.java:336)
	at hudson.remoting.InterceptingExecutorService$1.call(InterceptingExecutorService.java:68)
	at org.jenkinsci.remoting.CallableDecorator.call(CallableDecorator.java:19)
	at hudson.remoting.CallableDecoratorList$1.call(CallableDecoratorList.java:21)
	at jenkins.util.ContextResettingExecutorService$2.call(ContextResettingExecutorService.java:46)
	at java.util.concurrent.FutureTask.run(FutureTask.java:266)
	at java.util.concurrent.ThreadPoolExecutor.runWorker(ThreadPoolExecutor.java:1142)
	at java.util.concurrent.ThreadPoolExecutor$Worker.run(ThreadPoolExecutor.java:617)
	at java.lang.Thread.run(Thread.java:748)
	at ......remote call to channel(Native Method)
	at hudson.remoting.Channel.attachCallSiteStackTrace(Channel.java:1545)
	at hudson.remoting.UserResponse.retrieve(UserRequest.java:253)
	at hudson.remoting.Channel$2.adapt(Channel.java:860)
	... 13 more
Caused by: java.io.IOException: Permission denied
	at java.io.UnixFileSystem.createFileExclusively(Native Method)
	at java.io.File.createTempFile(File.java:2024)
	at hudson.util.AtomicFileWriter.<init>(AtomicFileWriter.java:66)
	at hudson.util.AtomicFileWriter.<init>(AtomicFileWriter.java:55)
	at hudson.model.Fingerprint.save(Fingerprint.java:1256)
	at hudson.model.Fingerprint.save(Fingerprint.java:1245)
	at hudson.model.Fingerprint.<init>(Fingerprint.java:882)
	at hudson.model.FingerprintMap.create(FingerprintMap.java:93)
	at hudson.model.FingerprintMap.create(FingerprintMap.java:47)
	at hudson.util.KeyedDataStorage.get(KeyedDataStorage.java:163)
	at hudson.model.FingerprintMap.get(FingerprintMap.java:82)
	at hudson.model.FingerprintMap.get(FingerprintMap.java:47)
	at hudson.util.KeyedDataStorage.getOrCreate(KeyedDataStorage.java:111)
	at hudson.model.FingerprintMap.getOrCreate(FingerprintMap.java:68)
	at hudson.maven.reporters.MavenFingerprinter$1.call(MavenFingerprinter.java:125)
	at hudson.maven.reporters.MavenFingerprinter$1.call(MavenFingerprinter.java:112)
	at hudson.maven.MavenBuild$ProxyImpl.execute(MavenBuild.java:424)
	at hudson.maven.MavenBuild$ProxyImpl2.execute(MavenBuild.java:556)
	at sun.reflect.GeneratedMethodAccessor657.invoke(Unknown Source)
	at sun.reflect.DelegatingMethodAccessorImpl.invoke(DelegatingMethodAccessorImpl.java:43)
	at java.lang.reflect.Method.invoke(Method.java:498)
	at hudson.model.Executor$2.call(Executor.java:913)
	at hudson.util.InterceptingProxy$1.invoke(InterceptingProxy.java:23)
	at com.sun.proxy.$Proxy110.execute(Unknown Source)
	at hudson.maven.MavenBuildProxy$Filter$AsyncInvoker.call(MavenBuildProxy.java:294)
	at hudson.remoting.UserRequest.perform(UserRequest.java:153)
	at hudson.remoting.UserRequest.perform(UserRequest.java:50)
	at hudson.remoting.Request$2.run(Request.java:336)
	at hudson.remoting.InterceptingExecutorService$1.call(InterceptingExecutorService.java:68)
	at org.jenkinsci.remoting.CallableDecorator.call(CallableDecorator.java:19)
	at hudson.remoting.CallableDecoratorList$1.call(CallableDecoratorList.java:21)
	at jenkins.util.ContextResettingExecutorService$2.call(ContextResettingExecutorService.java:46)
	at java.util.concurrent.FutureTask.run(FutureTask.java:266)
	at java.util.concurrent.ThreadPoolExecutor.runWorker(ThreadPoolExecutor.java:1142)
	at java.util.concurrent.ThreadPoolExecutor$Worker.run(ThreadPoolExecutor.java:617)
	... 1 more
[JENKINS] Archiving /home/jenkins/workspace/products/ballerina-integrator/docs/content/pom.xml to org.wso2.ballerina-integrator/doc-content/1.0.0/doc-content-1.0.0.pom
[JENKINS] Archiving /home/jenkins/workspace/products/ballerina-integrator/docs/pom.xml to org.wso2.ballerina-integrator/docs/1.0.0/docs-1.0.0.pom
[JENKINS] Archiving /home/jenkins/workspace/products/ballerina-integrator/docs/doc-generator/pom.xml to org.wso2.ballerina-integrator/doc-generator/1.0.0/doc-generator-1.0.0.pom
[JENKINS] Archiving /home/jenkins/workspace/products/ballerina-integrator/docs/doc-generator/target/doc-generator-1.0.0.jar to org.wso2.ballerina-integrator/doc-generator/1.0.0/doc-generator-1.0.0.jar
[JENKINS] Archiving /home/jenkins/workspace/products/ballerina-integrator/vscode/snippets/pom.xml to org.wso2.ballerina-integrator/snippets/1.0.0/snippets-1.0.0.pom
[JENKINS] Archiving /home/jenkins/workspace/products/ballerina-integrator/vscode/extension/pom.xml to org.wso2.ballerina-integrator/ballerina-integrator-vscode-plugin/1.0.0/ballerina-integrator-vscode-plugin-1.0.0.pom
[JENKINS] Archiving /home/jenkins/workspace/products/ballerina-integrator/pom.xml to org.wso2.ballerina-integrator/ballerina-integrator/1.0.0/ballerina-integrator-1.0.0.pom
[JENKINS] Archiving /home/jenkins/workspace/products/ballerina-integrator/vscode/snippets/ei-snippets/pom.xml to org.wso2.ballerina-integrator/ei-snippets/1.0.0/ei-snippets-1.0.0.pom
[JENKINS] Archiving /home/jenkins/workspace/products/ballerina-integrator/vscode/snippets/ei-snippets/target/ei-snippets-1.0.0.jar to org.wso2.ballerina-integrator/ei-snippets/1.0.0/ei-snippets-1.0.0.jar
[JENKINS] Archiving /home/jenkins/workspace/products/ballerina-integrator/vscode/snippets/snippets-gen/pom.xml to org.wso2.ballerina-integrator/snippets-gen/1.0.0/snippets-gen-1.0.0.pom
[JENKINS] Archiving /home/jenkins/workspace/products/ballerina-integrator/vscode/snippets/snippets-gen/target/snippets-gen-1.0.0.jar to org.wso2.ballerina-integrator/snippets-gen/1.0.0/snippets-gen-1.0.0.jar
channel stopped
Archiving artifacts
using settings config with name maven-settings-xml
Replacing all maven server entries not found in credentials list is false
Maven RedeployPublisher use remote ECS_PRODUCTION-24a5ea1ff6352 maven settings from : /tmp/settings4884334635727876528.xml
[INFO] Deployment in http://maven.wso2.org/nexus/content/repositories/releases/ (id=wso2.releases,uniqueVersion=true)
Deploying the main artifact ballerina-integrator-1.0.0.pom
Uploading: http://maven.wso2.org/nexus/content/repositories/releases/org/wso2/ballerina-integrator/ballerina-integrator/1.0.0/ballerina-integrator-1.0.0.pom
ERROR: Failed to deploy artifacts: Could not transfer artifact org.wso2.ballerina-integrator:ballerina-integrator:pom:1.0.0 from/to wso2.releases (http://maven.wso2.org/nexus/content/repositories/releases/): Failed to transfer file: http://maven.wso2.org/nexus/content/repositories/releases/org/wso2/ballerina-integrator/ballerina-integrator/1.0.0/ballerina-integrator-1.0.0.pom. Return code is: 400, ReasonPhrase: Bad Request.
org.apache.maven.artifact.deployer.ArtifactDeploymentException: Failed to deploy artifacts: Could not transfer artifact org.wso2.ballerina-integrator:ballerina-integrator:pom:1.0.0 from/to wso2.releases (http://maven.wso2.org/nexus/content/repositories/releases/): Failed to transfer file: http://maven.wso2.org/nexus/content/repositories/releases/org/wso2/ballerina-integrator/ballerina-integrator/1.0.0/ballerina-integrator-1.0.0.pom. Return code is: 400, ReasonPhrase: Bad Request.
	at org.apache.maven.artifact.deployer.DefaultArtifactDeployer.deploy(DefaultArtifactDeployer.java:143)
	at hudson.maven.reporters.MavenArtifactRecord.deploy(MavenArtifactRecord.java:193)
	at hudson.maven.RedeployPublisher.perform(RedeployPublisher.java:176)
	at hudson.tasks.BuildStepMonitor$1.perform(BuildStepMonitor.java:20)
	at hudson.model.AbstractBuild$AbstractBuildExecution.perform(AbstractBuild.java:779)
	at hudson.model.AbstractBuild$AbstractBuildExecution.performAllBuildSteps(AbstractBuild.java:720)
	at hudson.maven.MavenModuleSetBuild$MavenModuleSetBuildExecution.post2(MavenModuleSetBuild.java:1067)
	at hudson.model.AbstractBuild$AbstractBuildExecution.post(AbstractBuild.java:665)
	at hudson.model.Run.execute(Run.java:1753)
	at hudson.maven.MavenModuleSetBuild.run(MavenModuleSetBuild.java:544)
	at hudson.model.ResourceController.execute(ResourceController.java:98)
	at hudson.model.Executor.run(Executor.java:405)
Caused by: org.eclipse.aether.deployment.DeploymentException: Failed to deploy artifacts: Could not transfer artifact org.wso2.ballerina-integrator:ballerina-integrator:pom:1.0.0 from/to wso2.releases (http://maven.wso2.org/nexus/content/repositories/releases/): Failed to transfer file: http://maven.wso2.org/nexus/content/repositories/releases/org/wso2/ballerina-integrator/ballerina-integrator/1.0.0/ballerina-integrator-1.0.0.pom. Return code is: 400, ReasonPhrase: Bad Request.
	at org.eclipse.aether.internal.impl.DefaultDeployer.deploy(DefaultDeployer.java:341)
	at org.eclipse.aether.internal.impl.DefaultDeployer.deploy(DefaultDeployer.java:269)
	at org.eclipse.aether.internal.impl.DefaultRepositorySystem.deploy(DefaultRepositorySystem.java:413)
	at org.apache.maven.artifact.deployer.DefaultArtifactDeployer.deploy(DefaultArtifactDeployer.java:139)
	... 11 more
Caused by: org.eclipse.aether.transfer.ArtifactTransferException: Could not transfer artifact org.wso2.ballerina-integrator:ballerina-integrator:pom:1.0.0 from/to wso2.releases (http://maven.wso2.org/nexus/content/repositories/releases/): Failed to transfer file: http://maven.wso2.org/nexus/content/repositories/releases/org/wso2/ballerina-integrator/ballerina-integrator/1.0.0/ballerina-integrator-1.0.0.pom. Return code is: 400, ReasonPhrase: Bad Request.
	at org.eclipse.aether.connector.wagon.WagonRepositoryConnector$6.wrap(WagonRepositoryConnector.java:1016)
	at org.eclipse.aether.connector.wagon.WagonRepositoryConnector$6.wrap(WagonRepositoryConnector.java:1004)
	at org.eclipse.aether.connector.wagon.WagonRepositoryConnector$PutTask.run(WagonRepositoryConnector.java:895)
	at org.eclipse.aether.connector.wagon.WagonRepositoryConnector.put(WagonRepositoryConnector.java:522)
	at org.eclipse.aether.internal.impl.DefaultDeployer.deploy(DefaultDeployer.java:335)
	... 14 more
Caused by: org.apache.maven.wagon.TransferFailedException: Failed to transfer file: http://maven.wso2.org/nexus/content/repositories/releases/org/wso2/ballerina-integrator/ballerina-integrator/1.0.0/ballerina-integrator-1.0.0.pom. Return code is: 400, ReasonPhrase: Bad Request.
	at org.apache.maven.wagon.shared.http4.AbstractHttpClientWagon.put(AbstractHttpClientWagon.java:626)
	at org.apache.maven.wagon.shared.http4.AbstractHttpClientWagon.put(AbstractHttpClientWagon.java:524)
	at org.apache.maven.wagon.shared.http4.AbstractHttpClientWagon.put(AbstractHttpClientWagon.java:505)
	at org.apache.maven.wagon.shared.http4.AbstractHttpClientWagon.put(AbstractHttpClientWagon.java:485)
	at org.eclipse.aether.connector.wagon.WagonRepositoryConnector$PutTask.run(WagonRepositoryConnector.java:871)
	... 16 more
[INFO] Deployment failed after 0.23 sec
Build step 'Deploy artifacts to Maven repository' changed build result to FAILURE
[BFA] Scanning build for known causes...
[BFA] Found failure cause(s):
[BFA] Failed to deploy artifacts from category DeployError
[BFA] Done. 1s
Not sending mail to unregistered user [email protected]
Not sending mail to unregistered user [email protected]
Not sending mail to unregistered user [email protected]
Not sending mail to unregistered user [email protected]
Not sending mail to unregistered user [email protected]
Sending e-mails to: [email protected] [email protected] [email protected]
Finished: FAILURE