SuccessConsole Output

Skipping 132 KB.. Full Log
erenceFunctionExtensionInvalidParameterTypeInFourthArgument
DateDifferenceFunctionExtensionFirstArgumetNullTestCase
Events{ @timestamp = 1644963876340, inEvents = [Event{timestamp=1644963876340, data=[IBM, null, 2], isExpired=false}], RemoveEvents = null }
Events{ @timestamp = 1644963876340, inEvents = [Event{timestamp=1644963876340, data=[IBM, null, 2], isExpired=false}], RemoveEvents = null }
DateDifferenceFunctionExtensionThirdArgumetNullTestCase
Events{ @timestamp = 1644963876445, inEvents = [Event{timestamp=1644963876445, data=[IBM, null, 2], isExpired=false}], RemoveEvents = null }
Events{ @timestamp = 1644963876445, inEvents = [Event{timestamp=1644963876445, data=[IBM, null, 2], isExpired=false}], RemoveEvents = null }
DateDifferenceFunctionExtensionFirstDateInvalidFormatTestCase
Error in 'd3034646-4d7d-4591-9514-98fc253417e6' after consuming events from Stream 'inputStream', Provided format yyyy-MM-dd HH:mm:ss does not match with the timestamp 2014:11:11 13:23:44Unparseable date: "2014:11:11 13:23:44" does not match (\p{Nd}++)\Q-\E(\p{Nd}++)\Q-\E(\p{Nd}++)\Q \E(\p{Nd}++)\Q:\E(\p{Nd}++)\Q:\E(\p{Nd}++). Exception on class 'io.siddhi.extension.execution.time.DateDifferenceFunctionExtension'. Hence, dropping event '[IBM, 2014:11:11 13:23:44, yyyy-MM-dd HH:mm:ss, 2014-11-9 13:23:44, yyyy-MM-dd HH:mm:ss, 1415692424000, 1415519624000]'
io.siddhi.core.exception.SiddhiAppRuntimeException: Provided format yyyy-MM-dd HH:mm:ss does not match with the timestamp 2014:11:11 13:23:44Unparseable date: "2014:11:11 13:23:44" does not match (\p{Nd}++)\Q-\E(\p{Nd}++)\Q-\E(\p{Nd}++)\Q \E(\p{Nd}++)\Q:\E(\p{Nd}++)\Q:\E(\p{Nd}++). Exception on class 'io.siddhi.extension.execution.time.DateDifferenceFunctionExtension'
	at io.siddhi.core.executor.function.FunctionExecutor.execute(FunctionExecutor.java:106) ~[siddhi-core-5.1.21.jar:?]
	at io.siddhi.core.query.selector.attribute.processor.AttributeProcessor.process(AttributeProcessor.java:41) ~[siddhi-core-5.1.21.jar:?]
	at io.siddhi.core.query.selector.QuerySelector.processNoGroupBy(QuerySelector.java:173) ~[siddhi-core-5.1.21.jar:?]
	at io.siddhi.core.query.selector.QuerySelector.process(QuerySelector.java:88) ~[siddhi-core-5.1.21.jar:?]
	at io.siddhi.core.query.input.ProcessStreamReceiver.processAndClear(ProcessStreamReceiver.java:182) ~[siddhi-core-5.1.21.jar:?]
	at io.siddhi.core.query.input.ProcessStreamReceiver.process(ProcessStreamReceiver.java:89) ~[siddhi-core-5.1.21.jar:?]
	at io.siddhi.core.query.input.ProcessStreamReceiver.receive(ProcessStreamReceiver.java:178) ~[siddhi-core-5.1.21.jar:?]
	at io.siddhi.core.stream.StreamJunction.sendData(StreamJunction.java:272) ~[siddhi-core-5.1.21.jar:?]
	at io.siddhi.core.stream.StreamJunction.access$200(StreamJunction.java:65) [siddhi-core-5.1.21.jar:?]
	at io.siddhi.core.stream.StreamJunction$Publisher.send(StreamJunction.java:533) [siddhi-core-5.1.21.jar:?]
	at io.siddhi.core.stream.input.InputDistributor.send(InputDistributor.java:49) [siddhi-core-5.1.21.jar:?]
	at io.siddhi.core.stream.input.InputEntryValve.send(InputEntryValve.java:75) [siddhi-core-5.1.21.jar:?]
	at io.siddhi.core.stream.input.InputHandler.send(InputHandler.java:53) [siddhi-core-5.1.21.jar:?]
	at io.siddhi.extension.execution.time.DateDifferenceFunctionExtensionTestCase.dateDifferenceFunctionExtensionTest2(DateDifferenceFunctionExtensionTestCase.java:134) [test-classes/:?]
	at sun.reflect.NativeMethodAccessorImpl.invoke0(Native Method) ~[?:1.8.0_171]
	at sun.reflect.NativeMethodAccessorImpl.invoke(NativeMethodAccessorImpl.java:62) ~[?:1.8.0_171]
	at sun.reflect.DelegatingMethodAccessorImpl.invoke(DelegatingMethodAccessorImpl.java:43) ~[?:1.8.0_171]
	at java.lang.reflect.Method.invoke(Method.java:498) ~[?:1.8.0_171]
	at org.testng.internal.MethodInvocationHelper.invokeMethod(MethodInvocationHelper.java:80) [testng-6.8.jar:?]
	at org.testng.internal.Invoker.invokeMethod(Invoker.java:714) [testng-6.8.jar:?]
	at org.testng.internal.Invoker.invokeTestMethod(Invoker.java:901) [testng-6.8.jar:?]
	at org.testng.internal.Invoker.invokeTestMethods(Invoker.java:1231) [testng-6.8.jar:?]
	at org.testng.internal.TestMethodWorker.invokeTestMethods(TestMethodWorker.java:127) [testng-6.8.jar:?]
	at org.testng.internal.TestMethodWorker.run(TestMethodWorker.java:111) [testng-6.8.jar:?]
	at org.testng.TestRunner.privateRun(TestRunner.java:767) [testng-6.8.jar:?]
	at org.testng.TestRunner.run(TestRunner.java:617) [testng-6.8.jar:?]
	at org.testng.SuiteRunner.runTest(SuiteRunner.java:334) [testng-6.8.jar:?]
	at org.testng.SuiteRunner.runSequentially(SuiteRunner.java:329) [testng-6.8.jar:?]
	at org.testng.SuiteRunner.privateRun(SuiteRunner.java:291) [testng-6.8.jar:?]
	at org.testng.SuiteRunner.run(SuiteRunner.java:240) [testng-6.8.jar:?]
	at org.testng.SuiteRunnerWorker.runSuite(SuiteRunnerWorker.java:52) [testng-6.8.jar:?]
	at org.testng.SuiteRunnerWorker.run(SuiteRunnerWorker.java:86) [testng-6.8.jar:?]
	at org.testng.TestNG.runSuitesSequentially(TestNG.java:1198) [testng-6.8.jar:?]
	at org.testng.TestNG.runSuitesLocally(TestNG.java:1123) [testng-6.8.jar:?]
	at org.testng.TestNG.run(TestNG.java:1031) [testng-6.8.jar:?]
	at org.apache.maven.surefire.testng.TestNGExecutor.run(TestNGExecutor.java:281) [surefire-testng-2.19.1.jar:2.19.1]
	at org.apache.maven.surefire.testng.TestNGXmlTestSuite.execute(TestNGXmlTestSuite.java:75) [surefire-testng-2.19.1.jar:2.19.1]
	at org.apache.maven.surefire.testng.TestNGProvider.invoke(TestNGProvider.java:121) [surefire-testng-2.19.1.jar:2.19.1]
	at org.apache.maven.surefire.booter.ForkedBooter.invokeProviderInSameClassLoader(ForkedBooter.java:290) [surefire-booter-2.19.1.jar:2.19.1]
	at org.apache.maven.surefire.booter.ForkedBooter.runSuitesInProcess(ForkedBooter.java:242) [surefire-booter-2.19.1.jar:2.19.1]
	at org.apache.maven.surefire.booter.ForkedBooter.main(ForkedBooter.java:121) [surefire-booter-2.19.1.jar:2.19.1]
Caused by: io.siddhi.core.exception.SiddhiAppRuntimeException: Provided format yyyy-MM-dd HH:mm:ss does not match with the timestamp 2014:11:11 13:23:44Unparseable date: "2014:11:11 13:23:44" does not match (\p{Nd}++)\Q-\E(\p{Nd}++)\Q-\E(\p{Nd}++)\Q \E(\p{Nd}++)\Q:\E(\p{Nd}++)\Q:\E(\p{Nd}++)
	at io.siddhi.extension.execution.time.DateDifferenceFunctionExtension.execute(DateDifferenceFunctionExtension.java:282) ~[classes/:?]
	at io.siddhi.core.executor.function.FunctionExecutor.execute(FunctionExecutor.java:100) ~[siddhi-core-5.1.21.jar:?]
	... 40 more
Caused by: java.text.ParseException: Unparseable date: "2014:11:11 13:23:44" does not match (\p{Nd}++)\Q-\E(\p{Nd}++)\Q-\E(\p{Nd}++)\Q \E(\p{Nd}++)\Q:\E(\p{Nd}++)\Q:\E(\p{Nd}++)
	at org.apache.commons.lang3.time.FastDateParser.parse(FastDateParser.java:289) ~[commons-lang3-3.3.2.jar:3.3.2]
	at org.apache.commons.lang3.time.FastDateFormat.parse(FastDateFormat.java:487) ~[commons-lang3-3.3.2.jar:3.3.2]
	at io.siddhi.extension.execution.time.DateDifferenceFunctionExtension.execute(DateDifferenceFunctionExtension.java:276) ~[classes/:?]
	at io.siddhi.core.executor.function.FunctionExecutor.execute(FunctionExecutor.java:100) ~[siddhi-core-5.1.21.jar:?]
	... 40 more
Error in 'd3034646-4d7d-4591-9514-98fc253417e6' after consuming events from Stream 'inputStream', Provided format yyyy-MM-dd HH:mm:ss does not match with the timestamp 2015:11:11 13:23:44Unparseable date: "2015:11:11 13:23:44" does not match (\p{Nd}++)\Q-\E(\p{Nd}++)\Q-\E(\p{Nd}++)\Q \E(\p{Nd}++)\Q:\E(\p{Nd}++)\Q:\E(\p{Nd}++). Exception on class 'io.siddhi.extension.execution.time.DateDifferenceFunctionExtension'. Hence, dropping event '[IBM, 2015:11:11 13:23:44, yyyy-MM-dd HH:mm:ss, 2014-11-9 13:23:44, yyyy-MM-dd HH:mm:ss, 1415692424000, 1415519624000]'
io.siddhi.core.exception.SiddhiAppRuntimeException: Provided format yyyy-MM-dd HH:mm:ss does not match with the timestamp 2015:11:11 13:23:44Unparseable date: "2015:11:11 13:23:44" does not match (\p{Nd}++)\Q-\E(\p{Nd}++)\Q-\E(\p{Nd}++)\Q \E(\p{Nd}++)\Q:\E(\p{Nd}++)\Q:\E(\p{Nd}++). Exception on class 'io.siddhi.extension.execution.time.DateDifferenceFunctionExtension'
	at io.siddhi.core.executor.function.FunctionExecutor.execute(FunctionExecutor.java:106) ~[siddhi-core-5.1.21.jar:?]
	at io.siddhi.core.query.selector.attribute.processor.AttributeProcessor.process(AttributeProcessor.java:41) ~[siddhi-core-5.1.21.jar:?]
	at io.siddhi.core.query.selector.QuerySelector.processNoGroupBy(QuerySelector.java:173) ~[siddhi-core-5.1.21.jar:?]
	at io.siddhi.core.query.selector.QuerySelector.process(QuerySelector.java:88) ~[siddhi-core-5.1.21.jar:?]
	at io.siddhi.core.query.input.ProcessStreamReceiver.processAndClear(ProcessStreamReceiver.java:182) ~[siddhi-core-5.1.21.jar:?]
	at io.siddhi.core.query.input.ProcessStreamReceiver.process(ProcessStreamReceiver.java:89) ~[siddhi-core-5.1.21.jar:?]
	at io.siddhi.core.query.input.ProcessStreamReceiver.receive(ProcessStreamReceiver.java:178) ~[siddhi-core-5.1.21.jar:?]
	at io.siddhi.core.stream.StreamJunction.sendData(StreamJunction.java:272) ~[siddhi-core-5.1.21.jar:?]
	at io.siddhi.core.stream.StreamJunction.access$200(StreamJunction.java:65) [siddhi-core-5.1.21.jar:?]
	at io.siddhi.core.stream.StreamJunction$Publisher.send(StreamJunction.java:533) [siddhi-core-5.1.21.jar:?]
	at io.siddhi.core.stream.input.InputDistributor.send(InputDistributor.java:49) [siddhi-core-5.1.21.jar:?]
	at io.siddhi.core.stream.input.InputEntryValve.send(InputEntryValve.java:75) [siddhi-core-5.1.21.jar:?]
	at io.siddhi.core.stream.input.InputHandler.send(InputHandler.java:53) [siddhi-core-5.1.21.jar:?]
	at io.siddhi.extension.execution.time.DateDifferenceFunctionExtensionTestCase.dateDifferenceFunctionExtensionTest2(DateDifferenceFunctionExtensionTestCase.java:138) [test-classes/:?]
	at sun.reflect.NativeMethodAccessorImpl.invoke0(Native Method) ~[?:1.8.0_171]
	at sun.reflect.NativeMethodAccessorImpl.invoke(NativeMethodAccessorImpl.java:62) ~[?:1.8.0_171]
	at sun.reflect.DelegatingMethodAccessorImpl.invoke(DelegatingMethodAccessorImpl.java:43) ~[?:1.8.0_171]
	at java.lang.reflect.Method.invoke(Method.java:498) ~[?:1.8.0_171]
	at org.testng.internal.MethodInvocationHelper.invokeMethod(MethodInvocationHelper.java:80) [testng-6.8.jar:?]
	at org.testng.internal.Invoker.invokeMethod(Invoker.java:714) [testng-6.8.jar:?]
	at org.testng.internal.Invoker.invokeTestMethod(Invoker.java:901) [testng-6.8.jar:?]
	at org.testng.internal.Invoker.invokeTestMethods(Invoker.java:1231) [testng-6.8.jar:?]
	at org.testng.internal.TestMethodWorker.invokeTestMethods(TestMethodWorker.java:127) [testng-6.8.jar:?]
	at org.testng.internal.TestMethodWorker.run(TestMethodWorker.java:111) [testng-6.8.jar:?]
	at org.testng.TestRunner.privateRun(TestRunner.java:767) [testng-6.8.jar:?]
	at org.testng.TestRunner.run(TestRunner.java:617) [testng-6.8.jar:?]
	at org.testng.SuiteRunner.runTest(SuiteRunner.java:334) [testng-6.8.jar:?]
	at org.testng.SuiteRunner.runSequentially(SuiteRunner.java:329) [testng-6.8.jar:?]
	at org.testng.SuiteRunner.privateRun(SuiteRunner.java:291) [testng-6.8.jar:?]
	at org.testng.SuiteRunner.run(SuiteRunner.java:240) [testng-6.8.jar:?]
	at org.testng.SuiteRunnerWorker.runSuite(SuiteRunnerWorker.java:52) [testng-6.8.jar:?]
	at org.testng.SuiteRunnerWorker.run(SuiteRunnerWorker.java:86) [testng-6.8.jar:?]
	at org.testng.TestNG.runSuitesSequentially(TestNG.java:1198) [testng-6.8.jar:?]
	at org.testng.TestNG.runSuitesLocally(TestNG.java:1123) [testng-6.8.jar:?]
	at org.testng.TestNG.run(TestNG.java:1031) [testng-6.8.jar:?]
	at org.apache.maven.surefire.testng.TestNGExecutor.run(TestNGExecutor.java:281) [surefire-testng-2.19.1.jar:2.19.1]
	at org.apache.maven.surefire.testng.TestNGXmlTestSuite.execute(TestNGXmlTestSuite.java:75) [surefire-testng-2.19.1.jar:2.19.1]
	at org.apache.maven.surefire.testng.TestNGProvider.invoke(TestNGProvider.java:121) [surefire-testng-2.19.1.jar:2.19.1]
	at org.apache.maven.surefire.booter.ForkedBooter.invokeProviderInSameClassLoader(ForkedBooter.java:290) [surefire-booter-2.19.1.jar:2.19.1]
	at org.apache.maven.surefire.booter.ForkedBooter.runSuitesInProcess(ForkedBooter.java:242) [surefire-booter-2.19.1.jar:2.19.1]
	at org.apache.maven.surefire.booter.ForkedBooter.main(ForkedBooter.java:121) [surefire-booter-2.19.1.jar:2.19.1]
Caused by: io.siddhi.core.exception.SiddhiAppRuntimeException: Provided format yyyy-MM-dd HH:mm:ss does not match with the timestamp 2015:11:11 13:23:44Unparseable date: "2015:11:11 13:23:44" does not match (\p{Nd}++)\Q-\E(\p{Nd}++)\Q-\E(\p{Nd}++)\Q \E(\p{Nd}++)\Q:\E(\p{Nd}++)\Q:\E(\p{Nd}++)
	at io.siddhi.extension.execution.time.DateDifferenceFunctionExtension.execute(DateDifferenceFunctionExtension.java:282) ~[classes/:?]
	at io.siddhi.core.executor.function.FunctionExecutor.execute(FunctionExecutor.java:100) ~[siddhi-core-5.1.21.jar:?]
	... 40 more
Caused by: java.text.ParseException: Unparseable date: "2015:11:11 13:23:44" does not match (\p{Nd}++)\Q-\E(\p{Nd}++)\Q-\E(\p{Nd}++)\Q \E(\p{Nd}++)\Q:\E(\p{Nd}++)\Q:\E(\p{Nd}++)
	at org.apache.commons.lang3.time.FastDateParser.parse(FastDateParser.java:289) ~[commons-lang3-3.3.2.jar:3.3.2]
	at org.apache.commons.lang3.time.FastDateFormat.parse(FastDateFormat.java:487) ~[commons-lang3-3.3.2.jar:3.3.2]
	at io.siddhi.extension.execution.time.DateDifferenceFunctionExtension.execute(DateDifferenceFunctionExtension.java:276) ~[classes/:?]
	at io.siddhi.core.executor.function.FunctionExecutor.execute(FunctionExecutor.java:100) ~[siddhi-core-5.1.21.jar:?]
	... 40 more
DateDifferenceFunctionExtensionSecondDateInvalidFormatTestCase
Error in 'f12d218d-c579-4089-8dc3-29d1d3389776' after consuming events from Stream 'inputStream', Provided format yyyy-MM-dd HH:mm:ss does not match with the timestamp 2014:11:9 13:23:44Unparseable date: "2014:11:9 13:23:44" does not match (\p{Nd}++)\Q-\E(\p{Nd}++)\Q-\E(\p{Nd}++)\Q \E(\p{Nd}++)\Q:\E(\p{Nd}++)\Q:\E(\p{Nd}++). Exception on class 'io.siddhi.extension.execution.time.DateDifferenceFunctionExtension'. Hence, dropping event '[IBM, 2014-11-11 13:23:44, yyyy-MM-dd HH:mm:ss, 2014:11:9 13:23:44, yyyy-MM-dd HH:mm:ss, 1415692424000, 1415519624000]'
io.siddhi.core.exception.SiddhiAppRuntimeException: Provided format yyyy-MM-dd HH:mm:ss does not match with the timestamp 2014:11:9 13:23:44Unparseable date: "2014:11:9 13:23:44" does not match (\p{Nd}++)\Q-\E(\p{Nd}++)\Q-\E(\p{Nd}++)\Q \E(\p{Nd}++)\Q:\E(\p{Nd}++)\Q:\E(\p{Nd}++). Exception on class 'io.siddhi.extension.execution.time.DateDifferenceFunctionExtension'
	at io.siddhi.core.executor.function.FunctionExecutor.execute(FunctionExecutor.java:106) ~[siddhi-core-5.1.21.jar:?]
	at io.siddhi.core.query.selector.attribute.processor.AttributeProcessor.process(AttributeProcessor.java:41) ~[siddhi-core-5.1.21.jar:?]
	at io.siddhi.core.query.selector.QuerySelector.processNoGroupBy(QuerySelector.java:173) ~[siddhi-core-5.1.21.jar:?]
	at io.siddhi.core.query.selector.QuerySelector.process(QuerySelector.java:88) ~[siddhi-core-5.1.21.jar:?]
	at io.siddhi.core.query.input.ProcessStreamReceiver.processAndClear(ProcessStreamReceiver.java:182) ~[siddhi-core-5.1.21.jar:?]
	at io.siddhi.core.query.input.ProcessStreamReceiver.process(ProcessStreamReceiver.java:89) ~[siddhi-core-5.1.21.jar:?]
	at io.siddhi.core.query.input.ProcessStreamReceiver.receive(ProcessStreamReceiver.java:178) ~[siddhi-core-5.1.21.jar:?]
	at io.siddhi.core.stream.StreamJunction.sendData(StreamJunction.java:272) ~[siddhi-core-5.1.21.jar:?]
	at io.siddhi.core.stream.StreamJunction.access$200(StreamJunction.java:65) [siddhi-core-5.1.21.jar:?]
	at io.siddhi.core.stream.StreamJunction$Publisher.send(StreamJunction.java:533) [siddhi-core-5.1.21.jar:?]
	at io.siddhi.core.stream.input.InputDistributor.send(InputDistributor.java:49) [siddhi-core-5.1.21.jar:?]
	at io.siddhi.core.stream.input.InputEntryValve.send(InputEntryValve.java:75) [siddhi-core-5.1.21.jar:?]
	at io.siddhi.core.stream.input.InputHandler.send(InputHandler.java:53) [siddhi-core-5.1.21.jar:?]
	at io.siddhi.extension.execution.time.DateDifferenceFunctionExtensionTestCase.dateDifferenceFunctionExtensionTest3(DateDifferenceFunctionExtensionTestCase.java:179) [test-classes/:?]
	at sun.reflect.NativeMethodAccessorImpl.invoke0(Native Method) ~[?:1.8.0_171]
	at sun.reflect.NativeMethodAccessorImpl.invoke(NativeMethodAccessorImpl.java:62) ~[?:1.8.0_171]
	at sun.reflect.DelegatingMethodAccessorImpl.invoke(DelegatingMethodAccessorImpl.java:43) ~[?:1.8.0_171]
	at java.lang.reflect.Method.invoke(Method.java:498) ~[?:1.8.0_171]
	at org.testng.internal.MethodInvocationHelper.invokeMethod(MethodInvocationHelper.java:80) [testng-6.8.jar:?]
	at org.testng.internal.Invoker.invokeMethod(Invoker.java:714) [testng-6.8.jar:?]
	at org.testng.internal.Invoker.invokeTestMethod(Invoker.java:901) [testng-6.8.jar:?]
	at org.testng.internal.Invoker.invokeTestMethods(Invoker.java:1231) [testng-6.8.jar:?]
	at org.testng.internal.TestMethodWorker.invokeTestMethods(TestMethodWorker.java:127) [testng-6.8.jar:?]
	at org.testng.internal.TestMethodWorker.run(TestMethodWorker.java:111) [testng-6.8.jar:?]
	at org.testng.TestRunner.privateRun(TestRunner.java:767) [testng-6.8.jar:?]
	at org.testng.TestRunner.run(TestRunner.java:617) [testng-6.8.jar:?]
	at org.testng.SuiteRunner.runTest(SuiteRunner.java:334) [testng-6.8.jar:?]
	at org.testng.SuiteRunner.runSequentially(SuiteRunner.java:329) [testng-6.8.jar:?]
	at org.testng.SuiteRunner.privateRun(SuiteRunner.java:291) [testng-6.8.jar:?]
	at org.testng.SuiteRunner.run(SuiteRunner.java:240) [testng-6.8.jar:?]
	at org.testng.SuiteRunnerWorker.runSuite(SuiteRunnerWorker.java:52) [testng-6.8.jar:?]
	at org.testng.SuiteRunnerWorker.run(SuiteRunnerWorker.java:86) [testng-6.8.jar:?]
	at org.testng.TestNG.runSuitesSequentially(TestNG.java:1198) [testng-6.8.jar:?]
	at org.testng.TestNG.runSuitesLocally(TestNG.java:1123) [testng-6.8.jar:?]
	at org.testng.TestNG.run(TestNG.java:1031) [testng-6.8.jar:?]
	at org.apache.maven.surefire.testng.TestNGExecutor.run(TestNGExecutor.java:281) [surefire-testng-2.19.1.jar:2.19.1]
	at org.apache.maven.surefire.testng.TestNGXmlTestSuite.execute(TestNGXmlTestSuite.java:75) [surefire-testng-2.19.1.jar:2.19.1]
	at org.apache.maven.surefire.testng.TestNGProvider.invoke(TestNGProvider.java:121) [surefire-testng-2.19.1.jar:2.19.1]
	at org.apache.maven.surefire.booter.ForkedBooter.invokeProviderInSameClassLoader(ForkedBooter.java:290) [surefire-booter-2.19.1.jar:2.19.1]
	at org.apache.maven.surefire.booter.ForkedBooter.runSuitesInProcess(ForkedBooter.java:242) [surefire-booter-2.19.1.jar:2.19.1]
	at org.apache.maven.surefire.booter.ForkedBooter.main(ForkedBooter.java:121) [surefire-booter-2.19.1.jar:2.19.1]
Caused by: io.siddhi.core.exception.SiddhiAppRuntimeException: Provided format yyyy-MM-dd HH:mm:ss does not match with the timestamp 2014:11:9 13:23:44Unparseable date: "2014:11:9 13:23:44" does not match (\p{Nd}++)\Q-\E(\p{Nd}++)\Q-\E(\p{Nd}++)\Q \E(\p{Nd}++)\Q:\E(\p{Nd}++)\Q:\E(\p{Nd}++)
	at io.siddhi.extension.execution.time.DateDifferenceFunctionExtension.execute(DateDifferenceFunctionExtension.java:295) ~[classes/:?]
	at io.siddhi.core.executor.function.FunctionExecutor.execute(FunctionExecutor.java:100) ~[siddhi-core-5.1.21.jar:?]
	... 40 more
Caused by: java.text.ParseException: Unparseable date: "2014:11:9 13:23:44" does not match (\p{Nd}++)\Q-\E(\p{Nd}++)\Q-\E(\p{Nd}++)\Q \E(\p{Nd}++)\Q:\E(\p{Nd}++)\Q:\E(\p{Nd}++)
	at org.apache.commons.lang3.time.FastDateParser.parse(FastDateParser.java:289) ~[commons-lang3-3.3.2.jar:3.3.2]
	at org.apache.commons.lang3.time.FastDateFormat.parse(FastDateFormat.java:487) ~[commons-lang3-3.3.2.jar:3.3.2]
	at io.siddhi.extension.execution.time.DateDifferenceFunctionExtension.execute(DateDifferenceFunctionExtension.java:289) ~[classes/:?]
	at io.siddhi.core.executor.function.FunctionExecutor.execute(FunctionExecutor.java:100) ~[siddhi-core-5.1.21.jar:?]
	... 40 more
Error in 'f12d218d-c579-4089-8dc3-29d1d3389776' after consuming events from Stream 'inputStream', Provided format yyyy-MM-dd HH:mm:ss does not match with the timestamp 2015:11:9 13:23:44Unparseable date: "2015:11:9 13:23:44" does not match (\p{Nd}++)\Q-\E(\p{Nd}++)\Q-\E(\p{Nd}++)\Q \E(\p{Nd}++)\Q:\E(\p{Nd}++)\Q:\E(\p{Nd}++). Exception on class 'io.siddhi.extension.execution.time.DateDifferenceFunctionExtension'. Hence, dropping event '[IBM, 2014-11-11 13:23:44, yyyy-MM-dd HH:mm:ss, 2015:11:9 13:23:44, yyyy-MM-dd HH:mm:ss, 1415692424000, 1415519624000]'
io.siddhi.core.exception.SiddhiAppRuntimeException: Provided format yyyy-MM-dd HH:mm:ss does not match with the timestamp 2015:11:9 13:23:44Unparseable date: "2015:11:9 13:23:44" does not match (\p{Nd}++)\Q-\E(\p{Nd}++)\Q-\E(\p{Nd}++)\Q \E(\p{Nd}++)\Q:\E(\p{Nd}++)\Q:\E(\p{Nd}++). Exception on class 'io.siddhi.extension.execution.time.DateDifferenceFunctionExtension'
	at io.siddhi.core.executor.function.FunctionExecutor.execute(FunctionExecutor.java:106) ~[siddhi-core-5.1.21.jar:?]
	at io.siddhi.core.query.selector.attribute.processor.AttributeProcessor.process(AttributeProcessor.java:41) ~[siddhi-core-5.1.21.jar:?]
	at io.siddhi.core.query.selector.QuerySelector.processNoGroupBy(QuerySelector.java:173) ~[siddhi-core-5.1.21.jar:?]
	at io.siddhi.core.query.selector.QuerySelector.process(QuerySelector.java:88) ~[siddhi-core-5.1.21.jar:?]
	at io.siddhi.core.query.input.ProcessStreamReceiver.processAndClear(ProcessStreamReceiver.java:182) ~[siddhi-core-5.1.21.jar:?]
	at io.siddhi.core.query.input.ProcessStreamReceiver.process(ProcessStreamReceiver.java:89) ~[siddhi-core-5.1.21.jar:?]
	at io.siddhi.core.query.input.ProcessStreamReceiver.receive(ProcessStreamReceiver.java:178) ~[siddhi-core-5.1.21.jar:?]
	at io.siddhi.core.stream.StreamJunction.sendData(StreamJunction.java:272) ~[siddhi-core-5.1.21.jar:?]
	at io.siddhi.core.stream.StreamJunction.access$200(StreamJunction.java:65) [siddhi-core-5.1.21.jar:?]
	at io.siddhi.core.stream.StreamJunction$Publisher.send(StreamJunction.java:533) [siddhi-core-5.1.21.jar:?]
	at io.siddhi.core.stream.input.InputDistributor.send(InputDistributor.java:49) [siddhi-core-5.1.21.jar:?]
	at io.siddhi.core.stream.input.InputEntryValve.send(InputEntryValve.java:75) [siddhi-core-5.1.21.jar:?]
	at io.siddhi.core.stream.input.InputHandler.send(InputHandler.java:53) [siddhi-core-5.1.21.jar:?]
	at io.siddhi.extension.execution.time.DateDifferenceFunctionExtensionTestCase.dateDifferenceFunctionExtensionTest3(DateDifferenceFunctionExtensionTestCase.java:183) [test-classes/:?]
	at sun.reflect.NativeMethodAccessorImpl.invoke0(Native Method) ~[?:1.8.0_171]
	at sun.reflect.NativeMethodAccessorImpl.invoke(NativeMethodAccessorImpl.java:62) ~[?:1.8.0_171]
	at sun.reflect.DelegatingMethodAccessorImpl.invoke(DelegatingMethodAccessorImpl.java:43) ~[?:1.8.0_171]
	at java.lang.reflect.Method.invoke(Method.java:498) ~[?:1.8.0_171]
	at org.testng.internal.MethodInvocationHelper.invokeMethod(MethodInvocationHelper.java:80) [testng-6.8.jar:?]
	at org.testng.internal.Invoker.invokeMethod(Invoker.java:714) [testng-6.8.jar:?]
	at org.testng.internal.Invoker.invokeTestMethod(Invoker.java:901) [testng-6.8.jar:?]
	at org.testng.internal.Invoker.invokeTestMethods(Invoker.java:1231) [testng-6.8.jar:?]
	at org.testng.internal.TestMethodWorker.invokeTestMethods(TestMethodWorker.java:127) [testng-6.8.jar:?]
	at org.testng.internal.TestMethodWorker.run(TestMethodWorker.java:111) [testng-6.8.jar:?]
	at org.testng.TestRunner.privateRun(TestRunner.java:767) [testng-6.8.jar:?]
	at org.testng.TestRunner.run(TestRunner.java:617) [testng-6.8.jar:?]
	at org.testng.SuiteRunner.runTest(SuiteRunner.java:334) [testng-6.8.jar:?]
	at org.testng.SuiteRunner.runSequentially(SuiteRunner.java:329) [testng-6.8.jar:?]
	at org.testng.SuiteRunner.privateRun(SuiteRunner.java:291) [testng-6.8.jar:?]
	at org.testng.SuiteRunner.run(SuiteRunner.java:240) [testng-6.8.jar:?]
	at org.testng.SuiteRunnerWorker.runSuite(SuiteRunnerWorker.java:52) [testng-6.8.jar:?]
	at org.testng.SuiteRunnerWorker.run(SuiteRunnerWorker.java:86) [testng-6.8.jar:?]
	at org.testng.TestNG.runSuitesSequentially(TestNG.java:1198) [testng-6.8.jar:?]
	at org.testng.TestNG.runSuitesLocally(TestNG.java:1123) [testng-6.8.jar:?]
	at org.testng.TestNG.run(TestNG.java:1031) [testng-6.8.jar:?]
	at org.apache.maven.surefire.testng.TestNGExecutor.run(TestNGExecutor.java:281) [surefire-testng-2.19.1.jar:2.19.1]
	at org.apache.maven.surefire.testng.TestNGXmlTestSuite.execute(TestNGXmlTestSuite.java:75) [surefire-testng-2.19.1.jar:2.19.1]
	at org.apache.maven.surefire.testng.TestNGProvider.invoke(TestNGProvider.java:121) [surefire-testng-2.19.1.jar:2.19.1]
	at org.apache.maven.surefire.booter.ForkedBooter.invokeProviderInSameClassLoader(ForkedBooter.java:290) [surefire-booter-2.19.1.jar:2.19.1]
	at org.apache.maven.surefire.booter.ForkedBooter.runSuitesInProcess(ForkedBooter.java:242) [surefire-booter-2.19.1.jar:2.19.1]
	at org.apache.maven.surefire.booter.ForkedBooter.main(ForkedBooter.java:121) [surefire-booter-2.19.1.jar:2.19.1]
Caused by: io.siddhi.core.exception.SiddhiAppRuntimeException: Provided format yyyy-MM-dd HH:mm:ss does not match with the timestamp 2015:11:9 13:23:44Unparseable date: "2015:11:9 13:23:44" does not match (\p{Nd}++)\Q-\E(\p{Nd}++)\Q-\E(\p{Nd}++)\Q \E(\p{Nd}++)\Q:\E(\p{Nd}++)\Q:\E(\p{Nd}++)
	at io.siddhi.extension.execution.time.DateDifferenceFunctionExtension.execute(DateDifferenceFunctionExtension.java:295) ~[classes/:?]
	at io.siddhi.core.executor.function.FunctionExecutor.execute(FunctionExecutor.java:100) ~[siddhi-core-5.1.21.jar:?]
	... 40 more
Caused by: java.text.ParseException: Unparseable date: "2015:11:9 13:23:44" does not match (\p{Nd}++)\Q-\E(\p{Nd}++)\Q-\E(\p{Nd}++)\Q \E(\p{Nd}++)\Q:\E(\p{Nd}++)\Q:\E(\p{Nd}++)
	at org.apache.commons.lang3.time.FastDateParser.parse(FastDateParser.java:289) ~[commons-lang3-3.3.2.jar:3.3.2]
	at org.apache.commons.lang3.time.FastDateFormat.parse(FastDateFormat.java:487) ~[commons-lang3-3.3.2.jar:3.3.2]
	at io.siddhi.extension.execution.time.DateDifferenceFunctionExtension.execute(DateDifferenceFunctionExtension.java:289) ~[classes/:?]
	at io.siddhi.core.executor.function.FunctionExecutor.execute(FunctionExecutor.java:100) ~[siddhi-core-5.1.21.jar:?]
	... 40 more
DateFormatFunctionExtensionTestCase
Events{ @timestamp = 1644963876761, inEvents = [Event{timestamp=1644963876761, data=[IBM, 44, 44], isExpired=false}], RemoveEvents = null }
Event : 1,formattedDate : 44,formattedMillsDate : 44
Events{ @timestamp = 1644963876762, inEvents = [Event{timestamp=1644963876762, data=[IBM, 44, 44], isExpired=false}], RemoveEvents = null }
Event : 2,formattedDate : 44,formattedMillsDate : 44
Events{ @timestamp = 1644963876762, inEvents = [Event{timestamp=1644963876762, data=[IBM, 2014-11-11, 2014-11-11], isExpired=false}], RemoveEvents = null }
Event : 3,formattedDate : 2014-11-11,formattedMillsDate : 2014-11-11
DateFormatFunctionExtensionTestCaseForCastingDesiredFormat
Error in '1e94515f-81f1-4ab9-b721-979986d34c7d' after consuming events from Stream 'inputStream', Provided Data type cannot be cast to desired format. java.lang.Long cannot be cast to java.lang.String. Exception on class 'io.siddhi.extension.execution.time.DateFormatFunctionExtension'. Hence, dropping event '[IBM, 2014-11-11 13:23:44, yyyy-MM-dd HH:mm:ss, 1415692424000, ss]'
io.siddhi.core.exception.SiddhiAppRuntimeException: Provided Data type cannot be cast to desired format. java.lang.Long cannot be cast to java.lang.String. Exception on class 'io.siddhi.extension.execution.time.DateFormatFunctionExtension'
	at io.siddhi.core.executor.function.FunctionExecutor.execute(FunctionExecutor.java:106) ~[siddhi-core-5.1.21.jar:?]
	at io.siddhi.core.query.selector.attribute.processor.AttributeProcessor.process(AttributeProcessor.java:41) ~[siddhi-core-5.1.21.jar:?]
	at io.siddhi.core.query.selector.QuerySelector.processNoGroupBy(QuerySelector.java:173) ~[siddhi-core-5.1.21.jar:?]
	at io.siddhi.core.query.selector.QuerySelector.process(QuerySelector.java:88) ~[siddhi-core-5.1.21.jar:?]
	at io.siddhi.core.query.input.ProcessStreamReceiver.processAndClear(ProcessStreamReceiver.java:182) ~[siddhi-core-5.1.21.jar:?]
	at io.siddhi.core.query.input.ProcessStreamReceiver.process(ProcessStreamReceiver.java:89) ~[siddhi-core-5.1.21.jar:?]
	at io.siddhi.core.query.input.ProcessStreamReceiver.receive(ProcessStreamReceiver.java:178) ~[siddhi-core-5.1.21.jar:?]
	at io.siddhi.core.stream.StreamJunction.sendData(StreamJunction.java:272) ~[siddhi-core-5.1.21.jar:?]
	at io.siddhi.core.stream.StreamJunction.access$200(StreamJunction.java:65) [siddhi-core-5.1.21.jar:?]
	at io.siddhi.core.stream.StreamJunction$Publisher.send(StreamJunction.java:533) [siddhi-core-5.1.21.jar:?]
	at io.siddhi.core.stream.input.InputDistributor.send(InputDistributor.java:49) [siddhi-core-5.1.21.jar:?]
	at io.siddhi.core.stream.input.InputEntryValve.send(InputEntryValve.java:75) [siddhi-core-5.1.21.jar:?]
	at io.siddhi.core.stream.input.InputHandler.send(InputHandler.java:53) [siddhi-core-5.1.21.jar:?]
	at io.siddhi.extension.execution.time.DateFormatFunctionExtensionTestCase.dateFormatFunctionExtension10(DateFormatFunctionExtensionTestCase.java:318) [test-classes/:?]
	at sun.reflect.NativeMethodAccessorImpl.invoke0(Native Method) ~[?:1.8.0_171]
	at sun.reflect.NativeMethodAccessorImpl.invoke(NativeMethodAccessorImpl.java:62) ~[?:1.8.0_171]
	at sun.reflect.DelegatingMethodAccessorImpl.invoke(DelegatingMethodAccessorImpl.java:43) ~[?:1.8.0_171]
	at java.lang.reflect.Method.invoke(Method.java:498) ~[?:1.8.0_171]
	at org.testng.internal.MethodInvocationHelper.invokeMethod(MethodInvocationHelper.java:80) [testng-6.8.jar:?]
	at org.testng.internal.Invoker.invokeMethod(Invoker.java:714) [testng-6.8.jar:?]
	at org.testng.internal.Invoker.invokeTestMethod(Invoker.java:901) [testng-6.8.jar:?]
	at org.testng.internal.Invoker.invokeTestMethods(Invoker.java:1231) [testng-6.8.jar:?]
	at org.testng.internal.TestMethodWorker.invokeTestMethods(TestMethodWorker.java:127) [testng-6.8.jar:?]
	at org.testng.internal.TestMethodWorker.run(TestMethodWorker.java:111) [testng-6.8.jar:?]
	at org.testng.TestRunner.privateRun(TestRunner.java:767) [testng-6.8.jar:?]
	at org.testng.TestRunner.run(TestRunner.java:617) [testng-6.8.jar:?]
	at org.testng.SuiteRunner.runTest(SuiteRunner.java:334) [testng-6.8.jar:?]
	at org.testng.SuiteRunner.runSequentially(SuiteRunner.java:329) [testng-6.8.jar:?]
	at org.testng.SuiteRunner.privateRun(SuiteRunner.java:291) [testng-6.8.jar:?]
	at org.testng.SuiteRunner.run(SuiteRunner.java:240) [testng-6.8.jar:?]
	at org.testng.SuiteRunnerWorker.runSuite(SuiteRunnerWorker.java:52) [testng-6.8.jar:?]
	at org.testng.SuiteRunnerWorker.run(SuiteRunnerWorker.java:86) [testng-6.8.jar:?]
	at org.testng.TestNG.runSuitesSequentially(TestNG.java:1198) [testng-6.8.jar:?]
	at org.testng.TestNG.runSuitesLocally(TestNG.java:1123) [testng-6.8.jar:?]
	at org.testng.TestNG.run(TestNG.java:1031) [testng-6.8.jar:?]
	at org.apache.maven.surefire.testng.TestNGExecutor.run(TestNGExecutor.java:281) [surefire-testng-2.19.1.jar:2.19.1]
	at org.apache.maven.surefire.testng.TestNGXmlTestSuite.execute(TestNGXmlTestSuite.java:75) [surefire-testng-2.19.1.jar:2.19.1]
	at org.apache.maven.surefire.testng.TestNGProvider.invoke(TestNGProvider.java:121) [surefire-testng-2.19.1.jar:2.19.1]
	at org.apache.maven.surefire.booter.ForkedBooter.invokeProviderInSameClassLoader(ForkedBooter.java:290) [surefire-booter-2.19.1.jar:2.19.1]
	at org.apache.maven.surefire.booter.ForkedBooter.runSuitesInProcess(ForkedBooter.java:242) [surefire-booter-2.19.1.jar:2.19.1]
	at org.apache.maven.surefire.booter.ForkedBooter.main(ForkedBooter.java:121) [surefire-booter-2.19.1.jar:2.19.1]
Caused by: io.siddhi.core.exception.SiddhiAppRuntimeException: Provided Data type cannot be cast to desired format. java.lang.Long cannot be cast to java.lang.String
	at io.siddhi.extension.execution.time.DateFormatFunctionExtension.execute(DateFormatFunctionExtension.java:233) ~[classes/:?]
	at io.siddhi.core.executor.function.FunctionExecutor.execute(FunctionExecutor.java:100) ~[siddhi-core-5.1.21.jar:?]
	... 40 more
Caused by: java.lang.ClassCastException: java.lang.Long cannot be cast to java.lang.String
	at io.siddhi.extension.execution.time.DateFormatFunctionExtension.execute(DateFormatFunctionExtension.java:220) ~[classes/:?]
	at io.siddhi.core.executor.function.FunctionExecutor.execute(FunctionExecutor.java:100) ~[siddhi-core-5.1.21.jar:?]
	... 40 more
DateFormatFunctionExtensionTestCaseInvalidParameterTypeFirstArgumentLenghtTwo
DateFormatFunctionExtensionTestCaseInvalidParameterTypeSecondArgumentLenghtTwo
DateFormatFunctionExtensionTestCaseInvalidParameterTypeSecondArgumentLenghtTwoDefaultFormatFalse
DateFormatFunctionExtensionTestCaseFirstArgumentNull
Events{ @timestamp = 1644963876878, inEvents = [Event{timestamp=1644963876878, data=[IBM, null], isExpired=false}], RemoveEvents = null }
DateFormatFunctionExtensionTestCaseDesiredFormat
Error in '908be100-00a4-4474-b03f-20d2de4422e0' after consuming events from Stream 'inputStream', Provided Data type cannot be cast to desired format. java.lang.Long cannot be cast to java.lang.String. Exception on class 'io.siddhi.extension.execution.time.DateFormatFunctionExtension'. Hence, dropping event '[IBM, 2014-11-11 13:23:44, yyyy-MM-dd HH:mm:ss, ss, 1415692424000]'
io.siddhi.core.exception.SiddhiAppRuntimeException: Provided Data type cannot be cast to desired format. java.lang.Long cannot be cast to java.lang.String. Exception on class 'io.siddhi.extension.execution.time.DateFormatFunctionExtension'
	at io.siddhi.core.executor.function.FunctionExecutor.execute(FunctionExecutor.java:106) ~[siddhi-core-5.1.21.jar:?]
	at io.siddhi.core.query.selector.attribute.processor.AttributeProcessor.process(AttributeProcessor.java:41) ~[siddhi-core-5.1.21.jar:?]
	at io.siddhi.core.query.selector.QuerySelector.processNoGroupBy(QuerySelector.java:173) ~[siddhi-core-5.1.21.jar:?]
	at io.siddhi.core.query.selector.QuerySelector.process(QuerySelector.java:88) ~[siddhi-core-5.1.21.jar:?]
	at io.siddhi.core.query.input.ProcessStreamReceiver.processAndClear(ProcessStreamReceiver.java:182) ~[siddhi-core-5.1.21.jar:?]
	at io.siddhi.core.query.input.ProcessStreamReceiver.process(ProcessStreamReceiver.java:89) ~[siddhi-core-5.1.21.jar:?]
	at io.siddhi.core.query.input.ProcessStreamReceiver.receive(ProcessStreamReceiver.java:178) ~[siddhi-core-5.1.21.jar:?]
	at io.siddhi.core.stream.StreamJunction.sendData(StreamJunction.java:272) ~[siddhi-core-5.1.21.jar:?]
	at io.siddhi.core.stream.StreamJunction.access$200(StreamJunction.java:65) [siddhi-core-5.1.21.jar:?]
	at io.siddhi.core.stream.StreamJunction$Publisher.send(StreamJunction.java:533) [siddhi-core-5.1.21.jar:?]
	at io.siddhi.core.stream.input.InputDistributor.send(InputDistributor.java:49) [siddhi-core-5.1.21.jar:?]
	at io.siddhi.core.stream.input.InputEntryValve.send(InputEntryValve.java:75) [siddhi-core-5.1.21.jar:?]
	at io.siddhi.core.stream.input.InputHandler.send(InputHandler.java:53) [siddhi-core-5.1.21.jar:?]
	at io.siddhi.extension.execution.time.DateFormatFunctionExtensionTestCase.dateFormatFunctionExtension15(DateFormatFunctionExtensionTestCase.java:432) [test-classes/:?]
	at sun.reflect.NativeMethodAccessorImpl.invoke0(Native Method) ~[?:1.8.0_171]
	at sun.reflect.NativeMethodAccessorImpl.invoke(NativeMethodAccessorImpl.java:62) ~[?:1.8.0_171]
	at sun.reflect.DelegatingMethodAccessorImpl.invoke(DelegatingMethodAccessorImpl.java:43) ~[?:1.8.0_171]
	at java.lang.reflect.Method.invoke(Method.java:498) ~[?:1.8.0_171]
	at org.testng.internal.MethodInvocationHelper.invokeMethod(MethodInvocationHelper.java:80) [testng-6.8.jar:?]
	at org.testng.internal.Invoker.invokeMethod(Invoker.java:714) [testng-6.8.jar:?]
	at org.testng.internal.Invoker.invokeTestMethod(Invoker.java:901) [testng-6.8.jar:?]
	at org.testng.internal.Invoker.invokeTestMethods(Invoker.java:1231) [testng-6.8.jar:?]
	at org.testng.internal.TestMethodWorker.invokeTestMethods(TestMethodWorker.java:127) [testng-6.8.jar:?]
	at org.testng.internal.TestMethodWorker.run(TestMethodWorker.java:111) [testng-6.8.jar:?]
	at org.testng.TestRunner.privateRun(TestRunner.java:767) [testng-6.8.jar:?]
	at org.testng.TestRunner.run(TestRunner.java:617) [testng-6.8.jar:?]
	at org.testng.SuiteRunner.runTest(SuiteRunner.java:334) [testng-6.8.jar:?]
	at org.testng.SuiteRunner.runSequentially(SuiteRunner.java:329) [testng-6.8.jar:?]
	at org.testng.SuiteRunner.privateRun(SuiteRunner.java:291) [testng-6.8.jar:?]
	at org.testng.SuiteRunner.run(SuiteRunner.java:240) [testng-6.8.jar:?]
	at org.testng.SuiteRunnerWorker.runSuite(SuiteRunnerWorker.java:52) [testng-6.8.jar:?]
	at org.testng.SuiteRunnerWorker.run(SuiteRunnerWorker.java:86) [testng-6.8.jar:?]
	at org.testng.TestNG.runSuitesSequentially(TestNG.java:1198) [testng-6.8.jar:?]
	at org.testng.TestNG.runSuitesLocally(TestNG.java:1123) [testng-6.8.jar:?]
	at org.testng.TestNG.run(TestNG.java:1031) [testng-6.8.jar:?]
	at org.apache.maven.surefire.testng.TestNGExecutor.run(TestNGExecutor.java:281) [surefire-testng-2.19.1.jar:2.19.1]
	at org.apache.maven.surefire.testng.TestNGXmlTestSuite.execute(TestNGXmlTestSuite.java:75) [surefire-testng-2.19.1.jar:2.19.1]
	at org.apache.maven.surefire.testng.TestNGProvider.invoke(TestNGProvider.java:121) [surefire-testng-2.19.1.jar:2.19.1]
	at org.apache.maven.surefire.booter.ForkedBooter.invokeProviderInSameClassLoader(ForkedBooter.java:290) [surefire-booter-2.19.1.jar:2.19.1]
	at org.apache.maven.surefire.booter.ForkedBooter.runSuitesInProcess(ForkedBooter.java:242) [surefire-booter-2.19.1.jar:2.19.1]
	at org.apache.maven.surefire.booter.ForkedBooter.main(ForkedBooter.java:121) [surefire-booter-2.19.1.jar:2.19.1]
Caused by: io.siddhi.core.exception.SiddhiAppRuntimeException: Provided Data type cannot be cast to desired format. java.lang.Long cannot be cast to java.lang.String
	at io.siddhi.extension.execution.time.DateFormatFunctionExtension.execute(DateFormatFunctionExtension.java:255) ~[classes/:?]
	at io.siddhi.core.executor.function.FunctionExecutor.execute(FunctionExecutor.java:100) ~[siddhi-core-5.1.21.jar:?]
	... 40 more
Caused by: java.lang.ClassCastException: java.lang.Long cannot be cast to java.lang.String
	at io.siddhi.extension.execution.time.DateFormatFunctionExtension.execute(DateFormatFunctionExtension.java:245) ~[classes/:?]
	at io.siddhi.core.executor.function.FunctionExecutor.execute(FunctionExecutor.java:100) ~[siddhi-core-5.1.21.jar:?]
	... 40 more
DateFormatFunctionExtensionInvalidFormatTestCase
Error in '2d239f40-7980-4eb2-b8f2-317fc228cf3f' after consuming events from Stream 'inputStream', Provided format yyyy-MM-dd HH:mm:ss does not match with the timestamp 2014:11-11 13:23:44 Unparseable date: "2014:11-11 13:23:44" does not match (\p{Nd}++)\Q-\E(\p{Nd}++)\Q-\E(\p{Nd}++)\Q \E(\p{Nd}++)\Q:\E(\p{Nd}++)\Q:\E(\p{Nd}++). Exception on class 'io.siddhi.extension.execution.time.DateFormatFunctionExtension'. Hence, dropping event '[IBM, 2014:11-11 13:23:44, yyyy-MM-dd HH:mm:ss, 1415692424000, yyyy-MM-dd]'
io.siddhi.core.exception.SiddhiAppRuntimeException: Provided format yyyy-MM-dd HH:mm:ss does not match with the timestamp 2014:11-11 13:23:44 Unparseable date: "2014:11-11 13:23:44" does not match (\p{Nd}++)\Q-\E(\p{Nd}++)\Q-\E(\p{Nd}++)\Q \E(\p{Nd}++)\Q:\E(\p{Nd}++)\Q:\E(\p{Nd}++). Exception on class 'io.siddhi.extension.execution.time.DateFormatFunctionExtension'
	at io.siddhi.core.executor.function.FunctionExecutor.execute(FunctionExecutor.java:106) ~[siddhi-core-5.1.21.jar:?]
	at io.siddhi.core.query.selector.attribute.processor.AttributeProcessor.process(AttributeProcessor.java:41) ~[siddhi-core-5.1.21.jar:?]
	at io.siddhi.core.query.selector.QuerySelector.processNoGroupBy(QuerySelector.java:173) ~[siddhi-core-5.1.21.jar:?]
	at io.siddhi.core.query.selector.QuerySelector.process(QuerySelector.java:88) ~[siddhi-core-5.1.21.jar:?]
	at io.siddhi.core.query.input.ProcessStreamReceiver.processAndClear(ProcessStreamReceiver.java:182) ~[siddhi-core-5.1.21.jar:?]
	at io.siddhi.core.query.input.ProcessStreamReceiver.process(ProcessStreamReceiver.java:89) ~[siddhi-core-5.1.21.jar:?]
	at io.siddhi.core.query.input.ProcessStreamReceiver.receive(ProcessStreamReceiver.java:178) ~[siddhi-core-5.1.21.jar:?]
	at io.siddhi.core.stream.StreamJunction.sendData(StreamJunction.java:272) ~[siddhi-core-5.1.21.jar:?]
	at io.siddhi.core.stream.StreamJunction.access$200(StreamJunction.java:65) [siddhi-core-5.1.21.jar:?]
	at io.siddhi.core.stream.StreamJunction$Publisher.send(StreamJunction.java:533) [siddhi-core-5.1.21.jar:?]
	at io.siddhi.core.stream.input.InputDistributor.send(InputDistributor.java:49) [siddhi-core-5.1.21.jar:?]
	at io.siddhi.core.stream.input.InputEntryValve.send(InputEntryValve.java:75) [siddhi-core-5.1.21.jar:?]
	at io.siddhi.core.stream.input.InputHandler.send(InputHandler.java:53) [siddhi-core-5.1.21.jar:?]
	at io.siddhi.extension.execution.time.DateFormatFunctionExtensionTestCase.dateFormatFunctionExtension2(DateFormatFunctionExtensionTestCase.java:127) [test-classes/:?]
	at sun.reflect.NativeMethodAccessorImpl.invoke0(Native Method) ~[?:1.8.0_171]
	at sun.reflect.NativeMethodAccessorImpl.invoke(NativeMethodAccessorImpl.java:62) ~[?:1.8.0_171]
	at sun.reflect.DelegatingMethodAccessorImpl.invoke(DelegatingMethodAccessorImpl.java:43) ~[?:1.8.0_171]
	at java.lang.reflect.Method.invoke(Method.java:498) ~[?:1.8.0_171]
	at org.testng.internal.MethodInvocationHelper.invokeMethod(MethodInvocationHelper.java:80) [testng-6.8.jar:?]
	at org.testng.internal.Invoker.invokeMethod(Invoker.java:714) [testng-6.8.jar:?]
	at org.testng.internal.Invoker.invokeTestMethod(Invoker.java:901) [testng-6.8.jar:?]
	at org.testng.internal.Invoker.invokeTestMethods(Invoker.java:1231) [testng-6.8.jar:?]
	at org.testng.internal.TestMethodWorker.invokeTestMethods(TestMethodWorker.java:127) [testng-6.8.jar:?]
	at org.testng.internal.TestMethodWorker.run(TestMethodWorker.java:111) [testng-6.8.jar:?]
	at org.testng.TestRunner.privateRun(TestRunner.java:767) [testng-6.8.jar:?]
	at org.testng.TestRunner.run(TestRunner.java:617) [testng-6.8.jar:?]
	at org.testng.SuiteRunner.runTest(SuiteRunner.java:334) [testng-6.8.jar:?]
	at org.testng.SuiteRunner.runSequentially(SuiteRunner.java:329) [testng-6.8.jar:?]
	at org.testng.SuiteRunner.privateRun(SuiteRunner.java:291) [testng-6.8.jar:?]
	at org.testng.SuiteRunner.run(SuiteRunner.java:240) [testng-6.8.jar:?]
	at org.testng.SuiteRunnerWorker.runSuite(SuiteRunnerWorker.java:52) [testng-6.8.jar:?]
	at org.testng.SuiteRunnerWorker.run(SuiteRunnerWorker.java:86) [testng-6.8.jar:?]
	at org.testng.TestNG.runSuitesSequentially(TestNG.java:1198) [testng-6.8.jar:?]
	at org.testng.TestNG.runSuitesLocally(TestNG.java:1123) [testng-6.8.jar:?]
	at org.testng.TestNG.run(TestNG.java:1031) [testng-6.8.jar:?]
	at org.apache.maven.surefire.testng.TestNGExecutor.run(TestNGExecutor.java:281) [surefire-testng-2.19.1.jar:2.19.1]
	at org.apache.maven.surefire.testng.TestNGXmlTestSuite.execute(TestNGXmlTestSuite.java:75) [surefire-testng-2.19.1.jar:2.19.1]
	at org.apache.maven.surefire.testng.TestNGProvider.invoke(TestNGProvider.java:121) [surefire-testng-2.19.1.jar:2.19.1]
	at org.apache.maven.surefire.booter.ForkedBooter.invokeProviderInSameClassLoader(ForkedBooter.java:290) [surefire-booter-2.19.1.jar:2.19.1]
	at org.apache.maven.surefire.booter.ForkedBooter.runSuitesInProcess(ForkedBooter.java:242) [surefire-booter-2.19.1.jar:2.19.1]
	at org.apache.maven.surefire.booter.ForkedBooter.main(ForkedBooter.java:121) [surefire-booter-2.19.1.jar:2.19.1]
Caused by: io.siddhi.core.exception.SiddhiAppRuntimeException: Provided format yyyy-MM-dd HH:mm:ss does not match with the timestamp 2014:11-11 13:23:44 Unparseable date: "2014:11-11 13:23:44" does not match (\p{Nd}++)\Q-\E(\p{Nd}++)\Q-\E(\p{Nd}++)\Q \E(\p{Nd}++)\Q:\E(\p{Nd}++)\Q:\E(\p{Nd}++)
	at io.siddhi.extension.execution.time.DateFormatFunctionExtension.execute(DateFormatFunctionExtension.java:230) ~[classes/:?]
	at io.siddhi.core.executor.function.FunctionExecutor.execute(FunctionExecutor.java:100) ~[siddhi-core-5.1.21.jar:?]
	... 40 more
Caused by: java.text.ParseException: Unparseable date: "2014:11-11 13:23:44" does not match (\p{Nd}++)\Q-\E(\p{Nd}++)\Q-\E(\p{Nd}++)\Q \E(\p{Nd}++)\Q:\E(\p{Nd}++)\Q:\E(\p{Nd}++)
	at org.apache.commons.lang3.time.FastDateParser.parse(FastDateParser.java:289) ~[commons-lang3-3.3.2.jar:3.3.2]
	at org.apache.commons.lang3.time.FastDateFormat.parse(FastDateFormat.java:487) ~[commons-lang3-3.3.2.jar:3.3.2]
	at io.siddhi.extension.execution.time.DateFormatFunctionExtension.execute(DateFormatFunctionExtension.java:223) ~[classes/:?]
	at io.siddhi.core.executor.function.FunctionExecutor.execute(FunctionExecutor.java:100) ~[siddhi-core-5.1.21.jar:?]
	... 40 more
DateFormatFunctionExtensionTestCaseInvalidParameterTypeInFirstArgument
DateFormatFunctionExtensionTestCaseInvalidParameterTypeInSecondArgument
DateFormatFunctionExtensionTestCaseInvalidParameterTypeInThirdArgument
DateFormatFunctionExtensionInvalidNoOfArgumentTestCase
DateFormatFunctionExtensionTestCaseFirstArgumentNul
Events{ @timestamp = 1644963877200, inEvents = [Event{timestamp=1644963877200, data=[IBM, null, 2014-11-11], isExpired=false}], RemoveEvents = null }
DateFormatFunctionExtensionTestCaseSecondArgumentNull
Events{ @timestamp = 1644963877303, inEvents = [Event{timestamp=1644963877303, data=[IBM, null, null], isExpired=false}], RemoveEvents = null }
DateFormatFunctionExtensionTestCaseThirdArgumentNul
Events{ @timestamp = 1644963877406, inEvents = [Event{timestamp=1644963877406, data=[IBM, null, 44], isExpired=false}], RemoveEvents = null }
DateSubFunctionExtensionTestCase
Events{ @timestamp = 1644963877511, inEvents = [Event{timestamp=1644963877511, data=[IBM, 2012-11-11 13:23:44, 2014-09-11 13:23:44, 1352620424000], isExpired=false}], RemoveEvents = null }
Event : 1,YEAR_SUBTRACTED : 2012-11-11 13:23:44,MONTH_SUBTRACTED : 2014-09-11 13:23:44,YEAR_SUBTRACTED_IN_MILLS : 1352620424000
Events{ @timestamp = 1644963877512, inEvents = [Event{timestamp=1644963877512, data=[IBM, 2012-11-11 13:23:44, 2014-09-11 13:23:44, 1352620424000], isExpired=false}], RemoveEvents = null }
Event : 2,YEAR_SUBTRACTED : 2012-11-11 13:23:44,MONTH_SUBTRACTED : 2014-09-11 13:23:44,YEAR_SUBTRACTED_IN_MILLS : 1352620424000
Events{ @timestamp = 1644963877512, inEvents = [Event{timestamp=1644963877512, data=[IBM, 2012-11-11 13:23:44, 2014-09-11 13:23:44, 1352620424000], isExpired=false}], RemoveEvents = null }
Event : 3,YEAR_SUBTRACTED : 2012-11-11 13:23:44,MONTH_SUBTRACTED : 2014-09-11 13:23:44,YEAR_SUBTRACTED_IN_MILLS : 1352620424000
DateSubFunctionExtensionTestCaseUnitValueConstant
DateSubFunctionExtensionTestCase
DateSubFunctionExtensionTestCaseInvalidParameterFormatSecondArgumentLengthThree
DateSubFunctionExtensionTestCaseInvalidParameterFormatThirdArgumentLengthThree
DateSubFunctionExtensionTestCaseInvalidParameterFormatFirstArgumentLengthThree
DateSubFunctionExtensionTestCaseCastDesireFormat
Error in '674eab12-8bf2-479d-a82c-06da77303325' after consuming events from Stream 'inputStream', Provided Data type cannot be cast to desired format. java.lang.String cannot be cast to java.lang.Long. Exception on class 'io.siddhi.extension.execution.time.DateSubFunctionExtension'. Hence, dropping event '[IBM, 2014-11-11 13:23:44, 1415692424000, yyyy-MM-dd HH:mm:ss, 2]'
io.siddhi.core.exception.SiddhiAppRuntimeException: Provided Data type cannot be cast to desired format. java.lang.String cannot be cast to java.lang.Long. Exception on class 'io.siddhi.extension.execution.time.DateSubFunctionExtension'
	at io.siddhi.core.executor.function.FunctionExecutor.execute(FunctionExecutor.java:106) ~[siddhi-core-5.1.21.jar:?]
	at io.siddhi.core.query.selector.attribute.processor.AttributeProcessor.process(AttributeProcessor.java:41) ~[siddhi-core-5.1.21.jar:?]
	at io.siddhi.core.query.selector.QuerySelector.processNoGroupBy(QuerySelector.java:173) ~[siddhi-core-5.1.21.jar:?]
	at io.siddhi.core.query.selector.QuerySelector.process(QuerySelector.java:88) ~[siddhi-core-5.1.21.jar:?]
	at io.siddhi.core.query.input.ProcessStreamReceiver.processAndClear(ProcessStreamReceiver.java:182) ~[siddhi-core-5.1.21.jar:?]
	at io.siddhi.core.query.input.ProcessStreamReceiver.process(ProcessStreamReceiver.java:89) ~[siddhi-core-5.1.21.jar:?]
	at io.siddhi.core.query.input.ProcessStreamReceiver.receive(ProcessStreamReceiver.java:178) ~[siddhi-core-5.1.21.jar:?]
	at io.siddhi.core.stream.StreamJunction.sendData(StreamJunction.java:272) ~[siddhi-core-5.1.21.jar:?]
	at io.siddhi.core.stream.StreamJunction.access$200(StreamJunction.java:65) [siddhi-core-5.1.21.jar:?]
	at io.siddhi.core.stream.StreamJunction$Publisher.send(StreamJunction.java:533) [siddhi-core-5.1.21.jar:?]
	at io.siddhi.core.stream.input.InputDistributor.send(InputDistributor.java:49) [siddhi-core-5.1.21.jar:?]
	at io.siddhi.core.stream.input.InputEntryValve.send(InputEntryValve.java:75) [siddhi-core-5.1.21.jar:?]
	at io.siddhi.core.stream.input.InputHandler.send(InputHandler.java:53) [siddhi-core-5.1.21.jar:?]
	at io.siddhi.extension.execution.time.DateSubFunctionExtensionTestCase.dateSubFunctionExtension15(DateSubFunctionExtensionTestCase.java:397) [test-classes/:?]
	at sun.reflect.NativeMethodAccessorImpl.invoke0(Native Method) ~[?:1.8.0_171]
	at sun.reflect.NativeMethodAccessorImpl.invoke(NativeMethodAccessorImpl.java:62) ~[?:1.8.0_171]
	at sun.reflect.DelegatingMethodAccessorImpl.invoke(DelegatingMethodAccessorImpl.java:43) ~[?:1.8.0_171]
	at java.lang.reflect.Method.invoke(Method.java:498) ~[?:1.8.0_171]
	at org.testng.internal.MethodInvocationHelper.invokeMethod(MethodInvocationHelper.java:80) [testng-6.8.jar:?]
	at org.testng.internal.Invoker.invokeMethod(Invoker.java:714) [testng-6.8.jar:?]
	at org.testng.internal.Invoker.invokeTestMethod(Invoker.java:901) [testng-6.8.jar:?]
	at org.testng.internal.Invoker.invokeTestMethods(Invoker.java:1231) [testng-6.8.jar:?]
	at org.testng.internal.TestMethodWorker.invokeTestMethods(TestMethodWorker.java:127) [testng-6.8.jar:?]
	at org.testng.internal.TestMethodWorker.run(TestMethodWorker.java:111) [testng-6.8.jar:?]
	at org.testng.TestRunner.privateRun(TestRunner.java:767) [testng-6.8.jar:?]
	at org.testng.TestRunner.run(TestRunner.java:617) [testng-6.8.jar:?]
	at org.testng.SuiteRunner.runTest(SuiteRunner.java:334) [testng-6.8.jar:?]
	at org.testng.SuiteRunner.runSequentially(SuiteRunner.java:329) [testng-6.8.jar:?]
	at org.testng.SuiteRunner.privateRun(SuiteRunner.java:291) [testng-6.8.jar:?]
	at org.testng.SuiteRunner.run(SuiteRunner.java:240) [testng-6.8.jar:?]
	at org.testng.SuiteRunnerWorker.runSuite(SuiteRunnerWorker.java:52) [testng-6.8.jar:?]
	at org.testng.SuiteRunnerWorker.run(SuiteRunnerWorker.java:86) [testng-6.8.jar:?]
	at org.testng.TestNG.runSuitesSequentially(TestNG.java:1198) [testng-6.8.jar:?]
	at org.testng.TestNG.runSuitesLocally(TestNG.java:1123) [testng-6.8.jar:?]
	at org.testng.TestNG.run(TestNG.java:1031) [testng-6.8.jar:?]
	at org.apache.maven.surefire.testng.TestNGExecutor.run(TestNGExecutor.java:281) [surefire-testng-2.19.1.jar:2.19.1]
	at org.apache.maven.surefire.testng.TestNGXmlTestSuite.execute(TestNGXmlTestSuite.java:75) [surefire-testng-2.19.1.jar:2.19.1]
	at org.apache.maven.surefire.testng.TestNGProvider.invoke(TestNGProvider.java:121) [surefire-testng-2.19.1.jar:2.19.1]
	at org.apache.maven.surefire.booter.ForkedBooter.invokeProviderInSameClassLoader(ForkedBooter.java:290) [surefire-booter-2.19.1.jar:2.19.1]
	at org.apache.maven.surefire.booter.ForkedBooter.runSuitesInProcess(ForkedBooter.java:242) [surefire-booter-2.19.1.jar:2.19.1]
	at org.apache.maven.surefire.booter.ForkedBooter.main(ForkedBooter.java:121) [surefire-booter-2.19.1.jar:2.19.1]
Caused by: io.siddhi.core.exception.SiddhiAppRuntimeException: Provided Data type cannot be cast to desired format. java.lang.String cannot be cast to java.lang.Long
	at io.siddhi.extension.execution.time.DateSubFunctionExtension.execute(DateSubFunctionExtension.java:325) ~[classes/:?]
	at io.siddhi.core.executor.function.FunctionExecutor.execute(FunctionExecutor.java:100) ~[siddhi-core-5.1.21.jar:?]
	... 40 more
Caused by: java.lang.ClassCastException: java.lang.String cannot be cast to java.lang.Long
	at io.siddhi.extension.execution.time.DateSubFunctionExtension.execute(DateSubFunctionExtension.java:317) ~[classes/:?]
	at io.siddhi.core.executor.function.FunctionExecutor.execute(FunctionExecutor.java:100) ~[siddhi-core-5.1.21.jar:?]
	... 40 more
DateSubFunctionExtensionSecondParameteInvalidLengthThreeDefaultDateFalseTestCaseTestCase
DateSubFunctionExtensionThidParameteInvalidLengthThreeDefaultDateFalseTestCase
DateSubFunctionExtensionThidParameteInvalidLengthFourTestCase
DateSubFunctionExtensionProcessedCalenderTestCase
Events{ @timestamp = 1644963877639, inEvents = [Event{timestamp=1644963877639, data=[IBM, 2012-11-11 13:23:44, 2014-11-11 13:23:42, 2014-11-11 13:21:44, 2014-11-11 11:23:44], isExpired=false}], RemoveEvents = null }
Events{ @timestamp = 1644963877640, inEvents = [Event{timestamp=1644963877640, data=[IBM, 2012-11-11 13:23:44, 2014-11-11 13:23:42, 2014-11-11 13:21:44, 2014-11-11 11:23:44], isExpired=false}], RemoveEvents = null }
Events{ @timestamp = 1644963877641, inEvents = [Event{timestamp=1644963877641, data=[IBM, 2012-11-11 13:23:44, 2014-11-11 13:23:42, 2014-11-11 13:21:44, 2014-11-11 11:23:44], isExpired=false}], RemoveEvents = null }
TestCaseForDateSubFunctionExtensionInvalidArgumentsIntime:dateSubFunction
DateSubFunctionExtensionTestCaseInvalidParameterTypeInSecondArgument
DateSubFunctionExtensionTestCaseForInvalidParameterTypeInFourthArgument
DateSubFunctionExtensionTestCaseForInvalidParameterTypeInFirstArgument
DateSubFunctionExtensionInvalidFormatTestCase
Error in '79c75632-f251-41d6-9a20-c739409095e1' after consuming events from Stream 'inputStream', Provided format yyyy-MM-dd HH:mm:ss does not match with the timestamp 2014:11:11 13:23:44. Unparseable date: "2014:11:11 13:23:44" does not match (\p{Nd}++)\Q-\E(\p{Nd}++)\Q-\E(\p{Nd}++)\Q \E(\p{Nd}++)\Q:\E(\p{Nd}++)\Q:\E(\p{Nd}++). Exception on class 'io.siddhi.extension.execution.time.DateSubFunctionExtension'. Hence, dropping event '[IBM, 2014:11:11 13:23:44, yyyy-MM-dd HH:mm:ss, 1415692424000, 2]'
io.siddhi.core.exception.SiddhiAppRuntimeException: Provided format yyyy-MM-dd HH:mm:ss does not match with the timestamp 2014:11:11 13:23:44. Unparseable date: "2014:11:11 13:23:44" does not match (\p{Nd}++)\Q-\E(\p{Nd}++)\Q-\E(\p{Nd}++)\Q \E(\p{Nd}++)\Q:\E(\p{Nd}++)\Q:\E(\p{Nd}++). Exception on class 'io.siddhi.extension.execution.time.DateSubFunctionExtension'
	at io.siddhi.core.executor.function.FunctionExecutor.execute(FunctionExecutor.java:106) ~[siddhi-core-5.1.21.jar:?]
	at io.siddhi.core.query.selector.attribute.processor.AttributeProcessor.process(AttributeProcessor.java:41) ~[siddhi-core-5.1.21.jar:?]
	at io.siddhi.core.query.selector.QuerySelector.processNoGroupBy(QuerySelector.java:173) ~[siddhi-core-5.1.21.jar:?]
	at io.siddhi.core.query.selector.QuerySelector.process(QuerySelector.java:88) ~[siddhi-core-5.1.21.jar:?]
	at io.siddhi.core.query.input.ProcessStreamReceiver.processAndClear(ProcessStreamReceiver.java:182) ~[siddhi-core-5.1.21.jar:?]
	at io.siddhi.core.query.input.ProcessStreamReceiver.process(ProcessStreamReceiver.java:89) ~[siddhi-core-5.1.21.jar:?]
	at io.siddhi.core.query.input.ProcessStreamReceiver.receive(ProcessStreamReceiver.java:178) ~[siddhi-core-5.1.21.jar:?]
	at io.siddhi.core.stream.StreamJunction.sendData(StreamJunction.java:272) ~[siddhi-core-5.1.21.jar:?]
	at io.siddhi.core.stream.StreamJunction.access$200(StreamJunction.java:65) [siddhi-core-5.1.21.jar:?]
	at io.siddhi.core.stream.StreamJunction$Publisher.send(StreamJunction.java:533) [siddhi-core-5.1.21.jar:?]
	at io.siddhi.core.stream.input.InputDistributor.send(InputDistributor.java:49) [siddhi-core-5.1.21.jar:?]
	at io.siddhi.core.stream.input.InputEntryValve.send(InputEntryValve.java:75) [siddhi-core-5.1.21.jar:?]
	at io.siddhi.core.stream.input.InputHandler.send(InputHandler.java:53) [siddhi-core-5.1.21.jar:?]
	at io.siddhi.extension.execution.time.DateSubFunctionExtensionTestCase.dateSubFunctionExtension6(DateSubFunctionExtensionTestCase.java:191) [test-classes/:?]
	at sun.reflect.NativeMethodAccessorImpl.invoke0(Native Method) ~[?:1.8.0_171]
	at sun.reflect.NativeMethodAccessorImpl.invoke(NativeMethodAccessorImpl.java:62) ~[?:1.8.0_171]
	at sun.reflect.DelegatingMethodAccessorImpl.invoke(DelegatingMethodAccessorImpl.java:43) ~[?:1.8.0_171]
	at java.lang.reflect.Method.invoke(Method.java:498) ~[?:1.8.0_171]
	at org.testng.internal.MethodInvocationHelper.invokeMethod(MethodInvocationHelper.java:80) [testng-6.8.jar:?]
	at org.testng.internal.Invoker.invokeMethod(Invoker.java:714) [testng-6.8.jar:?]
	at org.testng.internal.Invoker.invokeTestMethod(Invoker.java:901) [testng-6.8.jar:?]
	at org.testng.internal.Invoker.invokeTestMethods(Invoker.java:1231) [testng-6.8.jar:?]
	at org.testng.internal.TestMethodWorker.invokeTestMethods(TestMethodWorker.java:127) [testng-6.8.jar:?]
	at org.testng.internal.TestMethodWorker.run(TestMethodWorker.java:111) [testng-6.8.jar:?]
	at org.testng.TestRunner.privateRun(TestRunner.java:767) [testng-6.8.jar:?]
	at org.testng.TestRunner.run(TestRunner.java:617) [testng-6.8.jar:?]
	at org.testng.SuiteRunner.runTest(SuiteRunner.java:334) [testng-6.8.jar:?]
	at org.testng.SuiteRunner.runSequentially(SuiteRunner.java:329) [testng-6.8.jar:?]
	at org.testng.SuiteRunner.privateRun(SuiteRunner.java:291) [testng-6.8.jar:?]
	at org.testng.SuiteRunner.run(SuiteRunner.java:240) [testng-6.8.jar:?]
	at org.testng.SuiteRunnerWorker.runSuite(SuiteRunnerWorker.java:52) [testng-6.8.jar:?]
	at org.testng.SuiteRunnerWorker.run(SuiteRunnerWorker.java:86) [testng-6.8.jar:?]
	at org.testng.TestNG.runSuitesSequentially(TestNG.java:1198) [testng-6.8.jar:?]
	at org.testng.TestNG.runSuitesLocally(TestNG.java:1123) [testng-6.8.jar:?]
	at org.testng.TestNG.run(TestNG.java:1031) [testng-6.8.jar:?]
	at org.apache.maven.surefire.testng.TestNGExecutor.run(TestNGExecutor.java:281) [surefire-testng-2.19.1.jar:2.19.1]
	at org.apache.maven.surefire.testng.TestNGXmlTestSuite.execute(TestNGXmlTestSuite.java:75) [surefire-testng-2.19.1.jar:2.19.1]
	at org.apache.maven.surefire.testng.TestNGProvider.invoke(TestNGProvider.java:121) [surefire-testng-2.19.1.jar:2.19.1]
	at org.apache.maven.surefire.booter.ForkedBooter.invokeProviderInSameClassLoader(ForkedBooter.java:290) [surefire-booter-2.19.1.jar:2.19.1]
	at org.apache.maven.surefire.booter.ForkedBooter.runSuitesInProcess(ForkedBooter.java:242) [surefire-booter-2.19.1.jar:2.19.1]
	at org.apache.maven.surefire.booter.ForkedBooter.main(ForkedBooter.java:121) [surefire-booter-2.19.1.jar:2.19.1]
Caused by: io.siddhi.core.exception.SiddhiAppRuntimeException: Provided format yyyy-MM-dd HH:mm:ss does not match with the timestamp 2014:11:11 13:23:44. Unparseable date: "2014:11:11 13:23:44" does not match (\p{Nd}++)\Q-\E(\p{Nd}++)\Q-\E(\p{Nd}++)\Q \E(\p{Nd}++)\Q:\E(\p{Nd}++)\Q:\E(\p{Nd}++)
	at io.siddhi.extension.execution.time.DateSubFunctionExtension.execute(DateSubFunctionExtension.java:304) ~[classes/:?]
	at io.siddhi.core.executor.function.FunctionExecutor.execute(FunctionExecutor.java:100) ~[siddhi-core-5.1.21.jar:?]
	... 40 more
Caused by: java.text.ParseException: Unparseable date: "2014:11:11 13:23:44" does not match (\p{Nd}++)\Q-\E(\p{Nd}++)\Q-\E(\p{Nd}++)\Q \E(\p{Nd}++)\Q:\E(\p{Nd}++)\Q:\E(\p{Nd}++)
	at org.apache.commons.lang3.time.FastDateParser.parse(FastDateParser.java:289) ~[commons-lang3-3.3.2.jar:3.3.2]
	at org.apache.commons.lang3.time.FastDateFormat.parse(FastDateFormat.java:487) ~[commons-lang3-3.3.2.jar:3.3.2]
	at io.siddhi.extension.execution.time.DateSubFunctionExtension.execute(DateSubFunctionExtension.java:297) ~[classes/:?]
	at io.siddhi.core.executor.function.FunctionExecutor.execute(FunctionExecutor.java:100) ~[siddhi-core-5.1.21.jar:?]
	... 40 more
DateSubFunctionExtensionTestCaseFirstArgumentNull
Events{ @timestamp = 1644963877858, inEvents = [Event{timestamp=1644963877858, data=[IBM, null, null, 1352620424000], isExpired=false}], RemoveEvents = null }
DateSubFunctionExtensionTestCaseFourthArgumentNull
Events{ @timestamp = 1644963877961, inEvents = [Event{timestamp=1644963877961, data=[IBM, null, null, 1352620424000], isExpired=false}], RemoveEvents = null }
Events{ @timestamp = 1644963877961, inEvents = [Event{timestamp=1644963877961, data=[IBM, null, null, 1352620424000], isExpired=false}], RemoveEvents = null }
DateSubFunctionExtensionTestCaseSecondArgumentNull
Events{ @timestamp = 1644963878065, inEvents = [Event{timestamp=1644963878065, data=[IBM, null, null, null], isExpired=false}], RemoveEvents = null }
ExtractAttributesFunctionExtensionTestCase
Events{ @timestamp = 1644963878170, inEvents = [Event{timestamp=1644963878170, data=[IBM, 2014, 3, 20], isExpired=false}], RemoveEvents = null }
Event : 1,YEAR : 2014,MONTH : 3,HOUR : 20
Events{ @timestamp = 1644963878171, inEvents = [Event{timestamp=1644963878171, data=[IBM, 2014, 3, 20], isExpired=false}], RemoveEvents = null }
Event : 2,YEAR : 2014,MONTH : 3,HOUR : 20
Events{ @timestamp = 1644963878171, inEvents = [Event{timestamp=1644963878171, data=[IBM, 2014, 3, 16], isExpired=false}], RemoveEvents = null }
Event : 3,YEAR : 2014,MONTH : 3,HOUR : 16
ExtractAttributesFunctionExtensionTestCaseInvalidParameterSecondArgumentLengthTwo
ExtractAttributesFunctionExtensionTestCaseInvalidParameterLengthTwoDefaultDateFalseSecondArgument
ExtractAttributesFunctionExtensionUnitValueConstantTestCase
ExtractAttributesFunctionExtensionProcessedCalenderTestCase
Events{ @timestamp = 1644963878181, inEvents = [Event{timestamp=1644963878181, data=[IBM, 44, 3, 22, 24, 0], isExpired=false}], RemoveEvents = null }
Events{ @timestamp = 1644963878182, inEvents = [Event{timestamp=1644963878182, data=[IBM, 44, 3, 22, 24, 0], isExpired=false}], RemoveEvents = null }
ExtractAttributesFunctionExtensionTestCase2: <int>  time: extract (<string> unit ,<string>  dateValue, <string> dataFormat, <string> locale)
Events{ @timestamp = 1644963878294, inEvents = [Event{timestamp=1644963878294, data=[IBM, 41], isExpired=false}], RemoveEvents = null }
Event : 1,WEEK : 41
Events{ @timestamp = 1644963878294, inEvents = [Event{timestamp=1644963878294, data=[IBM, 40], isExpired=false}], RemoveEvents = null }
Event : 2,WEEK : 40
extractAttributesFunctionExtension15: <int>  time: extract (<long> timestampInMilliseconds ,<string>  unit, <string> locale)
Events{ @timestamp = 1644963878399, inEvents = [Event{timestamp=1644963878399, data=[IBM, 40], isExpired=false}], RemoveEvents = null }
Event : 1,WEEK : 40
Events{ @timestamp = 1644963878399, inEvents = [Event{timestamp=1644963878399, data=[IBM, 40], isExpired=false}], RemoveEvents = null }
Event : 2,WEEK : 40
extractAttributesFunctionExtension16: <int>  time: extract (<long> timestampInMilliseconds ,<string>  unit)
Events{ @timestamp = 1644963878503, inEvents = [Event{timestamp=1644963878503, data=[IBM, 40], isExpired=false}], RemoveEvents = null }
Event : 1,WEEK : 40
extractAttributesFunctionExtension17: <int>  time: extract (<string> unit ,<string>  dateValue)
Events{ @timestamp = 1644963878607, inEvents = [Event{timestamp=1644963878607, data=[IBM, 41], isExpired=false}], RemoveEvents = null }
Event : 1,WEEK : 41
ExtractAttributesFunctionExtensionInvalidFormatTestCase
Error in 'bdb42f5b-bd15-4115-985b-547d6fab1920' after consuming events from Stream 'inputStream', Provided format yyyy-MM-dd hh:mm:ss does not match with the timestamp 2014:3-11 02:23:44. Unparseable date: "2014:3-11 02:23:44" does not match (\p{Nd}++)\Q-\E(\p{Nd}++)\Q-\E(\p{Nd}++)\Q \E(\p{Nd}++)\Q:\E(\p{Nd}++)\Q:\E(\p{Nd}++). Exception on class 'io.siddhi.extension.execution.time.ExtractAttributesFunctionExtension'. Hence, dropping event '[IBM, 2014:3-11 02:23:44, yyyy-MM-dd hh:mm:ss, 1644963878711]'
io.siddhi.core.exception.SiddhiAppRuntimeException: Provided format yyyy-MM-dd hh:mm:ss does not match with the timestamp 2014:3-11 02:23:44. Unparseable date: "2014:3-11 02:23:44" does not match (\p{Nd}++)\Q-\E(\p{Nd}++)\Q-\E(\p{Nd}++)\Q \E(\p{Nd}++)\Q:\E(\p{Nd}++)\Q:\E(\p{Nd}++). Exception on class 'io.siddhi.extension.execution.time.ExtractAttributesFunctionExtension'
	at io.siddhi.core.executor.function.FunctionExecutor.execute(FunctionExecutor.java:106) ~[siddhi-core-5.1.21.jar:?]
	at io.siddhi.core.query.selector.attribute.processor.AttributeProcessor.process(AttributeProcessor.java:41) ~[siddhi-core-5.1.21.jar:?]
	at io.siddhi.core.query.selector.QuerySelector.processNoGroupBy(QuerySelector.java:173) ~[siddhi-core-5.1.21.jar:?]
	at io.siddhi.core.query.selector.QuerySelector.process(QuerySelector.java:88) ~[siddhi-core-5.1.21.jar:?]
	at io.siddhi.core.query.input.ProcessStreamReceiver.processAndClear(ProcessStreamReceiver.java:182) ~[siddhi-core-5.1.21.jar:?]
	at io.siddhi.core.query.input.ProcessStreamReceiver.process(ProcessStreamReceiver.java:89) ~[siddhi-core-5.1.21.jar:?]
	at io.siddhi.core.query.input.ProcessStreamReceiver.receive(ProcessStreamReceiver.java:178) ~[siddhi-core-5.1.21.jar:?]
	at io.siddhi.core.stream.StreamJunction.sendData(StreamJunction.java:272) ~[siddhi-core-5.1.21.jar:?]
	at io.siddhi.core.stream.StreamJunction.access$200(StreamJunction.java:65) [siddhi-core-5.1.21.jar:?]
	at io.siddhi.core.stream.StreamJunction$Publisher.send(StreamJunction.java:533) [siddhi-core-5.1.21.jar:?]
	at io.siddhi.core.stream.input.InputDistributor.send(InputDistributor.java:49) [siddhi-core-5.1.21.jar:?]
	at io.siddhi.core.stream.input.InputEntryValve.send(InputEntryValve.java:75) [siddhi-core-5.1.21.jar:?]
	at io.siddhi.core.stream.input.InputHandler.send(InputHandler.java:53) [siddhi-core-5.1.21.jar:?]
	at io.siddhi.extension.execution.time.ExtractAttributesFunctionExtensionTestCase.extractAttributesFunctionExtension2(ExtractAttributesFunctionExtensionTestCase.java:130) [test-classes/:?]
	at sun.reflect.NativeMethodAccessorImpl.invoke0(Native Method) ~[?:1.8.0_171]
	at sun.reflect.NativeMethodAccessorImpl.invoke(NativeMethodAccessorImpl.java:62) ~[?:1.8.0_171]
	at sun.reflect.DelegatingMethodAccessorImpl.invoke(DelegatingMethodAccessorImpl.java:43) ~[?:1.8.0_171]
	at java.lang.reflect.Method.invoke(Method.java:498) ~[?:1.8.0_171]
	at org.testng.internal.MethodInvocationHelper.invokeMethod(MethodInvocationHelper.java:80) [testng-6.8.jar:?]
	at org.testng.internal.Invoker.invokeMethod(Invoker.java:714) [testng-6.8.jar:?]
	at org.testng.internal.Invoker.invokeTestMethod(Invoker.java:901) [testng-6.8.jar:?]
	at org.testng.internal.Invoker.invokeTestMethods(Invoker.java:1231) [testng-6.8.jar:?]
	at org.testng.internal.TestMethodWorker.invokeTestMethods(TestMethodWorker.java:127) [testng-6.8.jar:?]
	at org.testng.internal.TestMethodWorker.run(TestMethodWorker.java:111) [testng-6.8.jar:?]
	at org.testng.TestRunner.privateRun(TestRunner.java:767) [testng-6.8.jar:?]
	at org.testng.TestRunner.run(TestRunner.java:617) [testng-6.8.jar:?]
	at org.testng.SuiteRunner.runTest(SuiteRunner.java:334) [testng-6.8.jar:?]
	at org.testng.SuiteRunner.runSequentially(SuiteRunner.java:329) [testng-6.8.jar:?]
	at org.testng.SuiteRunner.privateRun(SuiteRunner.java:291) [testng-6.8.jar:?]
	at org.testng.SuiteRunner.run(SuiteRunner.java:240) [testng-6.8.jar:?]
	at org.testng.SuiteRunnerWorker.runSuite(SuiteRunnerWorker.java:52) [testng-6.8.jar:?]
	at org.testng.SuiteRunnerWorker.run(SuiteRunnerWorker.java:86) [testng-6.8.jar:?]
	at org.testng.TestNG.runSuitesSequentially(TestNG.java:1198) [testng-6.8.jar:?]
	at org.testng.TestNG.runSuitesLocally(TestNG.java:1123) [testng-6.8.jar:?]
	at org.testng.TestNG.run(TestNG.java:1031) [testng-6.8.jar:?]
	at org.apache.maven.surefire.testng.TestNGExecutor.run(TestNGExecutor.java:281) [surefire-testng-2.19.1.jar:2.19.1]
	at org.apache.maven.surefire.testng.TestNGXmlTestSuite.execute(TestNGXmlTestSuite.java:75) [surefire-testng-2.19.1.jar:2.19.1]
	at org.apache.maven.surefire.testng.TestNGProvider.invoke(TestNGProvider.java:121) [surefire-testng-2.19.1.jar:2.19.1]
	at org.apache.maven.surefire.booter.ForkedBooter.invokeProviderInSameClassLoader(ForkedBooter.java:290) [surefire-booter-2.19.1.jar:2.19.1]
	at org.apache.maven.surefire.booter.ForkedBooter.runSuitesInProcess(ForkedBooter.java:242) [surefire-booter-2.19.1.jar:2.19.1]
	at org.apache.maven.surefire.booter.ForkedBooter.main(ForkedBooter.java:121) [surefire-booter-2.19.1.jar:2.19.1]
Caused by: io.siddhi.core.exception.SiddhiAppRuntimeException: Provided format yyyy-MM-dd hh:mm:ss does not match with the timestamp 2014:3-11 02:23:44. Unparseable date: "2014:3-11 02:23:44" does not match (\p{Nd}++)\Q-\E(\p{Nd}++)\Q-\E(\p{Nd}++)\Q \E(\p{Nd}++)\Q:\E(\p{Nd}++)\Q:\E(\p{Nd}++)
	at io.siddhi.extension.execution.time.ExtractAttributesFunctionExtension.execute(ExtractAttributesFunctionExtension.java:214) ~[classes/:?]
	at io.siddhi.core.executor.function.FunctionExecutor.execute(FunctionExecutor.java:100) ~[siddhi-core-5.1.21.jar:?]
	... 40 more
Caused by: java.text.ParseException: Unparseable date: "2014:3-11 02:23:44" does not match (\p{Nd}++)\Q-\E(\p{Nd}++)\Q-\E(\p{Nd}++)\Q \E(\p{Nd}++)\Q:\E(\p{Nd}++)\Q:\E(\p{Nd}++)
	at org.apache.commons.lang3.time.FastDateParser.parse(FastDateParser.java:289) ~[commons-lang3-3.3.2.jar:3.3.2]
	at org.apache.commons.lang3.time.FastDateFormat.parse(FastDateFormat.java:487) ~[commons-lang3-3.3.2.jar:3.3.2]
	at io.siddhi.extension.execution.time.ExtractAttributesFunctionExtension.execute(ExtractAttributesFunctionExtension.java:209) ~[classes/:?]
	at io.siddhi.core.executor.function.FunctionExecutor.execute(FunctionExecutor.java:100) ~[siddhi-core-5.1.21.jar:?]
	... 40 more
ExtractAttributesFunctionExtensionInvalidParameterTypeInSecondArgument
ExtractAttributesFunctionExtensionInvalidParameterTypeInThirdArgument
ExtractAttributesFunctionExtensionInvalidParameterTypeInFirstArgument
ExtractAttributesFunctionExtensionInvalidNoOfArgumentTestCase
ExtractAttributesFunctionExtensionSecondArgumentNullTestCase
Events{ @timestamp = 1644963878724, inEvents = [Event{timestamp=1644963878724, data=[IBM, null, null, 22], isExpired=false}], RemoveEvents = null }
ExtractAttributesFunctionExtensionThirdArgumentNullTestCase
Events{ @timestamp = 1644963878827, inEvents = [Event{timestamp=1644963878827, data=[IBM, null, null, 22], isExpired=false}], RemoveEvents = null }
ExtractAttributesFunctionExtensionTestCaseInvalidParameterFirstArgumentLengthThree
ExtractDateFunctionExtensionTestCase
Events{ @timestamp = 1644963878932, inEvents = [Event{timestamp=1644963878932, data=[IBM, 1970-01-01], isExpired=false}], RemoveEvents = null }
Event : 1,dateExtracted : 1970-01-01
Events{ @timestamp = 1644963878933, inEvents = [Event{timestamp=1644963878933, data=[WSO2, 2014-11-11], isExpired=false}], RemoveEvents = null }
Event : 2,dateExtracted : 2014-11-11
Events{ @timestamp = 1644963878933, inEvents = [Event{timestamp=1644963878933, data=[XYZ, 2014-11-11], isExpired=false}], RemoveEvents = null }
Event : 3,dateExtracted : 2014-11-11
ExtractDateFunctionExtensionInvalidParameterTypeInFirstArgumentTestCase
ExtractDateFunctionExtensionInvalidParameterTypeInSecondArgumentTestCase
ExtractDateFunctionExtensionInvalidNoOfArgumentTestCase
ExtractDateFunctionExtensionTestCaseFirstArgumentNull
Events{ @timestamp = 1644963878943, inEvents = [Event{timestamp=1644963878943, data=[IBM, null], isExpired=false}], RemoveEvents = null }
ExtractDateFunctionExtensionTestCaseSecondArgumentNull
Events{ @timestamp = 1644963878946, inEvents = [Event{timestamp=1644963878946, data=[IBM, null], isExpired=false}], RemoveEvents = null }
ExtractDateFunctionExtensionWithInvalidFormatTestCase
Error in 'f6e37a05-57e1-4cbb-8278-e03ff2303172' after consuming events from Stream 'inputStream', Provided format yyyy-MM-dd does not match with the timestamp 2014:11:11. Unparseable date: "2014:11:11" does not match (\p{Nd}++)\Q-\E(\p{Nd}++)\Q-\E(\p{Nd}++). Exception on class 'io.siddhi.extension.execution.time.ExtractDateFunctionExtension'. Hence, dropping event '[IBM, 2014:11:11, yyyy-MM-dd]'
io.siddhi.core.exception.SiddhiAppRuntimeException: Provided format yyyy-MM-dd does not match with the timestamp 2014:11:11. Unparseable date: "2014:11:11" does not match (\p{Nd}++)\Q-\E(\p{Nd}++)\Q-\E(\p{Nd}++). Exception on class 'io.siddhi.extension.execution.time.ExtractDateFunctionExtension'
	at io.siddhi.core.executor.function.FunctionExecutor.execute(FunctionExecutor.java:106) ~[siddhi-core-5.1.21.jar:?]
	at io.siddhi.core.query.selector.attribute.processor.AttributeProcessor.process(AttributeProcessor.java:41) ~[siddhi-core-5.1.21.jar:?]
	at io.siddhi.core.query.selector.QuerySelector.processNoGroupBy(QuerySelector.java:173) ~[siddhi-core-5.1.21.jar:?]
	at io.siddhi.core.query.selector.QuerySelector.process(QuerySelector.java:88) ~[siddhi-core-5.1.21.jar:?]
	at io.siddhi.core.query.input.ProcessStreamReceiver.processAndClear(ProcessStreamReceiver.java:182) ~[siddhi-core-5.1.21.jar:?]
	at io.siddhi.core.query.input.ProcessStreamReceiver.process(ProcessStreamReceiver.java:89) ~[siddhi-core-5.1.21.jar:?]
	at io.siddhi.core.query.input.ProcessStreamReceiver.receive(ProcessStreamReceiver.java:178) ~[siddhi-core-5.1.21.jar:?]
	at io.siddhi.core.stream.StreamJunction.sendData(StreamJunction.java:272) ~[siddhi-core-5.1.21.jar:?]
	at io.siddhi.core.stream.StreamJunction.access$200(StreamJunction.java:65) [siddhi-core-5.1.21.jar:?]
	at io.siddhi.core.stream.StreamJunction$Publisher.send(StreamJunction.java:533) [siddhi-core-5.1.21.jar:?]
	at io.siddhi.core.stream.input.InputDistributor.send(InputDistributor.java:49) [siddhi-core-5.1.21.jar:?]
	at io.siddhi.core.stream.input.InputEntryValve.send(InputEntryValve.java:75) [siddhi-core-5.1.21.jar:?]
	at io.siddhi.core.stream.input.InputHandler.send(InputHandler.java:53) [siddhi-core-5.1.21.jar:?]
	at io.siddhi.extension.execution.time.ExtractDateFunctionExtensionTestCase.extractDateFunctionExtensionTest2(ExtractDateFunctionExtensionTestCase.java:115) [test-classes/:?]
	at sun.reflect.NativeMethodAccessorImpl.invoke0(Native Method) ~[?:1.8.0_171]
	at sun.reflect.NativeMethodAccessorImpl.invoke(NativeMethodAccessorImpl.java:62) ~[?:1.8.0_171]
	at sun.reflect.DelegatingMethodAccessorImpl.invoke(DelegatingMethodAccessorImpl.java:43) ~[?:1.8.0_171]
	at java.lang.reflect.Method.invoke(Method.java:498) ~[?:1.8.0_171]
	at org.testng.internal.MethodInvocationHelper.invokeMethod(MethodInvocationHelper.java:80) [testng-6.8.jar:?]
	at org.testng.internal.Invoker.invokeMethod(Invoker.java:714) [testng-6.8.jar:?]
	at org.testng.internal.Invoker.invokeTestMethod(Invoker.java:901) [testng-6.8.jar:?]
	at org.testng.internal.Invoker.invokeTestMethods(Invoker.java:1231) [testng-6.8.jar:?]
	at org.testng.internal.TestMethodWorker.invokeTestMethods(TestMethodWorker.java:127) [testng-6.8.jar:?]
	at org.testng.internal.TestMethodWorker.run(TestMethodWorker.java:111) [testng-6.8.jar:?]
	at org.testng.TestRunner.privateRun(TestRunner.java:767) [testng-6.8.jar:?]
	at org.testng.TestRunner.run(TestRunner.java:617) [testng-6.8.jar:?]
	at org.testng.SuiteRunner.runTest(SuiteRunner.java:334) [testng-6.8.jar:?]
	at org.testng.SuiteRunner.runSequentially(SuiteRunner.java:329) [testng-6.8.jar:?]
	at org.testng.SuiteRunner.privateRun(SuiteRunner.java:291) [testng-6.8.jar:?]
	at org.testng.SuiteRunner.run(SuiteRunner.java:240) [testng-6.8.jar:?]
	at org.testng.SuiteRunnerWorker.runSuite(SuiteRunnerWorker.java:52) [testng-6.8.jar:?]
	at org.testng.SuiteRunnerWorker.run(SuiteRunnerWorker.java:86) [testng-6.8.jar:?]
	at org.testng.TestNG.runSuitesSequentially(TestNG.java:1198) [testng-6.8.jar:?]
	at org.testng.TestNG.runSuitesLocally(TestNG.java:1123) [testng-6.8.jar:?]
	at org.testng.TestNG.run(TestNG.java:1031) [testng-6.8.jar:?]
	at org.apache.maven.surefire.testng.TestNGExecutor.run(TestNGExecutor.java:281) [surefire-testng-2.19.1.jar:2.19.1]
	at org.apache.maven.surefire.testng.TestNGXmlTestSuite.execute(TestNGXmlTestSuite.java:75) [surefire-testng-2.19.1.jar:2.19.1]
	at org.apache.maven.surefire.testng.TestNGProvider.invoke(TestNGProvider.java:121) [surefire-testng-2.19.1.jar:2.19.1]
	at org.apache.maven.surefire.booter.ForkedBooter.invokeProviderInSameClassLoader(ForkedBooter.java:290) [surefire-booter-2.19.1.jar:2.19.1]
	at org.apache.maven.surefire.booter.ForkedBooter.runSuitesInProcess(ForkedBooter.java:242) [surefire-booter-2.19.1.jar:2.19.1]
	at org.apache.maven.surefire.booter.ForkedBooter.main(ForkedBooter.java:121) [surefire-booter-2.19.1.jar:2.19.1]
Caused by: io.siddhi.core.exception.SiddhiAppRuntimeException: Provided format yyyy-MM-dd does not match with the timestamp 2014:11:11. Unparseable date: "2014:11:11" does not match (\p{Nd}++)\Q-\E(\p{Nd}++)\Q-\E(\p{Nd}++)
	at io.siddhi.extension.execution.time.ExtractDateFunctionExtension.execute(ExtractDateFunctionExtension.java:157) ~[classes/:?]
	at io.siddhi.core.executor.function.FunctionExecutor.execute(FunctionExecutor.java:100) ~[siddhi-core-5.1.21.jar:?]
	... 40 more
Caused by: java.text.ParseException: Unparseable date: "2014:11:11" does not match (\p{Nd}++)\Q-\E(\p{Nd}++)\Q-\E(\p{Nd}++)
	at org.apache.commons.lang3.time.FastDateParser.parse(FastDateParser.java:289) ~[commons-lang3-3.3.2.jar:3.3.2]
	at org.apache.commons.lang3.time.FastDateFormat.parse(FastDateFormat.java:487) ~[commons-lang3-3.3.2.jar:3.3.2]
	at io.siddhi.extension.execution.time.ExtractDateFunctionExtension.execute(ExtractDateFunctionExtension.java:151) ~[classes/:?]
	at io.siddhi.core.executor.function.FunctionExecutor.execute(FunctionExecutor.java:100) ~[siddhi-core-5.1.21.jar:?]
	... 40 more
ExtractDayOfWeekFunctionExtensionTestCase 
Events{ @timestamp = 1644963878952, inEvents = [Event{timestamp=1644963878952, data=[IBM, Thursday], isExpired=false}], RemoveEvents = null }
Event : 1,ExtractedDayOfWeek : Thursday
Events{ @timestamp = 1644963878955, inEvents = [Event{timestamp=1644963878955, data=[WSO2, Tuesday], isExpired=false}], RemoveEvents = null }
Event : 2,ExtractedDayOfWeek : Tuesday
Events{ @timestamp = 1644963878955, inEvents = [Event{timestamp=1644963878955, data=[XYZ, Wednesday], isExpired=false}], RemoveEvents = null }
Event : 3,ExtractedDayOfWeek : Wednesday
ExtractDayOfWeekFunctionExtensionTestCaseInvalidFormatSingleParameter
Error in 'a61c5d3f-c4e2-47c0-ac85-5d460c324096' after consuming events from Stream 'inputStream', Provided format yyyy-MM-dd HH:mm:ss.SSS does not match with the timestamp 12Unparseable date: "12". Exception on class 'io.siddhi.extension.execution.time.ExtractDayOfWeekFunctionExtension'. Hence, dropping event '[IBM, 12]'
io.siddhi.core.exception.SiddhiAppRuntimeException: Provided format yyyy-MM-dd HH:mm:ss.SSS does not match with the timestamp 12Unparseable date: "12". Exception on class 'io.siddhi.extension.execution.time.ExtractDayOfWeekFunctionExtension'
	at io.siddhi.core.executor.function.FunctionExecutor.execute(FunctionExecutor.java:106) ~[siddhi-core-5.1.21.jar:?]
	at io.siddhi.core.query.selector.attribute.processor.AttributeProcessor.process(AttributeProcessor.java:41) ~[siddhi-core-5.1.21.jar:?]
	at io.siddhi.core.query.selector.QuerySelector.processNoGroupBy(QuerySelector.java:173) ~[siddhi-core-5.1.21.jar:?]
	at io.siddhi.core.query.selector.QuerySelector.process(QuerySelector.java:88) ~[siddhi-core-5.1.21.jar:?]
	at io.siddhi.core.query.input.ProcessStreamReceiver.processAndClear(ProcessStreamReceiver.java:182) ~[siddhi-core-5.1.21.jar:?]
	at io.siddhi.core.query.input.ProcessStreamReceiver.process(ProcessStreamReceiver.java:89) ~[siddhi-core-5.1.21.jar:?]
	at io.siddhi.core.query.input.ProcessStreamReceiver.receive(ProcessStreamReceiver.java:178) ~[siddhi-core-5.1.21.jar:?]
	at io.siddhi.core.stream.StreamJunction.sendData(StreamJunction.java:272) ~[siddhi-core-5.1.21.jar:?]
	at io.siddhi.core.stream.StreamJunction.access$200(StreamJunction.java:65) [siddhi-core-5.1.21.jar:?]
	at io.siddhi.core.stream.StreamJunction$Publisher.send(StreamJunction.java:533) [siddhi-core-5.1.21.jar:?]
	at io.siddhi.core.stream.input.InputDistributor.send(InputDistributor.java:49) [siddhi-core-5.1.21.jar:?]
	at io.siddhi.core.stream.input.InputEntryValve.send(InputEntryValve.java:75) [siddhi-core-5.1.21.jar:?]
	at io.siddhi.core.stream.input.InputHandler.send(InputHandler.java:53) [siddhi-core-5.1.21.jar:?]
	at io.siddhi.extension.execution.time.ExtractDayOfWeekFunctionExtensionTestCase.extractDayOfWeekFunctionExtension10(ExtractDayOfWeekFunctionExtensionTestCase.java:333) [test-classes/:?]
	at sun.reflect.NativeMethodAccessorImpl.invoke0(Native Method) ~[?:1.8.0_171]
	at sun.reflect.NativeMethodAccessorImpl.invoke(NativeMethodAccessorImpl.java:62) ~[?:1.8.0_171]
	at sun.reflect.DelegatingMethodAccessorImpl.invoke(DelegatingMethodAccessorImpl.java:43) ~[?:1.8.0_171]
	at java.lang.reflect.Method.invoke(Method.java:498) ~[?:1.8.0_171]
	at org.testng.internal.MethodInvocationHelper.invokeMethod(MethodInvocationHelper.java:80) [testng-6.8.jar:?]
	at org.testng.internal.Invoker.invokeMethod(Invoker.java:714) [testng-6.8.jar:?]
	at org.testng.internal.Invoker.invokeTestMethod(Invoker.java:901) [testng-6.8.jar:?]
	at org.testng.internal.Invoker.invokeTestMethods(Invoker.java:1231) [testng-6.8.jar:?]
	at org.testng.internal.TestMethodWorker.invokeTestMethods(TestMethodWorker.java:127) [testng-6.8.jar:?]
	at org.testng.internal.TestMethodWorker.run(TestMethodWorker.java:111) [testng-6.8.jar:?]
	at org.testng.TestRunner.privateRun(TestRunner.java:767) [testng-6.8.jar:?]
	at org.testng.TestRunner.run(TestRunner.java:617) [testng-6.8.jar:?]
	at org.testng.SuiteRunner.runTest(SuiteRunner.java:334) [testng-6.8.jar:?]
	at org.testng.SuiteRunner.runSequentially(SuiteRunner.java:329) [testng-6.8.jar:?]
	at org.testng.SuiteRunner.privateRun(SuiteRunner.java:291) [testng-6.8.jar:?]
	at org.testng.SuiteRunner.run(SuiteRunner.java:240) [testng-6.8.jar:?]
	at org.testng.SuiteRunnerWorker.runSuite(SuiteRunnerWorker.java:52) [testng-6.8.jar:?]
	at org.testng.SuiteRunnerWorker.run(SuiteRunnerWorker.java:86) [testng-6.8.jar:?]
	at org.testng.TestNG.runSuitesSequentially(TestNG.java:1198) [testng-6.8.jar:?]
	at org.testng.TestNG.runSuitesLocally(TestNG.java:1123) [testng-6.8.jar:?]
	at org.testng.TestNG.run(TestNG.java:1031) [testng-6.8.jar:?]
	at org.apache.maven.surefire.testng.TestNGExecutor.run(TestNGExecutor.java:281) [surefire-testng-2.19.1.jar:2.19.1]
	at org.apache.maven.surefire.testng.TestNGXmlTestSuite.execute(TestNGXmlTestSuite.java:75) [surefire-testng-2.19.1.jar:2.19.1]
	at org.apache.maven.surefire.testng.TestNGProvider.invoke(TestNGProvider.java:121) [surefire-testng-2.19.1.jar:2.19.1]
	at org.apache.maven.surefire.booter.ForkedBooter.invokeProviderInSameClassLoader(ForkedBooter.java:290) [surefire-booter-2.19.1.jar:2.19.1]
	at org.apache.maven.surefire.booter.ForkedBooter.runSuitesInProcess(ForkedBooter.java:242) [surefire-booter-2.19.1.jar:2.19.1]
	at org.apache.maven.surefire.booter.ForkedBooter.main(ForkedBooter.java:121) [surefire-booter-2.19.1.jar:2.19.1]
Caused by: io.siddhi.core.exception.SiddhiAppRuntimeException: Provided format yyyy-MM-dd HH:mm:ss.SSS does not match with the timestamp 12Unparseable date: "12"
	at io.siddhi.extension.execution.time.ExtractDayOfWeekFunctionExtension.execute(ExtractDayOfWeekFunctionExtension.java:184) ~[classes/:?]
	at io.siddhi.core.executor.function.FunctionExecutor.execute(FunctionExecutor.java:94) ~[siddhi-core-5.1.21.jar:?]
	... 40 more
Caused by: java.text.ParseException: Unparseable date: "12"
	at java.text.DateFormat.parse(DateFormat.java:366) ~[?:1.8.0_171]
	at io.siddhi.extension.execution.time.ExtractDayOfWeekFunctionExtension.execute(ExtractDayOfWeekFunctionExtension.java:179) ~[classes/:?]
	at io.siddhi.core.executor.function.FunctionExecutor.execute(FunctionExecutor.java:94) ~[siddhi-core-5.1.21.jar:?]
	... 40 more
ExtractDayOfWeekFunctionExtensionTestCase 2
Events{ @timestamp = 1644963878968, inEvents = [Event{timestamp=1644963878968, data=[IBM, Tuesday], isExpired=false}], RemoveEvents = null }
Event : 1,ExtractedDayOfWeek : Tuesday
Events{ @timestamp = 1644963878968, inEvents = [Event{timestamp=1644963878968, data=[WSO2, Sunday], isExpired=false}], RemoveEvents = null }
Event : 2,ExtractedDayOfWeek : Sunday
Events{ @timestamp = 1644963878969, inEvents = [Event{timestamp=1644963878969, data=[XYZ, Monday], isExpired=false}], RemoveEvents = null }
Event : 3,ExtractedDayOfWeek : Monday
ExtractDayOfWeekFunctionExtensionTestCaseInvalidParameterTypeInFirstArgument 
ExtractDayOfWeekFunctionExtensionTestCaseInvalidParameterTypeInSecondArgument 
ExtractDayOfWeekFunctionExtensionTestCaseFirstArgumentNull
Events{ @timestamp = 1644963878975, inEvents = [Event{timestamp=1644963878975, data=[IBM, null], isExpired=false}], RemoveEvents = null }
ExtractDayOfWeekFunctionExtensionTestCaseSecondArgumentNull
Events{ @timestamp = 1644963878978, inEvents = [Event{timestamp=1644963878978, data=[IBM, null], isExpired=false}], RemoveEvents = null }
ExtractDayOfWeekFunctionExtensionTestCaseInvalidFormat
Error in '6e9a7cac-098d-4e5b-9638-82f98667ffe7' after consuming events from Stream 'inputStream', Provided format yyyy-MM-dd HH:mm:ss.SSS does not match with the timestamp 2014:12:11 13:23:44.657Unparseable date: "2014:12:11 13:23:44.657" does not match (\p{Nd}++)\Q-\E(\p{Nd}++)\Q-\E(\p{Nd}++)\Q \E(\p{Nd}++)\Q:\E(\p{Nd}++)\Q:\E(\p{Nd}++)\Q.\E(\p{Nd}++). Exception on class 'io.siddhi.extension.execution.time.ExtractDayOfWeekFunctionExtension'. Hence, dropping event '[IBM, 2014:12:11 13:23:44.657, yyyy-MM-dd HH:mm:ss.SSS]'
io.siddhi.core.exception.SiddhiAppRuntimeException: Provided format yyyy-MM-dd HH:mm:ss.SSS does not match with the timestamp 2014:12:11 13:23:44.657Unparseable date: "2014:12:11 13:23:44.657" does not match (\p{Nd}++)\Q-\E(\p{Nd}++)\Q-\E(\p{Nd}++)\Q \E(\p{Nd}++)\Q:\E(\p{Nd}++)\Q:\E(\p{Nd}++)\Q.\E(\p{Nd}++). Exception on class 'io.siddhi.extension.execution.time.ExtractDayOfWeekFunctionExtension'
	at io.siddhi.core.executor.function.FunctionExecutor.execute(FunctionExecutor.java:106) ~[siddhi-core-5.1.21.jar:?]
	at io.siddhi.core.query.selector.attribute.processor.AttributeProcessor.process(AttributeProcessor.java:41) ~[siddhi-core-5.1.21.jar:?]
	at io.siddhi.core.query.selector.QuerySelector.processNoGroupBy(QuerySelector.java:173) ~[siddhi-core-5.1.21.jar:?]
	at io.siddhi.core.query.selector.QuerySelector.process(QuerySelector.java:88) ~[siddhi-core-5.1.21.jar:?]
	at io.siddhi.core.query.input.ProcessStreamReceiver.processAndClear(ProcessStreamReceiver.java:182) ~[siddhi-core-5.1.21.jar:?]
	at io.siddhi.core.query.input.ProcessStreamReceiver.process(ProcessStreamReceiver.java:89) ~[siddhi-core-5.1.21.jar:?]
	at io.siddhi.core.query.input.ProcessStreamReceiver.receive(ProcessStreamReceiver.java:178) ~[siddhi-core-5.1.21.jar:?]
	at io.siddhi.core.stream.StreamJunction.sendData(StreamJunction.java:272) ~[siddhi-core-5.1.21.jar:?]
	at io.siddhi.core.stream.StreamJunction.access$200(StreamJunction.java:65) [siddhi-core-5.1.21.jar:?]
	at io.siddhi.core.stream.StreamJunction$Publisher.send(StreamJunction.java:533) [siddhi-core-5.1.21.jar:?]
	at io.siddhi.core.stream.input.InputDistributor.send(InputDistributor.java:49) [siddhi-core-5.1.21.jar:?]
	at io.siddhi.core.stream.input.InputEntryValve.send(InputEntryValve.java:75) [siddhi-core-5.1.21.jar:?]
	at io.siddhi.core.stream.input.InputHandler.send(InputHandler.java:53) [siddhi-core-5.1.21.jar:?]
	at io.siddhi.extension.execution.time.ExtractDayOfWeekFunctionExtensionTestCase.extractDayOfWeekFunctionExtension7(ExtractDayOfWeekFunctionExtensionTestCase.java:254) [test-classes/:?]
	at sun.reflect.NativeMethodAccessorImpl.invoke0(Native Method) ~[?:1.8.0_171]
	at sun.reflect.NativeMethodAccessorImpl.invoke(NativeMethodAccessorImpl.java:62) ~[?:1.8.0_171]
	at sun.reflect.DelegatingMethodAccessorImpl.invoke(DelegatingMethodAccessorImpl.java:43) ~[?:1.8.0_171]
	at java.lang.reflect.Method.invoke(Method.java:498) ~[?:1.8.0_171]
	at org.testng.internal.MethodInvocationHelper.invokeMethod(MethodInvocationHelper.java:80) [testng-6.8.jar:?]
	at org.testng.internal.Invoker.invokeMethod(Invoker.java:714) [testng-6.8.jar:?]
	at org.testng.internal.Invoker.invokeTestMethod(Invoker.java:901) [testng-6.8.jar:?]
	at org.testng.internal.Invoker.invokeTestMethods(Invoker.java:1231) [testng-6.8.jar:?]
	at org.testng.internal.TestMethodWorker.invokeTestMethods(TestMethodWorker.java:127) [testng-6.8.jar:?]
	at org.testng.internal.TestMethodWorker.run(TestMethodWorker.java:111) [testng-6.8.jar:?]
	at org.testng.TestRunner.privateRun(TestRunner.java:767) [testng-6.8.jar:?]
	at org.testng.TestRunner.run(TestRunner.java:617) [testng-6.8.jar:?]
	at org.testng.SuiteRunner.runTest(SuiteRunner.java:334) [testng-6.8.jar:?]
	at org.testng.SuiteRunner.runSequentially(SuiteRunner.java:329) [testng-6.8.jar:?]
	at org.testng.SuiteRunner.privateRun(SuiteRunner.java:291) [testng-6.8.jar:?]
	at org.testng.SuiteRunner.run(SuiteRunner.java:240) [testng-6.8.jar:?]
	at org.testng.SuiteRunnerWorker.runSuite(SuiteRunnerWorker.java:52) [testng-6.8.jar:?]
	at org.testng.SuiteRunnerWorker.run(SuiteRunnerWorker.java:86) [testng-6.8.jar:?]
	at org.testng.TestNG.runSuitesSequentially(TestNG.java:1198) [testng-6.8.jar:?]
	at org.testng.TestNG.runSuitesLocally(TestNG.java:1123) [testng-6.8.jar:?]
	at org.testng.TestNG.run(TestNG.java:1031) [testng-6.8.jar:?]
	at org.apache.maven.surefire.testng.TestNGExecutor.run(TestNGExecutor.java:281) [surefire-testng-2.19.1.jar:2.19.1]
	at org.apache.maven.surefire.testng.TestNGXmlTestSuite.execute(TestNGXmlTestSuite.java:75) [surefire-testng-2.19.1.jar:2.19.1]
	at org.apache.maven.surefire.testng.TestNGProvider.invoke(TestNGProvider.java:121) [surefire-testng-2.19.1.jar:2.19.1]
	at org.apache.maven.surefire.booter.ForkedBooter.invokeProviderInSameClassLoader(ForkedBooter.java:290) [surefire-booter-2.19.1.jar:2.19.1]
	at org.apache.maven.surefire.booter.ForkedBooter.runSuitesInProcess(ForkedBooter.java:242) [surefire-booter-2.19.1.jar:2.19.1]
	at org.apache.maven.surefire.booter.ForkedBooter.main(ForkedBooter.java:121) [surefire-booter-2.19.1.jar:2.19.1]
Caused by: io.siddhi.core.exception.SiddhiAppRuntimeException: Provided format yyyy-MM-dd HH:mm:ss.SSS does not match with the timestamp 2014:12:11 13:23:44.657Unparseable date: "2014:12:11 13:23:44.657" does not match (\p{Nd}++)\Q-\E(\p{Nd}++)\Q-\E(\p{Nd}++)\Q \E(\p{Nd}++)\Q:\E(\p{Nd}++)\Q:\E(\p{Nd}++)\Q.\E(\p{Nd}++)
	at io.siddhi.extension.execution.time.ExtractDayOfWeekFunctionExtension.execute(ExtractDayOfWeekFunctionExtension.java:159) ~[classes/:?]
	at io.siddhi.core.executor.function.FunctionExecutor.execute(FunctionExecutor.java:100) ~[siddhi-core-5.1.21.jar:?]
	... 40 more
Caused by: java.text.ParseException: Unparseable date: "2014:12:11 13:23:44.657" does not match (\p{Nd}++)\Q-\E(\p{Nd}++)\Q-\E(\p{Nd}++)\Q \E(\p{Nd}++)\Q:\E(\p{Nd}++)\Q:\E(\p{Nd}++)\Q.\E(\p{Nd}++)
	at org.apache.commons.lang3.time.FastDateParser.parse(FastDateParser.java:289) ~[commons-lang3-3.3.2.jar:3.3.2]
	at org.apache.commons.lang3.time.FastDateFormat.parse(FastDateFormat.java:487) ~[commons-lang3-3.3.2.jar:3.3.2]
	at io.siddhi.extension.execution.time.ExtractDayOfWeekFunctionExtension.execute(ExtractDayOfWeekFunctionExtension.java:154) ~[classes/:?]
	at io.siddhi.core.executor.function.FunctionExecutor.execute(FunctionExecutor.java:100) ~[siddhi-core-5.1.21.jar:?]
	... 40 more
ExtractDayOfWeekFunctionExtensionTestCaseInvalidInput
Events{ @timestamp = 1644963878984, inEvents = [Event{timestamp=1644963878984, data=[IBM, null], isExpired=false}], RemoveEvents = null }
ExtractDayOfWeekFunctionExtensionTestCaseInvalidNoOFArguments
TimestampInMillisecondsWithAllArgumentsFunctionExtensionTestCase
Events{ @timestamp = 1644963878989, inEvents = [Event{timestamp=1644963878989, data=[IBM, 1170151200019, 1196418619000], isExpired=false}], RemoveEvents = null }
Event : 1 timestampInMillisecondsWithAllArguments : 1170151200019
TimestampInMillisecondsWithAllArgumentsFunctionExtensionInvalidFormatTypeTestCase
Error in '8fb938ef-3903-466d-8909-03508ca1f002' after consuming events from Stream 'inputStream', Provided format yyyy-MM-DD HH:MM:SS does not match with the timestamp 2007:11:30 10:30:19. Unparseable date: "2007:11:30 10:30:19" does not match (\p{Nd}++)\Q-\E(\p{Nd}++)\Q-\E(\p{Nd}++)\Q \E(\p{Nd}++)\Q:\E(\p{Nd}++)\Q:\E(\p{Nd}++). Exception on class 'io.siddhi.extension.execution.time.TimestampInMillisecondsFunctionExtension'. Hence, dropping event '[IBM, 700.0, 100]'
io.siddhi.core.exception.SiddhiAppRuntimeException: Provided format yyyy-MM-DD HH:MM:SS does not match with the timestamp 2007:11:30 10:30:19. Unparseable date: "2007:11:30 10:30:19" does not match (\p{Nd}++)\Q-\E(\p{Nd}++)\Q-\E(\p{Nd}++)\Q \E(\p{Nd}++)\Q:\E(\p{Nd}++)\Q:\E(\p{Nd}++). Exception on class 'io.siddhi.extension.execution.time.TimestampInMillisecondsFunctionExtension'
	at io.siddhi.core.executor.function.FunctionExecutor.execute(FunctionExecutor.java:106) ~[siddhi-core-5.1.21.jar:?]
	at io.siddhi.core.query.selector.attribute.processor.AttributeProcessor.process(AttributeProcessor.java:41) ~[siddhi-core-5.1.21.jar:?]
	at io.siddhi.core.query.selector.QuerySelector.processNoGroupBy(QuerySelector.java:173) ~[siddhi-core-5.1.21.jar:?]
	at io.siddhi.core.query.selector.QuerySelector.process(QuerySelector.java:88) ~[siddhi-core-5.1.21.jar:?]
	at io.siddhi.core.query.input.ProcessStreamReceiver.processAndClear(ProcessStreamReceiver.java:182) ~[siddhi-core-5.1.21.jar:?]
	at io.siddhi.core.query.input.ProcessStreamReceiver.process(ProcessStreamReceiver.java:89) ~[siddhi-core-5.1.21.jar:?]
	at io.siddhi.core.query.input.ProcessStreamReceiver.receive(ProcessStreamReceiver.java:178) ~[siddhi-core-5.1.21.jar:?]
	at io.siddhi.core.stream.StreamJunction.sendData(StreamJunction.java:272) ~[siddhi-core-5.1.21.jar:?]
	at io.siddhi.core.stream.StreamJunction.access$200(StreamJunction.java:65) [siddhi-core-5.1.21.jar:?]
	at io.siddhi.core.stream.StreamJunction$Publisher.send(StreamJunction.java:533) [siddhi-core-5.1.21.jar:?]
	at io.siddhi.core.stream.input.InputDistributor.send(InputDistributor.java:49) [siddhi-core-5.1.21.jar:?]
	at io.siddhi.core.stream.input.InputEntryValve.send(InputEntryValve.java:75) [siddhi-core-5.1.21.jar:?]
	at io.siddhi.core.stream.input.InputHandler.send(InputHandler.java:53) [siddhi-core-5.1.21.jar:?]
	at io.siddhi.extension.execution.time.TimestampInMillisecondsFunctionExtensionTestCase.timestampInMillisecondsWithAllArgumentsFunctionExtension2(TimestampInMillisecondsFunctionExtensionTestCase.java:186) [test-classes/:?]
	at sun.reflect.NativeMethodAccessorImpl.invoke0(Native Method) ~[?:1.8.0_171]
	at sun.reflect.NativeMethodAccessorImpl.invoke(NativeMethodAccessorImpl.java:62) ~[?:1.8.0_171]
	at sun.reflect.DelegatingMethodAccessorImpl.invoke(DelegatingMethodAccessorImpl.java:43) ~[?:1.8.0_171]
	at java.lang.reflect.Method.invoke(Method.java:498) ~[?:1.8.0_171]
	at org.testng.internal.MethodInvocationHelper.invokeMethod(MethodInvocationHelper.java:80) [testng-6.8.jar:?]
	at org.testng.internal.Invoker.invokeMethod(Invoker.java:714) [testng-6.8.jar:?]
	at org.testng.internal.Invoker.invokeTestMethod(Invoker.java:901) [testng-6.8.jar:?]
	at org.testng.internal.Invoker.invokeTestMethods(Invoker.java:1231) [testng-6.8.jar:?]
	at org.testng.internal.TestMethodWorker.invokeTestMethods(TestMethodWorker.java:127) [testng-6.8.jar:?]
	at org.testng.internal.TestMethodWorker.run(TestMethodWorker.java:111) [testng-6.8.jar:?]
	at org.testng.TestRunner.privateRun(TestRunner.java:767) [testng-6.8.jar:?]
	at org.testng.TestRunner.run(TestRunner.java:617) [testng-6.8.jar:?]
	at org.testng.SuiteRunner.runTest(SuiteRunner.java:334) [testng-6.8.jar:?]
	at org.testng.SuiteRunner.runSequentially(SuiteRunner.java:329) [testng-6.8.jar:?]
	at org.testng.SuiteRunner.privateRun(SuiteRunner.java:291) [testng-6.8.jar:?]
	at org.testng.SuiteRunner.run(SuiteRunner.java:240) [testng-6.8.jar:?]
	at org.testng.SuiteRunnerWorker.runSuite(SuiteRunnerWorker.java:52) [testng-6.8.jar:?]
	at org.testng.SuiteRunnerWorker.run(SuiteRunnerWorker.java:86) [testng-6.8.jar:?]
	at org.testng.TestNG.runSuitesSequentially(TestNG.java:1198) [testng-6.8.jar:?]
	at org.testng.TestNG.runSuitesLocally(TestNG.java:1123) [testng-6.8.jar:?]
	at org.testng.TestNG.run(TestNG.java:1031) [testng-6.8.jar:?]
	at org.apache.maven.surefire.testng.TestNGExecutor.run(TestNGExecutor.java:281) [surefire-testng-2.19.1.jar:2.19.1]
	at org.apache.maven.surefire.testng.TestNGXmlTestSuite.execute(TestNGXmlTestSuite.java:75) [surefire-testng-2.19.1.jar:2.19.1]
	at org.apache.maven.surefire.testng.TestNGProvider.invoke(TestNGProvider.java:121) [surefire-testng-2.19.1.jar:2.19.1]
	at org.apache.maven.surefire.booter.ForkedBooter.invokeProviderInSameClassLoader(ForkedBooter.java:290) [surefire-booter-2.19.1.jar:2.19.1]
	at org.apache.maven.surefire.booter.ForkedBooter.runSuitesInProcess(ForkedBooter.java:242) [surefire-booter-2.19.1.jar:2.19.1]
	at org.apache.maven.surefire.booter.ForkedBooter.main(ForkedBooter.java:121) [surefire-booter-2.19.1.jar:2.19.1]
Caused by: io.siddhi.core.exception.SiddhiAppRuntimeException: Provided format yyyy-MM-DD HH:MM:SS does not match with the timestamp 2007:11:30 10:30:19. Unparseable date: "2007:11:30 10:30:19" does not match (\p{Nd}++)\Q-\E(\p{Nd}++)\Q-\E(\p{Nd}++)\Q \E(\p{Nd}++)\Q:\E(\p{Nd}++)\Q:\E(\p{Nd}++)
	at io.siddhi.extension.execution.time.TimestampInMillisecondsFunctionExtension.execute(TimestampInMillisecondsFunctionExtension.java:173) ~[classes/:?]
	at io.siddhi.core.executor.function.FunctionExecutor.execute(FunctionExecutor.java:100) ~[siddhi-core-5.1.21.jar:?]
	... 40 more
Caused by: java.text.ParseException: Unparseable date: "2007:11:30 10:30:19" does not match (\p{Nd}++)\Q-\E(\p{Nd}++)\Q-\E(\p{Nd}++)\Q \E(\p{Nd}++)\Q:\E(\p{Nd}++)\Q:\E(\p{Nd}++)
	at org.apache.commons.lang3.time.FastDateParser.parse(FastDateParser.java:289) ~[commons-lang3-3.3.2.jar:3.3.2]
	at org.apache.commons.lang3.time.FastDateFormat.parse(FastDateFormat.java:487) ~[commons-lang3-3.3.2.jar:3.3.2]
	at io.siddhi.extension.execution.time.TimestampInMillisecondsFunctionExtension.execute(TimestampInMillisecondsFunctionExtension.java:168) ~[classes/:?]
	at io.siddhi.core.executor.function.FunctionExecutor.execute(FunctionExecutor.java:100) ~[siddhi-core-5.1.21.jar:?]
	... 40 more
TimestampInMillisecondsWithAllArgumentsFunctionExtensionInvalidNoOfArgumentsTestCase
TimestampInMillisecondsWithAllArgumentsFunctionExtensionTestCaseInvalidFormatLengthTwo
Error in 'df59f018-913b-438f-98a6-6997c03229e4' after consuming events from Stream 'inputStream', Provided format yyyy-MM-dd HH:mm:ss.SSS does not match with the timestamp 2007Unparseable date: "2007" does not match (\p{Nd}++)\Q-\E(\p{Nd}++)\Q-\E(\p{Nd}++)\Q \E(\p{Nd}++)\Q:\E(\p{Nd}++)\Q:\E(\p{Nd}++)\Q.\E(\p{Nd}++). Exception on class 'io.siddhi.extension.execution.time.TimestampInMillisecondsFunctionExtension'. Hence, dropping event '[IBM, 700.0, 100]'
io.siddhi.core.exception.SiddhiAppRuntimeException: Provided format yyyy-MM-dd HH:mm:ss.SSS does not match with the timestamp 2007Unparseable date: "2007" does not match (\p{Nd}++)\Q-\E(\p{Nd}++)\Q-\E(\p{Nd}++)\Q \E(\p{Nd}++)\Q:\E(\p{Nd}++)\Q:\E(\p{Nd}++)\Q.\E(\p{Nd}++). Exception on class 'io.siddhi.extension.execution.time.TimestampInMillisecondsFunctionExtension'
	at io.siddhi.core.executor.function.FunctionExecutor.execute(FunctionExecutor.java:106) ~[siddhi-core-5.1.21.jar:?]
	at io.siddhi.core.query.selector.attribute.processor.AttributeProcessor.process(AttributeProcessor.java:41) ~[siddhi-core-5.1.21.jar:?]
	at io.siddhi.core.query.selector.QuerySelector.processNoGroupBy(QuerySelector.java:173) ~[siddhi-core-5.1.21.jar:?]
	at io.siddhi.core.query.selector.QuerySelector.process(QuerySelector.java:88) ~[siddhi-core-5.1.21.jar:?]
	at io.siddhi.core.query.input.ProcessStreamReceiver.processAndClear(ProcessStreamReceiver.java:182) ~[siddhi-core-5.1.21.jar:?]
	at io.siddhi.core.query.input.ProcessStreamReceiver.process(ProcessStreamReceiver.java:89) ~[siddhi-core-5.1.21.jar:?]
	at io.siddhi.core.query.input.ProcessStreamReceiver.receive(ProcessStreamReceiver.java:178) ~[siddhi-core-5.1.21.jar:?]
	at io.siddhi.core.stream.StreamJunction.sendData(StreamJunction.java:272) ~[siddhi-core-5.1.21.jar:?]
	at io.siddhi.core.stream.StreamJunction.access$200(StreamJunction.java:65) [siddhi-core-5.1.21.jar:?]
	at io.siddhi.core.stream.StreamJunction$Publisher.send(StreamJunction.java:533) [siddhi-core-5.1.21.jar:?]
	at io.siddhi.core.stream.input.InputDistributor.send(InputDistributor.java:49) [siddhi-core-5.1.21.jar:?]
	at io.siddhi.core.stream.input.InputEntryValve.send(InputEntryValve.java:75) [siddhi-core-5.1.21.jar:?]
	at io.siddhi.core.stream.input.InputHandler.send(InputHandler.java:53) [siddhi-core-5.1.21.jar:?]
	at io.siddhi.extension.execution.time.TimestampInMillisecondsFunctionExtensionTestCase.timestampInMillisecondsWithAllArgumentsFunctionExtension4(TimestampInMillisecondsFunctionExtensionTestCase.java:257) [test-classes/:?]
	at sun.reflect.NativeMethodAccessorImpl.invoke0(Native Method) ~[?:1.8.0_171]
	at sun.reflect.NativeMethodAccessorImpl.invoke(NativeMethodAccessorImpl.java:62) ~[?:1.8.0_171]
	at sun.reflect.DelegatingMethodAccessorImpl.invoke(DelegatingMethodAccessorImpl.java:43) ~[?:1.8.0_171]
	at java.lang.reflect.Method.invoke(Method.java:498) ~[?:1.8.0_171]
	at org.testng.internal.MethodInvocationHelper.invokeMethod(MethodInvocationHelper.java:80) [testng-6.8.jar:?]
	at org.testng.internal.Invoker.invokeMethod(Invoker.java:714) [testng-6.8.jar:?]
	at org.testng.internal.Invoker.invokeTestMethod(Invoker.java:901) [testng-6.8.jar:?]
	at org.testng.internal.Invoker.invokeTestMethods(Invoker.java:1231) [testng-6.8.jar:?]
	at org.testng.internal.TestMethodWorker.invokeTestMethods(TestMethodWorker.java:127) [testng-6.8.jar:?]
	at org.testng.internal.TestMethodWorker.run(TestMethodWorker.java:111) [testng-6.8.jar:?]
	at org.testng.TestRunner.privateRun(TestRunner.java:767) [testng-6.8.jar:?]
	at org.testng.TestRunner.run(TestRunner.java:617) [testng-6.8.jar:?]
	at org.testng.SuiteRunner.runTest(SuiteRunner.java:334) [testng-6.8.jar:?]
	at org.testng.SuiteRunner.runSequentially(SuiteRunner.java:329) [testng-6.8.jar:?]
	at org.testng.SuiteRunner.privateRun(SuiteRunner.java:291) [testng-6.8.jar:?]
	at org.testng.SuiteRunner.run(SuiteRunner.java:240) [testng-6.8.jar:?]
	at org.testng.SuiteRunnerWorker.runSuite(SuiteRunnerWorker.java:52) [testng-6.8.jar:?]
	at org.testng.SuiteRunnerWorker.run(SuiteRunnerWorker.java:86) [testng-6.8.jar:?]
	at org.testng.TestNG.runSuitesSequentially(TestNG.java:1198) [testng-6.8.jar:?]
	at org.testng.TestNG.runSuitesLocally(TestNG.java:1123) [testng-6.8.jar:?]
	at org.testng.TestNG.run(TestNG.java:1031) [testng-6.8.jar:?]
	at org.apache.maven.surefire.testng.TestNGExecutor.run(TestNGExecutor.java:281) [surefire-testng-2.19.1.jar:2.19.1]
	at org.apache.maven.surefire.testng.TestNGXmlTestSuite.execute(TestNGXmlTestSuite.java:75) [surefire-testng-2.19.1.jar:2.19.1]
	at org.apache.maven.surefire.testng.TestNGProvider.invoke(TestNGProvider.java:121) [surefire-testng-2.19.1.jar:2.19.1]
	at org.apache.maven.surefire.booter.ForkedBooter.invokeProviderInSameClassLoader(ForkedBooter.java:290) [surefire-booter-2.19.1.jar:2.19.1]
	at org.apache.maven.surefire.booter.ForkedBooter.runSuitesInProcess(ForkedBooter.java:242) [surefire-booter-2.19.1.jar:2.19.1]
	at org.apache.maven.surefire.booter.ForkedBooter.main(ForkedBooter.java:121) [surefire-booter-2.19.1.jar:2.19.1]
Caused by: io.siddhi.core.exception.SiddhiAppRuntimeException: Provided format yyyy-MM-dd HH:mm:ss.SSS does not match with the timestamp 2007Unparseable date: "2007" does not match (\p{Nd}++)\Q-\E(\p{Nd}++)\Q-\E(\p{Nd}++)\Q \E(\p{Nd}++)\Q:\E(\p{Nd}++)\Q:\E(\p{Nd}++)\Q.\E(\p{Nd}++)
	at io.siddhi.extension.execution.time.TimestampInMillisecondsFunctionExtension.execute(TimestampInMillisecondsFunctionExtension.java:197) ~[classes/:?]
	at io.siddhi.core.executor.function.FunctionExecutor.execute(FunctionExecutor.java:94) ~[siddhi-core-5.1.21.jar:?]
	... 40 more
Caused by: java.text.ParseException: Unparseable date: "2007" does not match (\p{Nd}++)\Q-\E(\p{Nd}++)\Q-\E(\p{Nd}++)\Q \E(\p{Nd}++)\Q:\E(\p{Nd}++)\Q:\E(\p{Nd}++)\Q.\E(\p{Nd}++)
	at org.apache.commons.lang3.time.FastDateParser.parse(FastDateParser.java:289) ~[commons-lang3-3.3.2.jar:3.3.2]
	at org.apache.commons.lang3.time.FastDateFormat.parse(FastDateFormat.java:487) ~[commons-lang3-3.3.2.jar:3.3.2]
	at io.siddhi.extension.execution.time.TimestampInMillisecondsFunctionExtension.execute(TimestampInMillisecondsFunctionExtension.java:192) ~[classes/:?]
	at io.siddhi.core.executor.function.FunctionExecutor.execute(FunctionExecutor.java:94) ~[siddhi-core-5.1.21.jar:?]
	... 40 more
TimestampInMillisecondsWithAllArgumentsFunctionExtensionInvalidParameterFirstArgumentTestCase
TimestampInMillisecondsWithAllArgumentsFunctionExtensionInvalidParameterLengthOneTestCase
TimestampInMillisecondsWithAllArgumentsFunctionExtensionInvalidParameterSecondArgumentTestCase
TimestampInMillisecondsWithAllArgumentsFunctionExtensionFirstArgumentNullTestCase
Events{ @timestamp = 1644963879309, inEvents = [Event{timestamp=1644963879309, data=[IBM, null, 1196418619000], isExpired=false}], RemoveEvents = null }
TimestampInMillisecondsWithAllArgumentsFunctionExtensionSecondArgumentNullTestCase
Events{ @timestamp = 1644963879412, inEvents = [Event{timestamp=1644963879412, data=[IBM, null, 1196418619000], isExpired=false}], RemoveEvents = null }
TimestampInMillisecondsWithDateFunctionExtensionTestCase
Events{ @timestamp = 1644963879515, inEvents = [Event{timestamp=1644963879515, data=[IBM, 1196418619000], isExpired=false}], RemoveEvents = null }
Event : 1 timestampInMillisecondsWithDateArgument : 1196418619000
TimestampInMillisecondsWithoutArgumentFunctionExtensionTestCase
Events{ @timestamp = 1644963879619, inEvents = [Event{timestamp=1644963879619, data=[IBM, 1644963879619], isExpired=false}], RemoveEvents = null }
Event : 1 timestampInMillisecondsWithoutArguments : 1644963879619
UTCTimestampFunctionExtensionTestCase
Events{ @timestamp = 1644963879723, inEvents = [Event{timestamp=1644963879723, data=[IBM, 2022-02-15 22:24:39], isExpired=false}], RemoveEvents = null }
Event : 1,utcTimestamp : 2022-02-15 22:24:39
Events{ @timestamp = 1644963879723, inEvents = [Event{timestamp=1644963879723, data=[WSO2, 2022-02-15 22:24:39], isExpired=false}], RemoveEvents = null }
Event : 2,utcTimestamp : 2022-02-15 22:24:39
Events{ @timestamp = 1644963879724, inEvents = [Event{timestamp=1644963879724, data=[XYZ, 2022-02-15 22:24:39], isExpired=false}], RemoveEvents = null }
Event : 3,utcTimestamp : 2022-02-15 22:24:39
utcTimestampFunctionExtensionWithCustomDateFormatTestCase
Events{ @timestamp = 1644963879727, inEvents = [Event{timestamp=1644963879727, data=[IBM, 2022-02-15 22:24:39.727], isExpired=false}], RemoveEvents = null }
Event : 1,utcTimestamp : 2022-02-15 22:24:39.727
Events{ @timestamp = 1644963879727, inEvents = [Event{timestamp=1644963879727, data=[WSO2, 2022/02/15 22:24:39], isExpired=false}], RemoveEvents = null }
Event : 2,utcTimestamp : 2022/02/15 22:24:39
Events{ @timestamp = 1644963879728, inEvents = [Event{timestamp=1644963879728, data=[XYZ, 2022-02-15 22:24], isExpired=false}], RemoveEvents = null }
Event : 3,utcTimestamp : 2022-02-15 22:24
timezoneConvertFunctionWithAllArgumentsTestCase
Events{ @timestamp = 1644963879731, inEvents = [Event{timestamp=1644963879731, data=[IBM, 2014-11-10 23:53:44, 2014-11-11 13:23:44], isExpired=false}], RemoveEvents = null }
Events{ @timestamp = 1644963879736, inEvents = [Event{timestamp=1644963879736, data=[IBM, 2016-04-20T14:30:00-0400, 2016-04-21T00:00:00+0530], isExpired=false}], RemoveEvents = null }
timezoneConvertFunctionWithDifferentTimezonesArgumentsTestCase
Events{ @timestamp = 1644963879840, inEvents = [Event{timestamp=1644963879840, data=[IBM, 2020-11-17 16:51:19, 2020-11-18 06:21:19], isExpired=false}], RemoveEvents = null }
Events{ @timestamp = 1644963879841, inEvents = [Event{timestamp=1644963879841, data=[IBM, 2016-04-20T14:30:00-0400, 2016-04-21T00:00:00+0530], isExpired=false}], RemoveEvents = null }
Events{ @timestamp = 1644963879841, inEvents = [Event{timestamp=1644963879841, data=[IBM, 2020-11-18 04:54:19, 2020-11-18 06:54:19], isExpired=false}], RemoveEvents = null }
Events{ @timestamp = 1644963879841, inEvents = [Event{timestamp=1644963879841, data=[IBM, 2020-11-18 14:26, 2020-11-18 06:56], isExpired=false}], RemoveEvents = null }
Events{ @timestamp = 1644963879842, inEvents = [Event{timestamp=1644963879842, data=[IBM, 2020-11-18 01:26, 2020-11-18 06:56], isExpired=false}], RemoveEvents = null }
Events{ @timestamp = 1644963879842, inEvents = [Event{timestamp=1644963879842, data=[IBM, 2014/11/11 07:53:44, 2014/11/11 13:23:44], isExpired=false}], RemoveEvents = null }
Events{ @timestamp = 1644963879842, inEvents = [Event{timestamp=1644963879842, data=[IBM, 2019-08-07 14:19:10, 2019-08-07 07:19:10], isExpired=false}], RemoveEvents = null }
timezoneConvertFunctionWithMandatoryArgumentsTestCase
Events{ @timestamp = 1644963879947, inEvents = [Event{timestamp=1644963879947, data=[IBM, 2014-11-10 23:53:44, 2014-11-11 13:23:44], isExpired=false}], RemoveEvents = null }
Events{ @timestamp = 1644963879947, inEvents = [Event{timestamp=1644963879947, data=[IBM, 2016-04-20T14:30:00-0400, 2016-04-21T00:00:00+0530], isExpired=false}], RemoveEvents = null }
Events{ @timestamp = 1644963879947, inEvents = [Event{timestamp=1644963879947, data=[IBM, 2020/11/10 18:53:44, 2020/11/11 06:23:44], isExpired=false}], RemoveEvents = null }
Tests run: 126, Failures: 0, Errors: 0, Skipped: 0, Time elapsed: 5.886 sec - in TestSuite

Results :

Tests run: 126, Failures: 0, Errors: 0, Skipped: 0

[JENKINS] Recording test results
[INFO] 
[INFO] --- maven-bundle-plugin:3.0.1:bundle (default-bundle) @ siddhi-execution-time ---
[INFO] 
[INFO] --- jacoco-maven-plugin:0.7.9:report (jacoco-site) @ siddhi-execution-time ---
[INFO] Loading execution data file /home/jenkins/workspace/sonar/sonar-siddhi-execution-time/component/target/coverage-reports/jacoco.exec
[INFO] Analyzed bundle 'WSO2 Siddhi Execution Extension - Time' with 14 classes
[INFO] 
[INFO] --- maven-install-plugin:2.5.2:install (default-install) @ siddhi-execution-time ---
[INFO] Installing /home/jenkins/workspace/sonar/sonar-siddhi-execution-time/component/target/siddhi-execution-time-5.0.9-SNAPSHOT.jar to /home/jenkins/workspace/sonar/sonar-siddhi-execution-time/.repository/io/siddhi/extension/execution/time/siddhi-execution-time/5.0.9-SNAPSHOT/siddhi-execution-time-5.0.9-SNAPSHOT.jar
[INFO] Installing /home/jenkins/workspace/sonar/sonar-siddhi-execution-time/component/pom.xml to /home/jenkins/workspace/sonar/sonar-siddhi-execution-time/.repository/io/siddhi/extension/execution/time/siddhi-execution-time/5.0.9-SNAPSHOT/siddhi-execution-time-5.0.9-SNAPSHOT.pom
[INFO] 
[INFO] --- maven-bundle-plugin:3.0.1:install (default-install) @ siddhi-execution-time ---
[INFO] Local OBR update disabled (enable with -DobrRepository)
[INFO] 
[INFO] --- siddhi-doc-gen:5.1.21:generate-md-docs (default) @ siddhi-execution-time ---
[INFO] Downloading from wso2.releases: http://maven.wso2.org/nexus/content/repositories/releases/org/apache/maven/maven-plugin-api/3.6.3/maven-plugin-api-3.6.3.pom
[INFO] Downloading from wso2-nexus: http://maven.wso2.org/nexus/content/groups/wso2-public/org/apache/maven/maven-plugin-api/3.6.3/maven-plugin-api-3.6.3.pom
[INFO] Downloaded from wso2-nexus: http://maven.wso2.org/nexus/content/groups/wso2-public/org/apache/maven/maven-plugin-api/3.6.3/maven-plugin-api-3.6.3.pom (3.0 kB at 41 kB/s)
[INFO] Downloading from wso2.releases: http://maven.wso2.org/nexus/content/repositories/releases/org/apache/maven/maven/3.6.3/maven-3.6.3.pom
[INFO] Downloading from wso2-nexus: http://maven.wso2.org/nexus/content/groups/wso2-public/org/apache/maven/maven/3.6.3/maven-3.6.3.pom
[INFO] Downloaded from wso2-nexus: http://maven.wso2.org/nexus/content/groups/wso2-public/org/apache/maven/maven/3.6.3/maven-3.6.3.pom (26 kB at 281 kB/s)
[INFO] Downloading from wso2.releases: http://maven.wso2.org/nexus/content/repositories/releases/org/apache/maven/maven-parent/33/maven-parent-33.pom
[INFO] Downloading from wso2-nexus: http://maven.wso2.org/nexus/content/groups/wso2-public/org/apache/maven/maven-parent/33/maven-parent-33.pom
[INFO] Downloaded from wso2-nexus: http://maven.wso2.org/nexus/content/groups/wso2-public/org/apache/maven/maven-parent/33/maven-parent-33.pom (44 kB at 8.8 MB/s)
[INFO] Downloading from wso2.releases: http://maven.wso2.org/nexus/content/repositories/releases/org/apache/apache/21/apache-21.pom
[INFO] Downloading from wso2-nexus: http://maven.wso2.org/nexus/content/groups/wso2-public/org/apache/apache/21/apache-21.pom
[INFO] Downloaded from wso2-nexus: http://maven.wso2.org/nexus/content/groups/wso2-public/org/apache/apache/21/apache-21.pom (17 kB at 4.3 MB/s)
[INFO] Downloading from wso2.releases: http://maven.wso2.org/nexus/content/repositories/releases/org/apache/maven/maven-model/3.6.3/maven-model-3.6.3.pom
[INFO] Downloading from wso2-nexus: http://maven.wso2.org/nexus/content/groups/wso2-public/org/apache/maven/maven-model/3.6.3/maven-model-3.6.3.pom
[INFO] Downloaded from wso2-nexus: http://maven.wso2.org/nexus/content/groups/wso2-public/org/apache/maven/maven-model/3.6.3/maven-model-3.6.3.pom (4.1 kB at 102 kB/s)
[INFO] Downloading from wso2.releases: http://maven.wso2.org/nexus/content/repositories/releases/org/codehaus/plexus/plexus-utils/3.2.1/plexus-utils-3.2.1.pom
[INFO] Downloading from wso2-nexus: http://maven.wso2.org/nexus/content/groups/wso2-public/org/codehaus/plexus/plexus-utils/3.2.1/plexus-utils-3.2.1.pom
[INFO] Downloaded from wso2-nexus: http://maven.wso2.org/nexus/content/groups/wso2-public/org/codehaus/plexus/plexus-utils/3.2.1/plexus-utils-3.2.1.pom (5.3 kB at 191 kB/s)
[INFO] Downloading from wso2.releases: http://maven.wso2.org/nexus/content/repositories/releases/org/codehaus/plexus/plexus/5.1/plexus-5.1.pom
[INFO] Downloading from wso2-nexus: http://maven.wso2.org/nexus/content/groups/wso2-public/org/codehaus/plexus/plexus/5.1/plexus-5.1.pom
[INFO] Downloaded from wso2-nexus: http://maven.wso2.org/nexus/content/groups/wso2-public/org/codehaus/plexus/plexus/5.1/plexus-5.1.pom (23 kB at 5.6 MB/s)
[INFO] Downloading from wso2.releases: http://maven.wso2.org/nexus/content/repositories/releases/org/apache/maven/maven-artifact/3.6.3/maven-artifact-3.6.3.pom
[INFO] Downloading from wso2-nexus: http://maven.wso2.org/nexus/content/groups/wso2-public/org/apache/maven/maven-artifact/3.6.3/maven-artifact-3.6.3.pom
[INFO] Downloaded from wso2-nexus: http://maven.wso2.org/nexus/content/groups/wso2-public/org/apache/maven/maven-artifact/3.6.3/maven-artifact-3.6.3.pom (2.4 kB at 33 kB/s)
[INFO] Downloading from wso2.releases: http://maven.wso2.org/nexus/content/repositories/releases/org/apache/commons/commons-lang3/3.9/commons-lang3-3.9.pom
[INFO] Downloading from wso2-nexus: http://maven.wso2.org/nexus/content/groups/wso2-public/org/apache/commons/commons-lang3/3.9/commons-lang3-3.9.pom
[INFO] Downloaded from wso2-nexus: http://maven.wso2.org/nexus/content/groups/wso2-public/org/apache/commons/commons-lang3/3.9/commons-lang3-3.9.pom (28 kB at 1.2 MB/s)
[INFO] Downloading from wso2.releases: http://maven.wso2.org/nexus/content/repositories/releases/org/apache/commons/commons-parent/48/commons-parent-48.pom
[INFO] Downloading from wso2-nexus: http://maven.wso2.org/nexus/content/groups/wso2-public/org/apache/commons/commons-parent/48/commons-parent-48.pom
[INFO] Downloaded from wso2-nexus: http://maven.wso2.org/nexus/content/groups/wso2-public/org/apache/commons/commons-parent/48/commons-parent-48.pom (72 kB at 3.1 MB/s)
[INFO] Downloading from wso2.releases: http://maven.wso2.org/nexus/content/repositories/releases/org/eclipse/sisu/org.eclipse.sisu.plexus/0.3.4/org.eclipse.sisu.plexus-0.3.4.pom
[INFO] Downloading from wso2-nexus: http://maven.wso2.org/nexus/content/groups/wso2-public/org/eclipse/sisu/org.eclipse.sisu.plexus/0.3.4/org.eclipse.sisu.plexus-0.3.4.pom
[INFO] Downloaded from wso2-nexus: http://maven.wso2.org/nexus/content/groups/wso2-public/org/eclipse/sisu/org.eclipse.sisu.plexus/0.3.4/org.eclipse.sisu.plexus-0.3.4.pom (4.2 kB at 48 kB/s)
[INFO] Downloading from wso2.releases: http://maven.wso2.org/nexus/content/repositories/releases/org/eclipse/sisu/sisu-plexus/0.3.4/sisu-plexus-0.3.4.pom
[INFO] Downloading from wso2-nexus: http://maven.wso2.org/nexus/content/groups/wso2-public/org/eclipse/sisu/sisu-plexus/0.3.4/sisu-plexus-0.3.4.pom
[INFO] Downloaded from wso2-nexus: http://maven.wso2.org/nexus/content/groups/wso2-public/org/eclipse/sisu/sisu-plexus/0.3.4/sisu-plexus-0.3.4.pom (14 kB at 327 kB/s)
[INFO] Downloading from wso2.releases: http://maven.wso2.org/nexus/content/repositories/releases/javax/enterprise/cdi-api/1.0/cdi-api-1.0.pom
[INFO] Downloading from wso2-nexus: http://maven.wso2.org/nexus/content/groups/wso2-public/javax/enterprise/cdi-api/1.0/cdi-api-1.0.pom
[INFO] Downloaded from wso2-nexus: http://maven.wso2.org/nexus/content/groups/wso2-public/javax/enterprise/cdi-api/1.0/cdi-api-1.0.pom (1.4 kB at 358 kB/s)
[INFO] Downloading from wso2.releases: http://maven.wso2.org/nexus/content/repositories/releases/org/jboss/weld/weld-api-parent/1.0/weld-api-parent-1.0.pom
[INFO] Downloading from wso2-nexus: http://maven.wso2.org/nexus/content/groups/wso2-public/org/jboss/weld/weld-api-parent/1.0/weld-api-parent-1.0.pom
[INFO] Downloaded from wso2-nexus: http://maven.wso2.org/nexus/content/groups/wso2-public/org/jboss/weld/weld-api-parent/1.0/weld-api-parent-1.0.pom (2.4 kB at 589 kB/s)
[INFO] Downloading from wso2.releases: http://maven.wso2.org/nexus/content/repositories/releases/org/jboss/weld/weld-api-bom/1.0/weld-api-bom-1.0.pom
[INFO] Downloading from wso2-nexus: http://maven.wso2.org/nexus/content/groups/wso2-public/org/jboss/weld/weld-api-bom/1.0/weld-api-bom-1.0.pom
[INFO] Downloaded from wso2-nexus: http://maven.wso2.org/nexus/content/groups/wso2-public/org/jboss/weld/weld-api-bom/1.0/weld-api-bom-1.0.pom (7.9 kB at 2.6 MB/s)
[INFO] Downloading from wso2.releases: http://maven.wso2.org/nexus/content/repositories/releases/org/jboss/weld/weld-parent/6/weld-parent-6.pom
[INFO] Downloading from wso2-nexus: http://maven.wso2.org/nexus/content/groups/wso2-public/org/jboss/weld/weld-parent/6/weld-parent-6.pom
[INFO] Downloaded from wso2-nexus: http://maven.wso2.org/nexus/content/groups/wso2-public/org/jboss/weld/weld-parent/6/weld-parent-6.pom (21 kB at 6.9 MB/s)
[INFO] Downloading from wso2.releases: http://maven.wso2.org/nexus/content/repositories/releases/javax/annotation/jsr250-api/1.0/jsr250-api-1.0.pom
[INFO] Downloading from wso2-nexus: http://maven.wso2.org/nexus/content/groups/wso2-public/javax/annotation/jsr250-api/1.0/jsr250-api-1.0.pom
[INFO] Downloaded from wso2-nexus: http://maven.wso2.org/nexus/content/groups/wso2-public/javax/annotation/jsr250-api/1.0/jsr250-api-1.0.pom (1.0 kB at 256 kB/s)
[INFO] Downloading from wso2.releases: http://maven.wso2.org/nexus/content/repositories/releases/javax/inject/javax.inject/1/javax.inject-1.pom
[INFO] Downloading from wso2-nexus: http://maven.wso2.org/nexus/content/groups/wso2-public/javax/inject/javax.inject/1/javax.inject-1.pom
[INFO] Downloaded from wso2-nexus: http://maven.wso2.org/nexus/content/groups/wso2-public/javax/inject/javax.inject/1/javax.inject-1.pom (612 B at 153 kB/s)
[INFO] Downloading from wso2.releases: http://maven.wso2.org/nexus/content/repositories/releases/org/eclipse/sisu/org.eclipse.sisu.inject/0.3.4/org.eclipse.sisu.inject-0.3.4.pom
[INFO] Downloading from wso2-nexus: http://maven.wso2.org/nexus/content/groups/wso2-public/org/eclipse/sisu/org.eclipse.sisu.inject/0.3.4/org.eclipse.sisu.inject-0.3.4.pom
[INFO] Downloaded from wso2-nexus: http://maven.wso2.org/nexus/content/groups/wso2-public/org/eclipse/sisu/org.eclipse.sisu.inject/0.3.4/org.eclipse.sisu.inject-0.3.4.pom (2.6 kB at 56 kB/s)
[INFO] Downloading from wso2.releases: http://maven.wso2.org/nexus/content/repositories/releases/org/eclipse/sisu/sisu-inject/0.3.4/sisu-inject-0.3.4.pom
[INFO] Downloading from wso2-nexus: http://maven.wso2.org/nexus/content/groups/wso2-public/org/eclipse/sisu/sisu-inject/0.3.4/sisu-inject-0.3.4.pom
[INFO] Downloaded from wso2-nexus: http://maven.wso2.org/nexus/content/groups/wso2-public/org/eclipse/sisu/sisu-inject/0.3.4/sisu-inject-0.3.4.pom (14 kB at 655 kB/s)
[INFO] Downloading from wso2.releases: http://maven.wso2.org/nexus/content/repositories/releases/org/codehaus/plexus/plexus-classworlds/2.5.2/plexus-classworlds-2.5.2.pom
[INFO] Downloading from wso2-nexus: http://maven.wso2.org/nexus/content/groups/wso2-public/org/codehaus/plexus/plexus-classworlds/2.5.2/plexus-classworlds-2.5.2.pom
[INFO] Downloaded from wso2-nexus: http://maven.wso2.org/nexus/content/groups/wso2-public/org/codehaus/plexus/plexus-classworlds/2.5.2/plexus-classworlds-2.5.2.pom (7.3 kB at 1.0 MB/s)
[INFO] Downloading from wso2.releases: http://maven.wso2.org/nexus/content/repositories/releases/org/codehaus/plexus/plexus-utils/3.0.17/plexus-utils-3.0.17.pom
[INFO] Downloading from wso2-nexus: http://maven.wso2.org/nexus/content/groups/wso2-public/org/codehaus/plexus/plexus-utils/3.0.17/plexus-utils-3.0.17.pom
[INFO] Downloaded from wso2-nexus: http://maven.wso2.org/nexus/content/groups/wso2-public/org/codehaus/plexus/plexus-utils/3.0.17/plexus-utils-3.0.17.pom (3.4 kB at 849 kB/s)
[INFO] Downloading from wso2.releases: http://maven.wso2.org/nexus/content/repositories/releases/org/codehaus/plexus/plexus-classworlds/2.6.0/plexus-classworlds-2.6.0.pom
[INFO] Downloading from wso2-nexus: http://maven.wso2.org/nexus/content/groups/wso2-public/org/codehaus/plexus/plexus-classworlds/2.6.0/plexus-classworlds-2.6.0.pom
[INFO] Downloaded from wso2-nexus: http://maven.wso2.org/nexus/content/groups/wso2-public/org/codehaus/plexus/plexus-classworlds/2.6.0/plexus-classworlds-2.6.0.pom (7.9 kB at 377 kB/s)
[INFO] Downloading from wso2.releases: http://maven.wso2.org/nexus/content/repositories/releases/org/apache/maven/plugin-tools/maven-plugin-annotations/3.6.0/maven-plugin-annotations-3.6.0.pom
[INFO] Downloading from wso2-nexus: http://maven.wso2.org/nexus/content/groups/wso2-public/org/apache/maven/plugin-tools/maven-plugin-annotations/3.6.0/maven-plugin-annotations-3.6.0.pom
[INFO] Downloaded from wso2-nexus: http://maven.wso2.org/nexus/content/groups/wso2-public/org/apache/maven/plugin-tools/maven-plugin-annotations/3.6.0/maven-plugin-annotations-3.6.0.pom (1.6 kB at 30 kB/s)
[INFO] Downloading from wso2.releases: http://maven.wso2.org/nexus/content/repositories/releases/org/apache/maven/plugin-tools/maven-plugin-tools/3.6.0/maven-plugin-tools-3.6.0.pom
[INFO] Downloading from wso2-nexus: http://maven.wso2.org/nexus/content/groups/wso2-public/org/apache/maven/plugin-tools/maven-plugin-tools/3.6.0/maven-plugin-tools-3.6.0.pom
[INFO] Downloaded from wso2-nexus: http://maven.wso2.org/nexus/content/groups/wso2-public/org/apache/maven/plugin-tools/maven-plugin-tools/3.6.0/maven-plugin-tools-3.6.0.pom (15 kB at 275 kB/s)
[INFO] Downloading from wso2.releases: http://maven.wso2.org/nexus/content/repositories/releases/org/freemarker/freemarker-gae/2.3.29/freemarker-gae-2.3.29.pom
[INFO] Downloading from wso2-nexus: http://maven.wso2.org/nexus/content/groups/wso2-public/org/freemarker/freemarker-gae/2.3.29/freemarker-gae-2.3.29.pom
[INFO] Downloaded from wso2-nexus: http://maven.wso2.org/nexus/content/groups/wso2-public/org/freemarker/freemarker-gae/2.3.29/freemarker-gae-2.3.29.pom (3.4 kB at 42 kB/s)
[INFO] Downloading from wso2.releases: http://maven.wso2.org/nexus/content/repositories/releases/org/apache/maven/maven-core/3.6.3/maven-core-3.6.3.pom
[INFO] Downloading from wso2-nexus: http://maven.wso2.org/nexus/content/groups/wso2-public/org/apache/maven/maven-core/3.6.3/maven-core-3.6.3.pom
[INFO] Downloaded from wso2-nexus: http://maven.wso2.org/nexus/content/groups/wso2-public/org/apache/maven/maven-core/3.6.3/maven-core-3.6.3.pom (8.8 kB at 132 kB/s)
[INFO] Downloading from wso2.releases: http://maven.wso2.org/nexus/content/repositories/releases/org/apache/maven/maven-settings/3.6.3/maven-settings-3.6.3.pom
[INFO] Downloading from wso2-nexus: http://maven.wso2.org/nexus/content/groups/wso2-public/org/apache/maven/maven-settings/3.6.3/maven-settings-3.6.3.pom
[INFO] Downloaded from wso2-nexus: http://maven.wso2.org/nexus/content/groups/wso2-public/org/apache/maven/maven-settings/3.6.3/maven-settings-3.6.3.pom (1.9 kB at 65 kB/s)
[INFO] Downloading from wso2.releases: http://maven.wso2.org/nexus/content/repositories/releases/org/apache/maven/maven-settings-builder/3.6.3/maven-settings-builder-3.6.3.pom
[INFO] Downloading from wso2-nexus: http://maven.wso2.org/nexus/content/groups/wso2-public/org/apache/maven/maven-settings-builder/3.6.3/maven-settings-builder-3.6.3.pom
[INFO] Downloaded from wso2-nexus: http://maven.wso2.org/nexus/content/groups/wso2-public/org/apache/maven/maven-settings-builder/3.6.3/maven-settings-builder-3.6.3.pom (2.5 kB at 231 kB/s)
[INFO] Downloading from wso2.releases: http://maven.wso2.org/nexus/content/repositories/releases/org/apache/maven/maven-builder-support/3.6.3/maven-builder-support-3.6.3.pom
[INFO] Downloading from wso2-nexus: http://maven.wso2.org/nexus/content/groups/wso2-public/org/apache/maven/maven-builder-support/3.6.3/maven-builder-support-3.6.3.pom
[INFO] Downloaded from wso2-nexus: http://maven.wso2.org/nexus/content/groups/wso2-public/org/apache/maven/maven-builder-support/3.6.3/maven-builder-support-3.6.3.pom (1.4 kB at 21 kB/s)
[INFO] Downloading from wso2.releases: http://maven.wso2.org/nexus/content/repositories/releases/org/codehaus/plexus/plexus-interpolation/1.25/plexus-interpolation-1.25.pom
[INFO] Downloading from wso2-nexus: http://maven.wso2.org/nexus/content/groups/wso2-public/org/codehaus/plexus/plexus-interpolation/1.25/plexus-interpolation-1.25.pom
[INFO] Downloaded from wso2-nexus: http://maven.wso2.org/nexus/content/groups/wso2-public/org/codehaus/plexus/plexus-interpolation/1.25/plexus-interpolation-1.25.pom (2.6 kB at 65 kB/s)
[INFO] Downloading from wso2.releases: http://maven.wso2.org/nexus/content/repositories/releases/org/apache/maven/maven-repository-metadata/3.6.3/maven-repository-metadata-3.6.3.pom
[INFO] Downloading from wso2-nexus: http://maven.wso2.org/nexus/content/groups/wso2-public/org/apache/maven/maven-repository-metadata/3.6.3/maven-repository-metadata-3.6.3.pom
[INFO] Downloaded from wso2-nexus: http://maven.wso2.org/nexus/content/groups/wso2-public/org/apache/maven/maven-repository-metadata/3.6.3/maven-repository-metadata-3.6.3.pom (1.9 kB at 108 kB/s)
[INFO] Downloading from wso2.releases: http://maven.wso2.org/nexus/content/repositories/releases/org/apache/maven/maven-model-builder/3.6.3/maven-model-builder-3.6.3.pom
[INFO] Downloading from wso2-nexus: http://maven.wso2.org/nexus/content/groups/wso2-public/org/apache/maven/maven-model-builder/3.6.3/maven-model-builder-3.6.3.pom
[INFO] Downloaded from wso2-nexus: http://maven.wso2.org/nexus/content/groups/wso2-public/org/apache/maven/maven-model-builder/3.6.3/maven-model-builder-3.6.3.pom (3.4 kB at 106 kB/s)
[INFO] Downloading from wso2.releases: http://maven.wso2.org/nexus/content/repositories/releases/org/apache/maven/maven-resolver-provider/3.6.3/maven-resolver-provider-3.6.3.pom
[INFO] Downloading from wso2-nexus: http://maven.wso2.org/nexus/content/groups/wso2-public/org/apache/maven/maven-resolver-provider/3.6.3/maven-resolver-provider-3.6.3.pom
[INFO] Downloaded from wso2-nexus: http://maven.wso2.org/nexus/content/groups/wso2-public/org/apache/maven/maven-resolver-provider/3.6.3/maven-resolver-provider-3.6.3.pom (4.3 kB at 50 kB/s)
[INFO] Downloading from wso2.releases: http://maven.wso2.org/nexus/content/repositories/releases/org/apache/maven/resolver/maven-resolver-api/1.4.1/maven-resolver-api-1.4.1.pom
[INFO] Downloading from wso2-nexus: http://maven.wso2.org/nexus/content/groups/wso2-public/org/apache/maven/resolver/maven-resolver-api/1.4.1/maven-resolver-api-1.4.1.pom
[INFO] Downloaded from wso2-nexus: http://maven.wso2.org/nexus/content/groups/wso2-public/org/apache/maven/resolver/maven-resolver-api/1.4.1/maven-resolver-api-1.4.1.pom (2.6 kB at 12 kB/s)
[INFO] Downloading from wso2.releases: http://maven.wso2.org/nexus/content/repositories/releases/org/apache/maven/resolver/maven-resolver/1.4.1/maven-resolver-1.4.1.pom
[INFO] Downloading from wso2-nexus: http://maven.wso2.org/nexus/content/groups/wso2-public/org/apache/maven/resolver/maven-resolver/1.4.1/maven-resolver-1.4.1.pom
[INFO] Downloaded from wso2-nexus: http://maven.wso2.org/nexus/content/groups/wso2-public/org/apache/maven/resolver/maven-resolver/1.4.1/maven-resolver-1.4.1.pom (18 kB at 63 kB/s)
[INFO] Downloading from wso2.releases: http://maven.wso2.org/nexus/content/repositories/releases/org/apache/maven/resolver/maven-resolver-spi/1.4.1/maven-resolver-spi-1.4.1.pom
[INFO] Downloading from wso2-nexus: http://maven.wso2.org/nexus/content/groups/wso2-public/org/apache/maven/resolver/maven-resolver-spi/1.4.1/maven-resolver-spi-1.4.1.pom
[INFO] Downloaded from wso2-nexus: http://maven.wso2.org/nexus/content/groups/wso2-public/org/apache/maven/resolver/maven-resolver-spi/1.4.1/maven-resolver-spi-1.4.1.pom (2.6 kB at 15 kB/s)
[INFO] Downloading from wso2.releases: http://maven.wso2.org/nexus/content/repositories/releases/org/apache/maven/resolver/maven-resolver-util/1.4.1/maven-resolver-util-1.4.1.pom
[INFO] Downloading from wso2-nexus: http://maven.wso2.org/nexus/content/groups/wso2-public/org/apache/maven/resolver/maven-resolver-util/1.4.1/maven-resolver-util-1.4.1.pom
[INFO] Downloaded from wso2-nexus: http://maven.wso2.org/nexus/content/groups/wso2-public/org/apache/maven/resolver/maven-resolver-util/1.4.1/maven-resolver-util-1.4.1.pom (2.8 kB at 18 kB/s)
[INFO] Downloading from wso2.releases: http://maven.wso2.org/nexus/content/repositories/releases/org/apache/maven/resolver/maven-resolver-impl/1.4.1/maven-resolver-impl-1.4.1.pom
[INFO] Downloading from wso2-nexus: http://maven.wso2.org/nexus/content/groups/wso2-public/org/apache/maven/resolver/maven-resolver-impl/1.4.1/maven-resolver-impl-1.4.1.pom
[INFO] Downloaded from wso2-nexus: http://maven.wso2.org/nexus/content/groups/wso2-public/org/apache/maven/resolver/maven-resolver-impl/1.4.1/maven-resolver-impl-1.4.1.pom (4.1 kB at 31 kB/s)
[INFO] Downloading from wso2.releases: http://maven.wso2.org/nexus/content/repositories/releases/org/apache/maven/shared/maven-shared-utils/3.2.1/maven-shared-utils-3.2.1.pom
[INFO] Downloading from wso2-nexus: http://maven.wso2.org/nexus/content/groups/wso2-public/org/apache/maven/shared/maven-shared-utils/3.2.1/maven-shared-utils-3.2.1.pom
[INFO] Downloaded from wso2-nexus: http://maven.wso2.org/nexus/content/groups/wso2-public/org/apache/maven/shared/maven-shared-utils/3.2.1/maven-shared-utils-3.2.1.pom (5.6 kB at 52 kB/s)
[INFO] Downloading from wso2.releases: http://maven.wso2.org/nexus/content/repositories/releases/org/apache/maven/shared/maven-shared-components/30/maven-shared-components-30.pom
[INFO] Downloading from wso2-nexus: http://maven.wso2.org/nexus/content/groups/wso2-public/org/apache/maven/shared/maven-shared-components/30/maven-shared-components-30.pom
[INFO] Downloaded from wso2-nexus: http://maven.wso2.org/nexus/content/groups/wso2-public/org/apache/maven/shared/maven-shared-components/30/maven-shared-components-30.pom (4.6 kB at 1.1 MB/s)
[INFO] Downloading from wso2.releases: http://maven.wso2.org/nexus/content/repositories/releases/org/apache/maven/maven-parent/30/maven-parent-30.pom
[INFO] Downloading from wso2-nexus: http://maven.wso2.org/nexus/content/groups/wso2-public/org/apache/maven/maven-parent/30/maven-parent-30.pom
[INFO] Downloaded from wso2-nexus: http://maven.wso2.org/nexus/content/groups/wso2-public/org/apache/maven/maven-parent/30/maven-parent-30.pom (41 kB at 10 MB/s)
[INFO] Downloading from wso2.releases: http://maven.wso2.org/nexus/content/repositories/releases/org/apache/apache/18/apache-18.pom
[INFO] Downloading from wso2-nexus: http://maven.wso2.org/nexus/content/groups/wso2-public/org/apache/apache/18/apache-18.pom
[INFO] Downloaded from wso2-nexus: http://maven.wso2.org/nexus/content/groups/wso2-public/org/apache/apache/18/apache-18.pom (16 kB at 3.9 MB/s)
[INFO] Downloading from wso2.releases: http://maven.wso2.org/nexus/content/repositories/releases/commons-io/commons-io/2.5/commons-io-2.5.pom
[INFO] Downloading from wso2-nexus: http://maven.wso2.org/nexus/content/groups/wso2-public/commons-io/commons-io/2.5/commons-io-2.5.pom
[INFO] Downloaded from wso2-nexus: http://maven.wso2.org/nexus/content/groups/wso2-public/commons-io/commons-io/2.5/commons-io-2.5.pom (13 kB at 3.3 MB/s)
[INFO] Downloading from wso2.releases: http://maven.wso2.org/nexus/content/repositories/releases/org/apache/commons/commons-parent/39/commons-parent-39.pom
[INFO] Downloading from wso2-nexus: http://maven.wso2.org/nexus/content/groups/wso2-public/org/apache/commons/commons-parent/39/commons-parent-39.pom
[INFO] Downloaded from wso2-nexus: http://maven.wso2.org/nexus/content/groups/wso2-public/org/apache/commons/commons-parent/39/commons-parent-39.pom (62 kB at 15 MB/s)
[INFO] Downloading from wso2.releases: http://maven.wso2.org/nexus/content/repositories/releases/com/google/inject/guice/4.2.1/guice-4.2.1.pom
[INFO] Downloading from wso2-nexus: http://maven.wso2.org/nexus/content/groups/wso2-public/com/google/inject/guice/4.2.1/guice-4.2.1.pom
[INFO] Downloaded from wso2-nexus: http://maven.wso2.org/nexus/content/groups/wso2-public/com/google/inject/guice/4.2.1/guice-4.2.1.pom (11 kB at 156 kB/s)
[INFO] Downloading from wso2.releases: http://maven.wso2.org/nexus/content/repositories/releases/com/google/inject/guice-parent/4.2.1/guice-parent-4.2.1.pom
[INFO] Downloading from wso2-nexus: http://maven.wso2.org/nexus/content/groups/wso2-public/com/google/inject/guice-parent/4.2.1/guice-parent-4.2.1.pom
[INFO] Downloaded from wso2-nexus: http://maven.wso2.org/nexus/content/groups/wso2-public/com/google/inject/guice-parent/4.2.1/guice-parent-4.2.1.pom (16 kB at 139 kB/s)
[INFO] Downloading from wso2.releases: http://maven.wso2.org/nexus/content/repositories/releases/com/google/google/5/google-5.pom
[INFO] Downloading from wso2-nexus: http://maven.wso2.org/nexus/content/groups/wso2-public/com/google/google/5/google-5.pom
[INFO] Downloaded from wso2-nexus: http://maven.wso2.org/nexus/content/groups/wso2-public/com/google/google/5/google-5.pom (2.5 kB at 614 kB/s)
[INFO] Downloading from wso2.releases: http://maven.wso2.org/nexus/content/repositories/releases/aopalliance/aopalliance/1.0/aopalliance-1.0.pom
[INFO] Downloading from wso2-nexus: http://maven.wso2.org/nexus/content/groups/wso2-public/aopalliance/aopalliance/1.0/aopalliance-1.0.pom
[INFO] Downloaded from wso2-nexus: http://maven.wso2.org/nexus/content/groups/wso2-public/aopalliance/aopalliance/1.0/aopalliance-1.0.pom (363 B at 91 kB/s)
[INFO] Downloading from wso2.releases: http://maven.wso2.org/nexus/content/repositories/releases/org/codehaus/plexus/plexus-component-annotations/2.1.0/plexus-component-annotations-2.1.0.pom
[INFO] Downloading from wso2-nexus: http://maven.wso2.org/nexus/content/groups/wso2-public/org/codehaus/plexus/plexus-component-annotations/2.1.0/plexus-component-annotations-2.1.0.pom
[INFO] Downloaded from wso2-nexus: http://maven.wso2.org/nexus/content/groups/wso2-public/org/codehaus/plexus/plexus-component-annotations/2.1.0/plexus-component-annotations-2.1.0.pom (750 B at 3.5 kB/s)
[INFO] Downloading from wso2.releases: http://maven.wso2.org/nexus/content/repositories/releases/org/codehaus/plexus/plexus-containers/2.1.0/plexus-containers-2.1.0.pom
[INFO] Downloading from wso2-nexus: http://maven.wso2.org/nexus/content/groups/wso2-public/org/codehaus/plexus/plexus-containers/2.1.0/plexus-containers-2.1.0.pom
[INFO] Downloaded from wso2-nexus: http://maven.wso2.org/nexus/content/groups/wso2-public/org/codehaus/plexus/plexus-containers/2.1.0/plexus-containers-2.1.0.pom (4.8 kB at 34 kB/s)
[INFO] Downloading from wso2.releases: http://maven.wso2.org/nexus/content/repositories/releases/org/apache/commons/commons-io/1.3.2/commons-io-1.3.2.pom
[INFO] Downloading from wso2-nexus: http://maven.wso2.org/nexus/content/groups/wso2-public/org/apache/commons/commons-io/1.3.2/commons-io-1.3.2.pom
[INFO] Downloaded from wso2-nexus: http://maven.wso2.org/nexus/content/groups/wso2-public/org/apache/commons/commons-io/1.3.2/commons-io-1.3.2.pom (640 B at 160 kB/s)
[INFO] Downloading from wso2.releases: http://maven.wso2.org/nexus/content/repositories/releases/commons-io/commons-io/1.3.2/commons-io-1.3.2.pom
[INFO] Downloading from wso2-nexus: http://maven.wso2.org/nexus/content/groups/wso2-public/commons-io/commons-io/1.3.2/commons-io-1.3.2.pom
[INFO] Downloaded from wso2-nexus: http://maven.wso2.org/nexus/content/groups/wso2-public/commons-io/commons-io/1.3.2/commons-io-1.3.2.pom (9.7 kB at 2.4 MB/s)
[INFO] Downloading from wso2.releases: http://maven.wso2.org/nexus/content/repositories/releases/org/apache/commons/commons-parent/3/commons-parent-3.pom
[INFO] Downloading from wso2-nexus: http://maven.wso2.org/nexus/content/groups/wso2-public/org/apache/commons/commons-parent/3/commons-parent-3.pom
[INFO] Downloaded from wso2-nexus: http://maven.wso2.org/nexus/content/groups/wso2-public/org/apache/commons/commons-parent/3/commons-parent-3.pom (12 kB at 187 kB/s)
[INFO] Downloading from wso2.releases: http://maven.wso2.org/nexus/content/repositories/releases/org/apache/maven/maven-plugin-api/3.6.3/maven-plugin-api-3.6.3.jar
[INFO] Downloading from wso2.releases: http://maven.wso2.org/nexus/content/repositories/releases/org/apache/maven/maven-model/3.6.3/maven-model-3.6.3.jar
[INFO] Downloading from wso2.releases: http://maven.wso2.org/nexus/content/repositories/releases/org/apache/maven/maven-artifact/3.6.3/maven-artifact-3.6.3.jar
[INFO] Downloading from wso2.releases: http://maven.wso2.org/nexus/content/repositories/releases/org/eclipse/sisu/org.eclipse.sisu.plexus/0.3.4/org.eclipse.sisu.plexus-0.3.4.jar
[INFO] Downloading from wso2.releases: http://maven.wso2.org/nexus/content/repositories/releases/javax/enterprise/cdi-api/1.0/cdi-api-1.0.jar
[INFO] Downloading from wso2.releases: http://maven.wso2.org/nexus/content/repositories/releases/javax/annotation/jsr250-api/1.0/jsr250-api-1.0.jar
[INFO] Downloading from wso2.releases: http://maven.wso2.org/nexus/content/repositories/releases/org/codehaus/plexus/plexus-utils/3.2.1/plexus-utils-3.2.1.jar
[INFO] Downloading from wso2.releases: http://maven.wso2.org/nexus/content/repositories/releases/org/codehaus/plexus/plexus-classworlds/2.6.0/plexus-classworlds-2.6.0.jar
[INFO] Downloading from wso2.releases: http://maven.wso2.org/nexus/content/repositories/releases/org/apache/maven/plugin-tools/maven-plugin-annotations/3.6.0/maven-plugin-annotations-3.6.0.jar
[INFO] Downloading from wso2.releases: http://maven.wso2.org/nexus/content/repositories/releases/org/freemarker/freemarker-gae/2.3.29/freemarker-gae-2.3.29.jar
[INFO] Downloading from wso2.releases: http://maven.wso2.org/nexus/content/repositories/releases/org/apache/maven/maven-core/3.6.3/maven-core-3.6.3.jar
[INFO] Downloading from wso2.releases: http://maven.wso2.org/nexus/content/repositories/releases/org/apache/maven/maven-settings/3.6.3/maven-settings-3.6.3.jar
[INFO] Downloading from wso2.releases: http://maven.wso2.org/nexus/content/repositories/releases/org/apache/maven/maven-settings-builder/3.6.3/maven-settings-builder-3.6.3.jar
[INFO] Downloading from wso2.releases: http://maven.wso2.org/nexus/content/repositories/releases/org/codehaus/plexus/plexus-interpolation/1.25/plexus-interpolation-1.25.jar
[INFO] Downloading from wso2.releases: http://maven.wso2.org/nexus/content/repositories/releases/org/apache/maven/maven-builder-support/3.6.3/maven-builder-support-3.6.3.jar
[INFO] Downloading from wso2.releases: http://maven.wso2.org/nexus/content/repositories/releases/org/apache/maven/maven-repository-metadata/3.6.3/maven-repository-metadata-3.6.3.jar
[INFO] Downloading from wso2.releases: http://maven.wso2.org/nexus/content/repositories/releases/org/apache/maven/maven-model-builder/3.6.3/maven-model-builder-3.6.3.jar
[INFO] Downloading from wso2.releases: http://maven.wso2.org/nexus/content/repositories/releases/org/apache/maven/maven-resolver-provider/3.6.3/maven-resolver-provider-3.6.3.jar
[INFO] Downloading from wso2.releases: http://maven.wso2.org/nexus/content/repositories/releases/org/apache/maven/resolver/maven-resolver-impl/1.4.1/maven-resolver-impl-1.4.1.jar
[INFO] Downloading from wso2.releases: http://maven.wso2.org/nexus/content/repositories/releases/org/apache/maven/resolver/maven-resolver-api/1.4.1/maven-resolver-api-1.4.1.jar
[INFO] Downloading from wso2.releases: http://maven.wso2.org/nexus/content/repositories/releases/org/apache/maven/resolver/maven-resolver-spi/1.4.1/maven-resolver-spi-1.4.1.jar
[INFO] Downloading from wso2.releases: http://maven.wso2.org/nexus/content/repositories/releases/org/apache/maven/resolver/maven-resolver-util/1.4.1/maven-resolver-util-1.4.1.jar
[INFO] Downloading from wso2.releases: http://maven.wso2.org/nexus/content/repositories/releases/org/apache/maven/shared/maven-shared-utils/3.2.1/maven-shared-utils-3.2.1.jar
[INFO] Downloading from wso2.releases: http://maven.wso2.org/nexus/content/repositories/releases/org/eclipse/sisu/org.eclipse.sisu.inject/0.3.4/org.eclipse.sisu.inject-0.3.4.jar
[INFO] Downloading from wso2.releases: http://maven.wso2.org/nexus/content/repositories/releases/com/google/inject/guice/4.2.1/guice-4.2.1-no_aop.jar
[INFO] Downloading from wso2.releases: http://maven.wso2.org/nexus/content/repositories/releases/aopalliance/aopalliance/1.0/aopalliance-1.0.jar
[INFO] Downloading from wso2.releases: http://maven.wso2.org/nexus/content/repositories/releases/javax/inject/javax.inject/1/javax.inject-1.jar
[INFO] Downloading from wso2.releases: http://maven.wso2.org/nexus/content/repositories/releases/org/codehaus/plexus/plexus-component-annotations/2.1.0/plexus-component-annotations-2.1.0.jar
[INFO] Downloading from wso2.releases: http://maven.wso2.org/nexus/content/repositories/releases/org/apache/commons/commons-lang3/3.9/commons-lang3-3.9.jar
[INFO] Downloading from wso2.releases: http://maven.wso2.org/nexus/content/repositories/releases/commons-io/commons-io/1.3.2/commons-io-1.3.2.jar
[INFO] Downloading from wso2-nexus: http://maven.wso2.org/nexus/content/groups/wso2-public/org/apache/maven/maven-plugin-api/3.6.3/maven-plugin-api-3.6.3.jar
[INFO] Downloading from wso2-nexus: http://maven.wso2.org/nexus/content/groups/wso2-public/org/apache/maven/maven-model/3.6.3/maven-model-3.6.3.jar
[INFO] Downloading from wso2-nexus: http://maven.wso2.org/nexus/content/groups/wso2-public/org/apache/maven/maven-artifact/3.6.3/maven-artifact-3.6.3.jar
[INFO] Downloading from wso2-nexus: http://maven.wso2.org/nexus/content/groups/wso2-public/org/eclipse/sisu/org.eclipse.sisu.plexus/0.3.4/org.eclipse.sisu.plexus-0.3.4.jar
[INFO] Downloading from wso2-nexus: http://maven.wso2.org/nexus/content/groups/wso2-public/javax/enterprise/cdi-api/1.0/cdi-api-1.0.jar
[INFO] Downloaded from wso2-nexus: http://maven.wso2.org/nexus/content/groups/wso2-public/javax/enterprise/cdi-api/1.0/cdi-api-1.0.jar (45 kB at 9.0 MB/s)
[INFO] Downloading from wso2-nexus: http://maven.wso2.org/nexus/content/groups/wso2-public/javax/annotation/jsr250-api/1.0/jsr250-api-1.0.jar
[INFO] Downloaded from wso2-nexus: http://maven.wso2.org/nexus/content/groups/wso2-public/javax/annotation/jsr250-api/1.0/jsr250-api-1.0.jar (5.8 kB at 731 kB/s)
[INFO] Downloading from wso2-nexus: http://maven.wso2.org/nexus/content/groups/wso2-public/org/codehaus/plexus/plexus-utils/3.2.1/plexus-utils-3.2.1.jar
[INFO] Downloaded from wso2-nexus: http://maven.wso2.org/nexus/content/groups/wso2-public/org/eclipse/sisu/org.eclipse.sisu.plexus/0.3.4/org.eclipse.sisu.plexus-0.3.4.jar (205 kB at 3.3 MB/s)
[INFO] Downloading from wso2-nexus: http://maven.wso2.org/nexus/content/groups/wso2-public/org/codehaus/plexus/plexus-classworlds/2.6.0/plexus-classworlds-2.6.0.jar
[INFO] Downloaded from wso2-nexus: http://maven.wso2.org/nexus/content/groups/wso2-public/org/apache/maven/maven-model/3.6.3/maven-model-3.6.3.jar (215 kB at 3.2 MB/s)
[INFO] Downloading from wso2-nexus: http://maven.wso2.org/nexus/content/groups/wso2-public/org/apache/maven/plugin-tools/maven-plugin-annotations/3.6.0/maven-plugin-annotations-3.6.0.jar
[INFO] Downloaded from wso2-nexus: http://maven.wso2.org/nexus/content/groups/wso2-public/org/apache/maven/maven-artifact/3.6.3/maven-artifact-3.6.3.jar (58 kB at 556 kB/s)
[INFO] Downloading from wso2-nexus: http://maven.wso2.org/nexus/content/groups/wso2-public/org/freemarker/freemarker-gae/2.3.29/freemarker-gae-2.3.29.jar
[INFO] Downloaded from wso2-nexus: http://maven.wso2.org/nexus/content/groups/wso2-public/org/apache/maven/maven-plugin-api/3.6.3/maven-plugin-api-3.6.3.jar (47 kB at 382 kB/s)
[INFO] Downloading from wso2-nexus: http://maven.wso2.org/nexus/content/groups/wso2-public/org/apache/maven/maven-core/3.6.3/maven-core-3.6.3.jar
[INFO] Downloaded from wso2-nexus: http://maven.wso2.org/nexus/content/groups/wso2-public/org/codehaus/plexus/plexus-utils/3.2.1/plexus-utils-3.2.1.jar (262 kB at 2.1 MB/s)
[INFO] Downloading from wso2-nexus: http://maven.wso2.org/nexus/content/groups/wso2-public/org/apache/maven/maven-settings/3.6.3/maven-settings-3.6.3.jar
[INFO] Downloaded from wso2-nexus: http://maven.wso2.org/nexus/content/groups/wso2-public/org/apache/maven/plugin-tools/maven-plugin-annotations/3.6.0/maven-plugin-annotations-3.6.0.jar (14 kB at 88 kB/s)
[INFO] Downloading from wso2-nexus: http://maven.wso2.org/nexus/content/groups/wso2-public/org/apache/maven/maven-settings-builder/3.6.3/maven-settings-builder-3.6.3.jar
[INFO] Downloaded from wso2-nexus: http://maven.wso2.org/nexus/content/groups/wso2-public/org/codehaus/plexus/plexus-classworlds/2.6.0/plexus-classworlds-2.6.0.jar (53 kB at 273 kB/s)
[INFO] Downloading from wso2-nexus: http://maven.wso2.org/nexus/content/groups/wso2-public/org/codehaus/plexus/plexus-interpolation/1.25/plexus-interpolation-1.25.jar
[INFO] Downloaded from wso2-nexus: http://maven.wso2.org/nexus/content/groups/wso2-public/org/codehaus/plexus/plexus-interpolation/1.25/plexus-interpolation-1.25.jar (85 kB at 431 kB/s)
[INFO] Downloading from wso2-nexus: http://maven.wso2.org/nexus/content/groups/wso2-public/org/apache/maven/maven-builder-support/3.6.3/maven-builder-support-3.6.3.jar
[INFO] Downloaded from wso2-nexus: http://maven.wso2.org/nexus/content/groups/wso2-public/org/apache/maven/maven-settings/3.6.3/maven-settings-3.6.3.jar (44 kB at 206 kB/s)
[INFO] Downloading from wso2-nexus: http://maven.wso2.org/nexus/content/groups/wso2-public/org/apache/maven/maven-repository-metadata/3.6.3/maven-repository-metadata-3.6.3.jar
[INFO] Downloaded from wso2-nexus: http://maven.wso2.org/nexus/content/groups/wso2-public/org/apache/maven/maven-settings-builder/3.6.3/maven-settings-builder-3.6.3.jar (42 kB at 175 kB/s)
[INFO] Downloading from wso2-nexus: http://maven.wso2.org/nexus/content/groups/wso2-public/org/apache/maven/maven-model-builder/3.6.3/maven-model-builder-3.6.3.jar
[INFO] Downloaded from wso2-nexus: http://maven.wso2.org/nexus/content/groups/wso2-public/org/apache/maven/maven-builder-support/3.6.3/maven-builder-support-3.6.3.jar (14 kB at 52 kB/s)
[INFO] Downloading from wso2-nexus: http://maven.wso2.org/nexus/content/groups/wso2-public/org/apache/maven/maven-resolver-provider/3.6.3/maven-resolver-provider-3.6.3.jar
[INFO] Downloaded from wso2-nexus: http://maven.wso2.org/nexus/content/groups/wso2-public/org/apache/maven/maven-core/3.6.3/maven-core-3.6.3.jar (633 kB at 2.2 MB/s)
[INFO] Downloading from wso2-nexus: http://maven.wso2.org/nexus/content/groups/wso2-public/org/apache/maven/resolver/maven-resolver-impl/1.4.1/maven-resolver-impl-1.4.1.jar
[INFO] Downloaded from wso2-nexus: http://maven.wso2.org/nexus/content/groups/wso2-public/org/apache/maven/maven-model-builder/3.6.3/maven-model-builder-3.6.3.jar (192 kB at 517 kB/s)
[INFO] Downloading from wso2-nexus: http://maven.wso2.org/nexus/content/groups/wso2-public/org/apache/maven/resolver/maven-resolver-api/1.4.1/maven-resolver-api-1.4.1.jar
[INFO] Downloaded from wso2-nexus: http://maven.wso2.org/nexus/content/groups/wso2-public/org/apache/maven/maven-resolver-provider/3.6.3/maven-resolver-provider-3.6.3.jar (66 kB at 173 kB/s)
[INFO] Downloading from wso2-nexus: http://maven.wso2.org/nexus/content/groups/wso2-public/org/apache/maven/resolver/maven-resolver-spi/1.4.1/maven-resolver-spi-1.4.1.jar
[INFO] Downloaded from wso2-nexus: http://maven.wso2.org/nexus/content/groups/wso2-public/org/apache/maven/maven-repository-metadata/3.6.3/maven-repository-metadata-3.6.3.jar (27 kB at 71 kB/s)
[INFO] Downloading from wso2-nexus: http://maven.wso2.org/nexus/content/groups/wso2-public/org/apache/maven/resolver/maven-resolver-util/1.4.1/maven-resolver-util-1.4.1.jar
[INFO] Downloaded from wso2-nexus: http://maven.wso2.org/nexus/content/groups/wso2-public/org/freemarker/freemarker-gae/2.3.29/freemarker-gae-2.3.29.jar (1.6 MB at 3.8 MB/s)
[INFO] Downloading from wso2-nexus: http://maven.wso2.org/nexus/content/groups/wso2-public/org/apache/maven/shared/maven-shared-utils/3.2.1/maven-shared-utils-3.2.1.jar
[INFO] Downloaded from wso2-nexus: http://maven.wso2.org/nexus/content/groups/wso2-public/org/apache/maven/shared/maven-shared-utils/3.2.1/maven-shared-utils-3.2.1.jar (167 kB at 398 kB/s)
[INFO] Downloading from wso2-nexus: http://maven.wso2.org/nexus/content/groups/wso2-public/org/eclipse/sisu/org.eclipse.sisu.inject/0.3.4/org.eclipse.sisu.inject-0.3.4.jar
[INFO] Downloaded from wso2-nexus: http://maven.wso2.org/nexus/content/groups/wso2-public/org/apache/maven/resolver/maven-resolver-impl/1.4.1/maven-resolver-impl-1.4.1.jar (181 kB at 413 kB/s)
[INFO] Downloading from wso2-nexus: http://maven.wso2.org/nexus/content/groups/wso2-public/com/google/inject/guice/4.2.1/guice-4.2.1-no_aop.jar
[INFO] Downloaded from wso2-nexus: http://maven.wso2.org/nexus/content/groups/wso2-public/org/apache/maven/resolver/maven-resolver-api/1.4.1/maven-resolver-api-1.4.1.jar (149 kB at 324 kB/s)
[INFO] Downloading from wso2-nexus: http://maven.wso2.org/nexus/content/groups/wso2-public/aopalliance/aopalliance/1.0/aopalliance-1.0.jar
[INFO] Downloaded from wso2-nexus: http://maven.wso2.org/nexus/content/groups/wso2-public/aopalliance/aopalliance/1.0/aopalliance-1.0.jar (4.5 kB at 9.6 kB/s)
[INFO] Downloading from wso2-nexus: http://maven.wso2.org/nexus/content/groups/wso2-public/javax/inject/javax.inject/1/javax.inject-1.jar
[INFO] Downloaded from wso2-nexus: http://maven.wso2.org/nexus/content/groups/wso2-public/javax/inject/javax.inject/1/javax.inject-1.jar (2.5 kB at 5.3 kB/s)
[INFO] Downloading from wso2-nexus: http://maven.wso2.org/nexus/content/groups/wso2-public/org/codehaus/plexus/plexus-component-annotations/2.1.0/plexus-component-annotations-2.1.0.jar
[INFO] Downloaded from wso2-nexus: http://maven.wso2.org/nexus/content/groups/wso2-public/org/apache/maven/resolver/maven-resolver-util/1.4.1/maven-resolver-util-1.4.1.jar (168 kB at 345 kB/s)
[INFO] Downloading from wso2-nexus: http://maven.wso2.org/nexus/content/groups/wso2-public/org/apache/commons/commons-lang3/3.9/commons-lang3-3.9.jar
[INFO] Downloaded from wso2-nexus: http://maven.wso2.org/nexus/content/groups/wso2-public/org/apache/maven/resolver/maven-resolver-spi/1.4.1/maven-resolver-spi-1.4.1.jar (37 kB at 75 kB/s)
[INFO] Downloading from wso2-nexus: http://maven.wso2.org/nexus/content/groups/wso2-public/commons-io/commons-io/1.3.2/commons-io-1.3.2.jar
[INFO] Downloaded from wso2-nexus: http://maven.wso2.org/nexus/content/groups/wso2-public/org/apache/commons/commons-lang3/3.9/commons-lang3-3.9.jar (504 kB at 1.0 MB/s)
[INFO] Downloaded from wso2-nexus: http://maven.wso2.org/nexus/content/groups/wso2-public/org/codehaus/plexus/plexus-component-annotations/2.1.0/plexus-component-annotations-2.1.0.jar (4.2 kB at 7.8 kB/s)
[INFO] Downloaded from wso2-nexus: http://maven.wso2.org/nexus/content/groups/wso2-public/commons-io/commons-io/1.3.2/commons-io-1.3.2.jar (88 kB at 160 kB/s)
[INFO] Downloaded from wso2-nexus: http://maven.wso2.org/nexus/content/groups/wso2-public/org/eclipse/sisu/org.eclipse.sisu.inject/0.3.4/org.eclipse.sisu.inject-0.3.4.jar (379 kB at 643 kB/s)
[INFO] Downloaded from wso2-nexus: http://maven.wso2.org/nexus/content/groups/wso2-public/com/google/inject/guice/4.2.1/guice-4.2.1-no_aop.jar (521 kB at 868 kB/s)
[JENKINS] Archiving disabled