Started 3 yr 3 mo ago
Took 3 hr 46 min on ECS_PRODUCTION-22e9a3d3647b2

Unstable Build #79 (Sep 25, 2018 12:40:07 PM)

No changes.

Started by user Maheshika Goonetilleke

Revision: 4782c5cace12f2cc2b5a33c139c3716847c04dba
  • refs/remotes/origin/master
Test Result (12 failures / +12)Show all failed tests >>>

TestLink build ID: 5,691

TestLink build name: ESB- 25/09/2018 - 79

Total of 833 tests. Where 594 passed, 2 (+2) failed, 0 were blocked and 237 (+6) were not executed.

List of test cases and execution result status

Test case IDTest case external IDVersionNameTest project IDExecution status
60932ESB-39561Verify the clone and aggregate functionality with SOAPAction defined2453Passed
64097ESB-44591Modifying and deploying a proxy when the pinnedServer is having another instance name2453Not Run
3216ESB-3581Invoke a web service with ServiceURL, Source(xpath) ,Target  (xpath)and Action2453Passed
58427ESB-38741Send special characters with XML payload and convert the response to JSON2453Not Run
63342ESB-42701Defined sequence template media type in registry2453Not Run
44478ESB-20231Modifying HTTP headers of  messages with new value2453Passed
63131ESB-42271JSON request with API for GET method2453Not Run
62069ESB-41241Fault mediator with responce = false parameter and Addressing(soap 1.2)2453Passed
63391ESB-42811Nested Sequence statistics message count2453Passed
62683ESB-41781XQuery transformation with targer as XPath value and variable type as Long2453Passed
63773ESB-43771Invoke a default endpoint saved in config registry via web services2453Passed
63302ESB-42621Proxy service media type in registry2453Not Run
63307ESB-42631Scheduled Task media type in registry2453Not Run
61386ESB-39951Matching iterate and aggregate IDs and verify that the aggregation2453Passed
60296ESB-39371Make sure Call Mediator works as expected2453Passed
59665ESB-38901Aggregate JSON messages when the max limit set to less then one2453Passed
63705ESB-43591Delete and deploy a car file2453Passed
61538ESB-40251Verify that fastXslt mediator can be with xslt tranformation logis define as Local entries2453Passed
64166ESB-44721User saves secure Proxy with HTTP transport2453Not Run
59873ESB-38981Verify that Iterate and aggregate mediators working with property mediator on Iterate2453Passed
63243ESB-42501Message store media type in registry2453Not Run
10334ESB-11021Invoke an Address Endpoint2453Passed
63860ESB-43991Hot undeployment when a configuration is edited and deleted from directory structure2453Not Run
61441ESB-40041Verify Payload factory mediator behaviour when invoked with a xml message without defining media typ2453Not Run
61201ESB-39681Verify the DBlookup mediator functionality with select raws from a db tables2453Not Run
63887ESB-44051Add HTTP Endpoint with DELETE method via web services2453Passed
46484ESB-22951Completion Timeout with positive value2453Not Run
61244ESB-39711Check whether db table can be updated with a value get from the responce gettting from a backend2453Not Run
61263ESB-39731Trying to send message to backend after droping message using Drop mediator2453Passed
62129ESB-41351Filter Mediator execution with regex filtering and source2453Passed
63801ESB-43861Verify dynamic endpoint timeout value through endpoint template 2453Passed
3829ESB-5261Conditional router mediator where continueAfter=true2453Passed
61400ESB-39981Verify Payload factory mediator behaviour when created without arguements2453Not Run
31817ESB-13121Add In-lined XML Entry2453Passed
31824ESB-13131Add Source URL Entry2453Passed
62769ESB-41851Evaluates foreach mediator properties when nested foreach constructs involve with id specified2453Passed
65307ESB-45481Sending a Message to a loadbalancing endpoint2453Passed
65312ESB-45491Sending a Message to a loadbalancing endpoint in a config registry2453Not Run
4508ESB-7351Sample 60 : Routing a Message to a Static List of Recipients2453Not Run
4504ESB-7331Sample 58 : Static Load Balancing between Three Nodes2453Passed
4506ESB-7341 Weighted load balancing between 3 endpointsverification2453Passed
4520ESB-7411Sample 152 verification2453Passed
4518ESB-7401Sample 151 verification2453Passed
4510ESB-7361Sample 61 verification2453Passed
4512ESB-7371Sample 62 : Routing a Message to a Dynamic List of Recipients and Aggregating Responses2453Passed
4516ESB-7391Sample 150 verification2453Passed
4522ESB-7421Sample 153 verification2453Not Run
4528ESB-7451Sample 155 verification2453Passed
4542ESB-7511Sample 250 verification : Introduction to Switching Transports2453Passed
4534ESB-7471Sample 157 verification2453Passed
4536ESB-7481Sample 200 verification2453Not Run
4538ESB-7491Sample 251 verification : Switching from HTTP(S) to JMS2453Passed
4546ESB-7531Sample 253 verification : Bridging from JMS to HTTP and Replying with a 202 Accepted Response2453Passed
4590ESB-7751Sample 350 : Introduction to the Script Mediator Using JavaScript2453Passed
63360ESB-42741API statistics message count for POST requests2453Not Run
4594ESB-7771Sample 352 : Accessing Synapse message context API using a scripting language2453Passed
4596ESB-7781Sample 353 verification : Using Ruby Scripts for Mediation2453Not Run
45333ESB-21551Modifying SOAP headers of messages with new value2453Passed
4588ESB-7741Sample 300 verification : Introduction to Tasks with a Simple Trigger2453Not Run
4598ESB-7791Sample 354 verification : Using Inline Ruby Scripts for Mediation2453Passed
62055ESB-41221Fault mediator with responce = true parameter(soap 1.2)2453Passed
5002ESB-9651Sample 364 : Using Mediators to Execute Database Stored Procedures2453Not Run
5004ESB-9661Sample 372 : Use of Both Concurrency Throttling and Request-Rate-Based Throttling2453Passed
62680ESB-41771XQuery transformation with targer as XPath value and variable type as String2453Passed
63322ESB-42661Defined Sequence media type in registry2453Not Run
61144ESB-39621Verify the DBlookup mediator behaviour when db call returns multiple results2453Not Run
61393ESB-39971Payload factory mediator with an argument value2453Not Run
45002ESB-20941Send message back as a response using switch case mediators2453Passed
63332ESB-42681Defined endpoint template media type in registry2453Not Run
63337ESB-42691Dynamic sequence template media type in registry2453Passed
59659ESB-38891Aggregate JSON messages when the max limit set to greater then one2453Passed
60897ESB-39551Verify the clone and aggregate functionality with large messages2453Passed
61506ESB-40201Verify that fastXslt mediator can be used inside a call template2453Passed
3711ESB-4841Iterate message processing in the presence of multiple iterate targets2453Not Run
3956ESB-5551Conditional router mediator where continueAfter=false2453Passed
4607ESB-7831Sample 362 : DBReport and DBLookup Mediators Together2453Passed
4600ESB-7801Sample 360 : Introduction to DBLookup Mediator2453Passed
4605ESB-7821Sample 361 : Introduction to DBReport Mediator2453Passed
4618ESB-7881Sample 370 : Introduction to Throttle Mediator and Concurrency Throttling2453Passed
4611ESB-7851Sample 363 : Reusable Database Connection Pools2453Not Run
4620ESB-7891Sample 371 : Restricting Requests Based on Policies2453Passed
4622ESB-7901Sample 380 verification2453Passed
4624ESB-7911Sample 381 verification : Class Mediator to CBR Binary Messages2453Passed
4626ESB-7921Sample 390 verification2453Not Run
4631ESB-7941Sample 391 verification2453Not Run
4633ESB-7951Sample 400 verification : Message Splitting and Aggregating the Responses2453Passed
4642ESB-7991Sample 440 : Converting JSON to XML Using XSLT2453Not Run
4644ESB-8001Sample 441 : Converting JSON to XML Using JavaScript2453Not Run
4648ESB-8021Sample 451 verification : Conditional URL Rewriting2453Passed
4660ESB-8081Sample 600 verification : Simple Message Transformation - Rule Mediator for Message Transformation2453Not Run
2482ESB-92Send mediator with an address endpoint2453Passed
4654ESB-8051Sample 470 verification2453Not Run
4656ESB-8061Sample 430 verification : Callout Mediator for Synchronous Service Invocation2453Passed
4658ESB-8071Sample 500 verification : Call Mediator for Non-Blocking Service Invocation2453Passed
4672ESB-8141Sample 654 verification : Smooks Mediator2453Not Run
4674ESB-8151Sample 655 verification : Message Relay - Basics Sample2453Passed
59869ESB-38971Verify that nested quote requests(large no of nested requests) can be successfully aggregated2453Passed
4664ESB-8101Sample 650 verification : File Hierarchy-Based Configuration Builder2453Passed
4666ESB-8111Sample 651 verification2453Not Run
4668ESB-8121Sample 652 : Priority Based Message Mediation2453Passed
4680ESB-8181Sample 700 verification : Introduction to Message Store2453Passed
4682ESB-8191Sample 701 verification : Introduction to Message Sampling Processor2453Passed
4684ESB-8201Sample 702 verification : Introduction to Message Forwarding Processor2453Passed
4676ESB-8161Sample 656 verification : Message Relay - Builder Mediator2453Passed
4678ESB-8171Sample 657 verification : Distributed Transaction Management2453Not Run
4692ESB-8241Sample 705 verification : Load Balancing with Message Forwarding Processor2453Passed
63462ESB-43001Upload a CAR with a proxy that has startOnLoad=true2453Passed
4453ESB-7091Sample 5 verification : Creating SOAP Fault Messages and Changing the Direction of a Message2453Passed
4445ESB-7051Sample 2  verification : CBR with the Switch-Case Mediator Using Message Properties2453Passed
4461ESB-7131Sample 9 verification : Introduction to Dynamic Sequences with the Registry2453Not Run
4463ESB-7141Sample 10 verification : Introduction to Dynamic Endpoints with the Registry2453Not Run
4465ESB-7151Sample 11 verification : Using a Full Registry-Based Configuration and Sharing a Configuration Between Multiple Instances2453Passed
4455ESB-7101Sample 6 verification : Manipulating SOAP Headers and Filtering Incoming and Outgoing Messages2453Passed
4698ESB-8271Sample 752 - Manage endpoints2453Passed
4459ESB-7121Sample 8 verification : Introduction to Static and Dynamic Registry Resources and Using XSLT Transformations2453Passed
4476ESB-7201Sample 15 verification : Message Enrichment through Synapse2453Passed
4469ESB-7171Sample 13 verification : One Way Messaging fireAndForget through ESB2453Not Run
4480ESB-7221Sample 17 verification : Transforming / Replacing Message Content with PayloadFactory Mediator2453Passed
4486ESB-7251Sample 50 verification - POX to Soap conversion2453Not Run
4478ESB-7211Sample 16 verification : Introduction to Dynamic and Static Registry Keys2453Passed
4492ESB-7281Sample 53 verification : Using Failover Endpoints to Handle Peak Loads2453Passed
4494ESB-7291Sample 54 : Session Affinity Load Balancing between Three Endpoints2453Passed
4496ESB-7301Sample 55 verification :  Session Affinity Load Balancing between Failover Endpoints2453Not Run
4490ESB-7271Sample 52 verification - Using Load Balancing Endpoints to Handle Peak Loads2453Passed
4499ESB-7311Sample 56 : Using a WSDL Endpoint as the Target Endpoint2453Passed
63883ESB-44041Add HTTP Endpoint with PUT method via web services2453Passed
61229ESB-39701Use &lt and &gt characters inside a sql statement of DBReport mediator2453Not Run
60166ESB-39261Using call mediator inside a fault sequence2453Passed
41883ESB-18091Editing JMS Message Store from UI2453Passed
62758ESB-41841Verify that nested foreach mediator behaviour with iterated and aggregate2453Passed
4700ESB-8281Sample 800 - Invoke a rest api2453Passed
61437ESB-40031Verify Payload factory mediator behaviour when invoked with a json message and application/json medi2453Not Run
4514ESB-7381Sample 100 verification : Using WS-Security for Outgoing Messages2453Not Run
4524ESB-7431Sample 154 verification2453Passed
4540ESB-7501Sample 252 verification : Pure Text (Binary) and POX Message Support with JMS2453Passed
44855ESB-20741Filter Mediator execution with xpath filtering2453Passed
61161ESB-39631Verify the ESB behaviour when multiple statemets define inside a dblookup mediator2453Not Run
60081ESB-39101Sending transport headers with a blocking Call Mediator, Invoke with soap 12 request2453Passed
45588ESB-21891Invoke a pre-defined sequence using a dynamic key2453Passed
63356ESB-42731API statistics message count for get requests2453Not Run
4592ESB-7761Sample 351 verification : Inline script mediation with JavaScript2453Passed
62049ESB-41211Fault mediator with responce = false parameter(soap 12)2453Passed
62673ESB-41761XQuery transformation with targer as XPath value and variable type as int2453Passed
61356ESB-39911[Without JSON stream]Use PayloadFactory for JSON to JSON tranformation with XML arguements2453Not Run
63317ESB-42651Dynamic Sequence media type in registry2453Passed
63327ESB-42671Dynamic endpoint template media type in registry2453Passed
38967ESB-16221User saves secure proxy with endpoint defined through URL2453Not Run
59643ESB-38881Aggregate JSON messages when the max limit set to 12453Passed
60891ESB-39541Verify the clone and aggregate functionality with registry saved sequences2453Passed
61525ESB-40241Verify fastxslt mediator behaviour when xslt logic define on gov and config registry2453Passed
3960ESB-5561Functionality of several Conditional router mediators together2453Not Run
4637ESB-7971Sample 420 : Simple Cache Implemented on ESB for the Actual Service2453Not Run
59865ESB-38961Verify that nested quote requests can be successfully aggregated2453Passed
2486ESB-162Send mediator with a governance registry picked endpoint2453Passed
61714ESB-40661Add detail entry and check whether added detail (detail in text) is included in the generated fault2453Passed
4690ESB-8231Sample 704 verification : RESTful Invocations with Message Forwarding Processor2453Passed
4449ESB-7071Sample 3 verification : Local Registry Entry Definitions, Reusable Endpoints and Sequences2453Not Run
4457ESB-7111Sample 7 verification : Using Schema Validation and the Usage of Local Registry for Storing Configuration Metadata2453Passed
4471ESB-7181Sample 14 verification : Dual Channel Invocation through Synapse2453Passed
4467ESB-7161Sample 12 verification : One-Way Messaging in a Fire-and-Forget Mode through ESB2453Passed
63879ESB-44031Add HTTP Endpoint with GET method via web services2453Not Run
66915ESB-46481Verifying json format of swagger definition for an API2453Passed
46494ESB-22981onComplete with a sequence from governance registry2453Passed
63420ESB-42881Nesting sequence templates with clone mediator2453Passed
62342ESB-41691Verify that foreach mediator executes sequentially2453Passed
20933ESB-12541Creating an API with HEAD method from the source view2453Passed
61433ESB-40021Verify Payload factory mediator behaviour when invoked with a xml message and application/xml media type2453Not Run
4572ESB-7661Sample 264 verification : Sending Two-Way Messages Using JMS transport2453Not Run
60076ESB-39091Sending transport headers with a blocking Call Mediator, Invoke with soap 11 request2453Passed
61170ESB-39641Verify the DBlookup mediator behaviour when use function as a sql entry2453Not Run
62021ESB-41161Validate soap fault message when generated inside out sequence with makefault mediator(SOAP 1.2)2453Passed
63375ESB-42781Proxy statistics message count2453Passed
62287ESB-41621Evaluate property mediator usage inside a nested foreach constructs2453Passed
61320ESB-39831[With JSON stream]Use PayloadFactory for XML to JSON tranformation with both xml and json argument expressions2453Not Run
62670ESB-41751XQuery transformation with targer as XPath value and variable type as float2453Passed
44176ESB-19721Set a BOOLEAN property within axis2 scope2453Not Run
60879ESB-39531Verify the clone and aggregate functionality with Named endpoints2453Passed
3964ESB-5571Conditional router mediator where breakRoute=true2453Passed
44972ESB-20901Access SYSTEM_DATE(Synapse Message Context Property) by parsing a date format2453Passed
59860ESB-38951Verify that large Content can be aggregated(defined without timeout) using iterate and aggregate med2453Passed
2491ESB-152Send mediator with a configuration registry picked endpoint2453Passed
4451ESB-7081Sample 4 verification : Specifying a Fault Sequence with a Regular Mediation Sequence2453Passed
45644ESB-21981[Negative]Invocation of non existing dynamic sequence2453Passed
63873ESB-44021Add HTTP Endpoint with POST method via web services2453Passed
66927ESB-46511Verifying  YAML format of swagger definition for an API  .2453Passed
46496ESB-22991onComplete with a sequence from config registry2453Passed
7378ESB-10141Define Reason as expression for SOAP 1.22453Passed
39028ESB-16251User saves secure proxy with endpoint saved in conf.registry2453Not Run
59751ESB-38911Verify that Content can be aggregated using iterate and aggregate mediators2453Passed
62017ESB-41151Define node value for SOAP 1.22453Passed
62263ESB-41581Evaluate property mediator usage inside a multiple foreach constructs2453Passed
63379ESB-42791Proxy statistics message count for split aggregate mechanism2453Passed
61194ESB-39671Verify the DBlookup mediator behaviour when use stored procedure as a sql entry2453Not Run
46632ESB-23151Aggregate a number of messages > the min value of property2453Passed
62665ESB-41731XQuery transformation with targer as XPath value and variable type as double2453Passed
60018ESB-39061Using blocking Call Mediator inside cyclic sequence chain2453Passed
60871ESB-39521Verify the clone and aggregate functionality with inline https endpoints2453Passed
31506ESB-13081Invoke a service with HTTP_SC2453Passed
3717ESB-4871Load handling while iterating using small messages ( few KB)  in small numbers ( 20)2453Passed
3970ESB-5591Conditional router mediator where breakRoute=false2453Not Run
61317ESB-39821[With JSON stream]Use PayloadFactory for JSON to JSON tranformation with both xml and json argument expressions2453Not Run
59808ESB-38921Verify that after the timeout aggregate mediator does not accept the messages-With Iterator mediator2453Passed
44964ESB-20871Access SYSTEM_TIME(Synapse Message Context Property) from in sequence2453Passed
62978ESB-42031JSON path with filter mediator when the condition is TRUE2453Not Run
4981ESB-9591Switch mediator when the 'Default case' is specified2453Passed
44873ESB-20781Filter Mediator execution with regex filtering using source get-Property2453Passed
63387ESB-42801Sequence statistics message count2453Passed
62662ESB-41721XQuery transformation with targer as XPath value and variable type as byte2453Passed
62227ESB-41531Evaluates foreach mediator properties when multiple foreach constructs involve with id specified2453Passed
61987ESB-41141Validate soap fault message when generated with makefault mediator(SOAP Version is 1.2)2453Not Run
3719ESB-4881Load handling while iterating using small messages ( few KB)  in large numbers ( 1000)2453Not Run
61304ESB-39791Payload factory mediator with a expression as an argument type2453Not Run
59810ESB-38931Verify that after the timeout aggregate mediator does not accept the messages-With clone mediator2453Passed
59600ESB-38851Aggregate a number of messages equal(=) to the min value of property2453Passed
60866ESB-39511Verify the clone and aggregate functionality with inline http endpoints2453Passed
63237ESB-42491Message processor media type in registry2453Not Run
7337ESB-10121Add a fault mediator with fault code = Receiver (for SOAP 1.2)2453Passed
63672ESB-43501Registry caching with cachableDuration set to 02453Passed
63823ESB-43911Address endpoint invocation when the format is set to REST2453Passed
62983ESB-42041JSON path with filter mediator when the condition is FALSE2453Not Run
3226ESB-3621Callout mediator with a valid Axis2 XML path2453Passed
46630ESB-23141[Negative] Aggregate a number of messages < the min value of property2453Passed
62656ESB-41701XQuery transformation with target as Xpath2453Passed
63540ESB-43151Message processor with fault sequence for https endpoint2453Passed
62217ESB-41521Evaluates foreach mediator properties when multiple foreach constructs involve without id specified2453Passed
44158ESB-19701Call Mediator with blocking property set to true2453Passed
61982ESB-41131SOAP Version is 1.22453Passed
3721ESB-4891Load handling while iterating using large messages ( few MB)  in small numbers ( 20)2453Passed
60832ESB-39501Verify the clone and aggregate functionality with inline endpoints2453Passed
7333ESB-10111Add a fault mediator with fault code = Sender (for SOAP 1.2)2453Passed
63676ESB-43511[Tenant] Registry caching with cachableDuration set to 0 for tenant2453Passed
63457ESB-42991Redeploy proxy service in a car file2453Passed
39775ESB-16761Add and invoke File Inbound Endpoint with Action After Process is DELETE2453Not Run
62997ESB-42081XPath with filter mediator when the condition is TRUE for JSON payload2453Not Run
37342ESB-15091Invoke HTTP Inbound Endpoint in proxy service2453Passed
59987ESB-39041Call Mediator with blocking property set to true with InDirect end point2453Passed
3228ESB-3631Callout mediator with a valid Axis2 XML repository path2453Not Run
44214ESB-19781Use PayloadFactory for XML to JSON tranformation2453Not Run
46634ESB-23161Aggregate a number of messages < the max value of property2453Passed
4148ESB-6371Conditional router mediator with a target sequence that is in the registry2453Passed
62659ESB-41711XQuery transformation with targer as XPath value and variable type as boolean2453Passed
3723ESB-4901Load handling while iterating using large messages ( few MB)  in large numbers ( 500)2453Passed
3996ESB-5661Use dbreport mediator with use transaction option and transaction mediator2453Not Run
60824ESB-39491Verify the message context inside a clone mediator2453Passed
61940ESB-41101Add detail entry and check whether added detail (soap12) is included in the generated fault2453Passed
63479ESB-43031Deploy an endpoint to a tenant through Capp2453Passed
63001ESB-42091XPath with filter mediator when the condition is FALSE for JSON payload2453Not Run
62183ESB-41451Verify foreach mediator bahaviour when invoked with large message2453Passed
7329ESB-10101Add a fault mediator with fault code = dataEncodingUnknown (for SOAP 1.2)2453Passed
2511ESB-142Send mediator with Build Message True2453Not Run
4173ESB-6471Observe behavior of proxy service/sequence with large number of Conditional router mediators2453Passed
62687ESB-41791XQuery mediator with an empty SOAP message body2453Passed
37404ESB-15121Invoke HTTP Inbound Endpoint via api2453Passed
60819ESB-39481Verify clone and aggregate functionality with message burst2453Not Run
59606ESB-38861Aggregate a number of messages equal (=) to the max value of property2453Not Run
61936ESB-41091Add detail elements and check whether added detail (soap1.2) is included in the generated fault mess2453Passed
63482ESB-43041Deploy a sequence to with subsrting "main" in it's name through Capp2453Passed
62178ESB-41441Verify foreach mediator bahaviour when invoked several times2453Passed
7325ESB-10091Add detail elements and check whether added detail (detail in text) is included in the generated fault message2453Passed
61213ESB-39691[Fail transaction]Use dbreport mediator with use transaction option and transaction mediator2453Not Run
44249ESB-19821[With JSON stream]Use PayloadFactory for JSON to XML tranformation2453Not Run
46636ESB-23171Aggregate a number of messages > the max value of property2453Passed
61347ESB-39881Iterate mediator with a registry sequence2453Not Run
62690ESB-41801XQuery mediator general test case2453Not Run
31689ESB-13101Message processor should retry on HTTP error response codes2453Passed
61931ESB-41081Add fault mediator with fault code = versionMismatch (for SOAP 1.2)2453Passed
63008ESB-42111GET request with JSON response2453Not Run
62168ESB-41421Verify foreach mediator bahaviour with json messages2453Passed
63020ESB-42121POST method with JSON payload2453Not Run
33173ESB-13311Access proxy wsdl over https from a web browser2453Passed
62114ESB-41331Filter Mediator execution with xpath filtering and OR operation2453Passed
39110ESB-16311User saves secure Proxy with WSDL defined inline2453Not Run
44251ESB-19831[With JSON stream]Use PayloadFactory for JSON to JSON tranformation2453Not Run
64012ESB-44321Custom proxy with an inSequence from an existing Sequence2453Passed
62693ESB-41811XQuery mediator with an empty message body2453Passed
61924ESB-41061 Add fault mediator with fault code = mustUnderstand (for SOAP 1.2 )2453Passed
39127ESB-16321User saves secure Proxy with WSDL defined through source URL2453Not Run
63032ESB-42131PUT method with JSON payload2453Not Run
63424ESB-42891Verify dynamic endpoint timeout value through endpoint template for a delayed backend2453Not Run
61497ESB-40171Script mediator with a javascript function saved in config registry2453Passed
63686ESB-43531Deploying a secure proxy as a car file2453Not Run
58496ESB-38791Return various response codes via a Proxy2453Passed
46656ESB-23191[Negative]Aggregate a number of messages < the min value using expression2453Passed
44452ESB-20191Call Mediator in out_only propertywith2453Passed
64016ESB-44331Custom proxy with an inSequence from registry2453Passed
63798ESB-43851Dynamic timeout with a delayed backend2453Passed
61500ESB-40181Fault handling with script mediator2453Not Run
3731ESB-4941Include iterate mediator in a proxy with sequential value set to true2453Passed
61907ESB-41011Fault mediator with responce = true parameter2453Passed
3318ESB-4081Make sure when large cache time out value configured with scope per-host, cache functionality works as expected2453Not Run
59853ESB-38941Verify that reponce coming correctly when large time out value set in on complete2453Passed
63046ESB-42161XML to JSON array conversion2453Not Run
4078ESB-6041SOAP Version is 1.12453Not Run
63699ESB-43571Deploy an API as a CAPP2453Passed
58481ESB-38781Response with an empty JSON array2453Passed
45104ESB-21131switch mediator with valid regular expression2453Passed
64022ESB-44351Custom proxy with inline in sequence and inline endpoint2453Passed
59917ESB-38991Aggregate a number of messages equal(=) to the min value using expression2453Passed
61523ESB-40231Script mediator with related js function using include option2453Passed
63702ESB-43581Deploy a local entry as a CAPP2453Passed
2885ESB-1411Access 'MESSAGE_FORMAT' property when the message format is POX2453Passed
3733ESB-4951[Negative] Non matching iterate and aggregate IDs and verify that the aggregation does not happen2453Not Run
63060ESB-42171Inline JSON payload with POST request2453Not Run
61903ESB-41001Fault mediator with responce = false parameter and Addressing2453Passed
46654ESB-23181Aggregate a number of messages > the min value using expression2453Passed
64236ESB-44751High-level consumer type to consume from a topic2453Not Run
64025ESB-44361Custom proxy with an endpoint and no in sequence2453Passed
63711ESB-43601Deploy a car file with Class mediator2453Not Run
2887ESB-1421Access 'OperationName' (Synapse Message Context Property)2453Passed
61550ESB-40281Inline scripts being used in both in and out mediators2453Passed
61893ESB-40971Fault mediator with responce = false parameter2453Passed
61827ESB-40871Validate soap fault message when generated inside out sequence with makefault mediator(SOAP 1.1)2453Passed
63122ESB-42251JSON request with API for POST method2453Not Run
63399ESB-42831Payload with special characters and digits in body parameters for a POST request in a REST backend2453Passed
3071ESB-2881[Negative] Non-matching clone and aggregate IDs2453Passed
64028ESB-44371Custom proxy with no in sequence and endpoint from registry2453Passed
61561ESB-40301Set property with Axis2 scope using script mediator2453Passed
63714ESB-43611Undeploy a car file with class mediator2453Not Run
4212ESB-6621Add fault mediator with fault code = versionMismatch (for SOAP 1.1)2453Passed
44322ESB-19971Use PayloadFactory mediator with an payload format taken from config registry2453Not Run
59923ESB-39001Aggregate a number of messages equals(=) to the max value using expression2453Passed
61816ESB-40861Validate soap fault message when generated with makefault mediator(SOAP Version is 1.1)2453Not Run
63134ESB-42281JSON path with switch mediator when case is not matched2453Not Run
61564ESB-40311Set property with Transport scope using script mediator2453Passed
63507ESB-43091Enable response caching using cache mediator2453Passed
63779ESB-43791Creating a dynamic address endpoint via web service2453Passed
63566ESB-43221Fault when XML payload sent with application json content type2453Passed
63717ESB-43621Redeploy car file with a class mediator2453Not Run
4484ESB-7241Add fault mediator with fault code = mustUnderstand (for SOAP 1.1 )2453Passed
2997ESB-1961[Negative] Invalid XPath function in a property2453Not Run
63582ESB-43251REQUESTHASHGenerator with no request body POST2453Not Run
46670ESB-23211Aggregate a number of messages > the max value using expression2453Passed
63147ESB-42311Logging for JSON messages2453Not Run
61567ESB-40321Set property with Operation scope using script mediator2453Passed
61586ESB-40371Using a log mediator after send mediator2453Not Run
63532ESB-43131Message Processor binding with server2453Not Run
63782ESB-43801Creating a dynamic default endpoint via web service2453Passed
63951ESB-44211SOAP backend with a REST client for POST request2453Not Run
63720ESB-43631Hot deployment of a car file where there is an artifact with class mediator2453Not Run
3749ESB-4991[Negative] Verify error handling by defining an invalid xpath for attachPath2453Passed
4635ESB-7961Fault mediator with fault code = Client2453Passed
44352ESB-20021Verify Payload factory mediator behaviour with special characters2453Not Run
41831ESB-18051EDI to XML with smooks mediator, configuration loaded from conf. registry2453Not Run
45384ESB-21571Switch mediator with invalid XPATH for source path2453Not Run
61606ESB-40411Dynamic sequence with send mediator when buildmessage property is True2453Passed
64286ESB-44861Creating a JMS Message Store and publish to the store from proxy2453Passed
63585ESB-43261REQUESTHASHGenerator with no request body GET2453Not Run
63151ESB-42321JSON payload saved in registry2453Not Run
61575ESB-40341Set JSON payload with script mediator using groovy script2453Not Run
63785ESB-43811Creating a dynamic failover endpoint via web services2453Passed
63955ESB-44221SOAP backend with a REST client for a GET request2453Not Run
63724ESB-43641Undeploy a car file deployed using hot deployment2453Not Run
3751ESB-5001[Negative] Iterate mediator in a sequence without iterate expression2453Passed
44358ESB-20031Use PayloadFactory mediator with argument types value and expression2453Not Run
5110ESB-9711Fault mediator with fault code = Server2453Passed
61682ESB-40601Verify falut actor coming  with SOAP fault message Version 1.12453Passed
64728ESB-45101Add HTTP Inbound Endpoint with no custom sequence applied2453Passed
63210ESB-42451API media type in registry2453Not Run
61611ESB-40431Dynamic sequence with send mediator when buildmessage property is False2453Passed
55189ESB-37811Invoking CacheLevel with connection2453Passed
41856ESB-18071EDI to XML with smooks mediator, configuration loaded from local registry2453Not Run
64064ESB-44491Edit passthrough proxy2453Passed
63588ESB-43271Distributed caching with cache mediator2453Passed
3250ESB-3751Make sure backend invoked via Callout mediator returning HTTP 200 status code 2453Passed
63368ESB-42761Generating the swagger definition for an API in JSON format2453Not Run
64457ESB-44891Publish a message to the message store from a scheduled task from the main sequence2453Passed
63157ESB-42341Transform JSON payload inside payload mediator2453Not Run
63958ESB-44231SOAP backend with a REST client for a PUT operation2453Not Run
63731ESB-43661Car deployment and invocation with XSLT transformation2453Passed
3753ESB-5011[Negative] Invalid SOAPAction in clone target and invalid payload with iterate mediator2453Passed
5146ESB-9721Fault mediator with a string value as Fault String2453Passed
64743ESB-45111Verify HTTP Inbound Endpoint regex matched with non existing api invokes main sequence2453Passed
64067ESB-44501Invoke HTTP passthrough proxy after editing2453Passed
63175ESB-42371Transform JSON message using Xpath2453Not Run
61345ESB-39871[Negative] Invalid SOAPAction in clone target and a valid payload with iterate med2453Passed
63961ESB-44241SOAP backend with a REST client for a DELETE operation2453Not Run
63735ESB-43671Undeploy car file with artifact that contains XSLT mediator2453Passed
63284ESB-42591Verify proxy service when it receives status code 204 and disable chunking false2453Passed
64137ESB-44681Invoke a secure proxy where the policy has been updated2453Not Run
45403ESB-21611Switch mediator with invalid prefix2453Passed
5163ESB-9741Fault mediator with an expression as Fault String2453Passed
64511ESB-44921Publish a message to message store with OMElement containing values other than string2453Passed
64756ESB-45121Verify HTTP Inbound Endpoint matched with a available proxy is invoked2453Passed
61620ESB-40451Send mediator with a sequence saved in config registry with buildmessage set to True2453Passed
59569ESB-38831Call Mediator with load balance endpoint2453Passed
4959ESB-9531[Negative] Conditional router mediator with the equal element type=url2453Not Run
4962ESB-9541[Negative] Conditional router mediator with the equal element type=header2453Not Run
63183ESB-42391JSON request with clone meidator2453Not Run
59951ESB-39011Call mediator usage in out sequence2453Not Run
64071ESB-44511Invoke HTTPS passthrough proxy after editing2453Passed
64833ESB-45131Verify super tenant main sequence is invoked if an endpoint is invoked for a non existing tenant2453Passed
63558ESB-43201GET request with content type application xml2453Passed
63964ESB-44251Sending an empty payload as JSON content for a REST service2453Passed
3755ESB-5021[Negative] Invalid To Address  in clone target with iterate mediator2453Passed
64575ESB-44991Publish a message to the message store within a REST proxy2453Passed
64142ESB-44691Updating and saving a secure proxy2453Not Run
7317ESB-10071Specify a fault actor while adding the mediator (for SOAP 1.2)2453Passed
61623ESB-40461Send mediator with a sequence saved in config registry with buildmessage set to False2453Passed
59957ESB-39021Using blocking Call Mediator inside of filter mediator2453Passed
63154ESB-42331Replace JSON payload during mediation2453Not Run
63985ESB-44261JSON to SOAP conversion via Proxy service2453Passed
64840ESB-45141Verify tenant inbound endpoint invokes tenant APIs correctly2453Passed
63555ESB-43191GET request with content type application json2453Passed
64157ESB-44701Secure passthrough proxy with a secure backend service2453Not Run
3757ESB-5031[Negative] Missing namespace in attachPath2453Passed
64595ESB-45001Verify fault sequence invoked when proxy invokes unavailable message store2453Passed
61626ESB-40471Send mediator with a sequence saved in governance registry with buildmessage set to True2453Passed
63853ESB-43971Hot deployment when a configuration is edited and deleted from directory structure2453Not Run
64945ESB-45201Generating the swagger definition for an API in YAML format2453Passed
63186ESB-42401JSON path with switch mediator when case is matched2453Not Run
64075ESB-44521Passthrough proxy with addressing URI2453Passed
64248ESB-44781Editing an already deployed API2453Not Run
63764ESB-43751Create a default endpoint, enable stats and delete2453Passed
64873ESB-45161Verify tenant http inbound endpoint is invoked successfully2453Passed
63575ESB-43231HTTP relative location header2453Passed
3759ESB-5041[Negative] Invalid namespace in attachPath2453Not Run
64161ESB-44711Username token with secure proxy2453Not Run
60814ESB-39471Verify ESB not hanging up with an uncaught exeception in clone artifact2453Passed
62137ESB-41361Switch mediator with custom error sequence with onerror parameter2453Not Run
64516ESB-44931The faulty services view should refresh after deleting faulty jms service CAR2453Passed
60172ESB-39271Using non-blocking Call Mediator inside of filter mediator2453Passed
61629ESB-40481Send mediator with a sequence saved in governance registry with buildmessage set to False2453Passed
62755ESB-41831XSLT transformation with schema stored in file system2453Passed
64078ESB-44531Passthrough http  proxy with out addressing uri2453Passed
59982ESB-39031Using blocking Call Mediator with inbound & outbound security endpoint2453Not Run
64254ESB-44791URI Template With Complete URL2453Passed
63770ESB-43761Invoke a default endpoint via web services2453Passed
3761ESB-5051[Negative] Missing namespace in iterate expression2453Passed
64186ESB-44731Sending message via security proxy without a security header2453Not Run
62140ESB-41371Soap namespace based switching2453Passed
62781ESB-41861XSLT transformation with schema stored as inline local entry2453Passed
64520ESB-44941Faulty jms service uploaded from a CAR file should be shown in faulty service view2453Passed
61634ESB-40491Send mediator with a sequence saved in local registry with buildmessage set to True2453Passed
64081ESB-44541Passthrough proxy http without addressing uri2453Passed
59997ESB-39051Using blocking Call Mediator with call template2453Passed
64257ESB-44801API listing when HTTP is disabled2453Passed
64856ESB-45151Deploying a secured proxy using cApp2453Not Run
63776ESB-43781Invoke an endpoint in suspended state2453Passed
3763ESB-5061[Negative] Invalid namespace in iterate expression2453Not Run
62144ESB-41381Switch based on the SOAP action2453Passed
62784ESB-41871XSLT transformation for an empty SOAP body2453Passed
61637ESB-40501Send mediator with a sequence saved in local registry with buildmessage set to False2453Passed
64084ESB-44551Passthrough proxy https with addressing uri2453Passed
64019ESB-44341Custom proxy with inline in sequence and registry endpoint2453Passed
60066ESB-39071Using blocking Call Mediator with WS-Security enabled endpoint2453Not Run
3766ESB-5071[Negative] Valid iterate expression which does not match the original message2453Not Run
62148ESB-41391Switch within a Switch2453Passed
64109ESB-44621Invoking HTTPS endpoint via HTTP proxy2453Passed
62787ESB-41881XSLT transformation from URL2453Passed
63811ESB-43881API when receiving  a response with no content type invoke retry template2453Not Run
61651ESB-40521Send mediator with a default endpoint2453Passed
63600ESB-43301Clone mediator with Iterate mediator when continuteParent is set to True2453Passed
64031ESB-44381Custom proxy service with no in sequence and inline endpoint2453Passed
64087ESB-44561Passthrough https proxy with out addressing uri2453Passed
60071ESB-39081Using blocking Call Mediator inside a Switch mediator2453Passed
61354ESB-39901Attach path should be identified by iterate mediator2453Passed
67090ESB-46781Invoke API with context with multiple back slashes2453Passed
62163ESB-41401Switch mediator with regex patterns2453Not Run
64112ESB-44631Proxy service endpoint binding HttpSoap11Endpoint2453Passed
62790ESB-41891XSLT transformation with a synapse property2453Passed
61654ESB-40531Send mediator with a WSDL endpoint2453Passed
64034ESB-44391Invoking a non existent proxy2453Passed
64090ESB-44571Passthrough proxy https with out addressing uri2453Passed
60086ESB-39111Using blocking Call Mediator with failover endpoint2453Not Run
63543ESB-43161Retry JSON message with message processor2453Not Run
62166ESB-41411Error handling with switch statement with regex patterns2453Passed
64115ESB-44641Proxy service endpoint binding HttpsSoap11Endpoint2453Passed
61657ESB-40541Send mediator with a Failover endpoint2453Passed
64037ESB-44401Invoke a non existing proxy when main sequence is pointed to an endpoint2453Passed
64093ESB-44581Deploying proxy when the pinnedServer is having another instance name2453Passed
63347ESB-42711Escape selective auto primitive values on JSON payload within payload mediator2453Passed
60091ESB-39121Using blocking Call Mediator with a WSDL endpoint2453Passed
64118ESB-44651Proxy service with addressing2453Passed
63637ESB-43401HTTP header preservation during transfer messages from Message Store to Message Processor2453Passed
61660ESB-40552Send mediator with an address endpoint when buildmessage is True2453Passed
64040ESB-44411Custom proxy with inline out seqence2453Passed
60097ESB-39131 Verify the call mediator failure with a Proxy service [Inline in Sequence and Inline fault Sequence]2453Passed
64101ESB-44601Response for HTTP1.12453Passed
64125ESB-44661Proxy service behavior when both addressing and endpoint are available2453Passed
46694ESB-23241Store Mediator with empty OM array2453Passed
61668ESB-40561Send mediator with a default endpoint when buildmessage is True2453Passed
64043ESB-44421Custom proxy with an out sequence from registry2453Passed
64453ESB-44881Create a Scheduled Message Forwarding Processor with a POX endpoint2453Not Run
3274ESB-3871[Negative] Callout mediator with an invalid ServiceURL2453Passed
64105ESB-44611Response for HTTP1.02453Passed
64128ESB-44671Encoded special characters in the URL2453Not Run
62192ESB-41471Verify that foreach mediator properties evaluates correctly2453Passed
63623ESB-43371Script mediator with NULL JSON payload2453Not Run
61671ESB-40571Send mediator with a WSDL endpoint when buildmessage is True2453Passed
60102ESB-39141 Verify the call mediator failure with a Proxy service [Target in Sequence and Inline fault Sequence]2453Passed
64046ESB-44431Custom proxy with inline fault sequence2453Passed
64467ESB-44901Scheduled Message Forwarding Processor which accesses HTTP_SC in reply sequence2453Not Run
61676ESB-40591Send mediator with a Failover endpoint when buildmessage is True2453Passed
63616ESB-43351Payload with HTML tags as a string value2453Failed
60107ESB-39151Verify the call mediator failure with a Proxy service [Target in Sequence and Target fault Sequence]2453Passed
64049ESB-44441Custom proxy with fault sequence saved in registry2453Passed
62205ESB-41501Validate mediator with  invalid dynamic key as schema location2453Passed
65015ESB-45251Convert SOAP to POX and send to backend2453Not Run
61702ESB-40641Send mediator with Address endpoint when receiving sequence is in Local registry2453Passed
64563ESB-44981Create a Scheduled Message Forwarding Processor to consume from a message store2453Passed
60113ESB-39161Verify the call mediator failure with a Proxy service [Inline in Sequence and Target fault Sequence]2453Passed
60332ESB-39381Callout mediator with a Dynamic End Points2453Not Run
64052ESB-44451Custom proxy service with existing fault sequence2453Passed
62238ESB-41541Validate mediator with secure processing false2453Passed
64664ESB-45071Verify a message processor with a CRON expression consumes more than one message at a time2453Passed
65023ESB-45261Use tcp transport tfor a tcp client to invoke a proxy2453Passed
61709ESB-40651Send mediator with Address endpoint when receiving sequence is in config registry2453Passed
60119ESB-39171Verify  call mediator failure when used within an API [Inline in Sequence and Inline fault Sequence]2453Passed
60348ESB-39391Make sure custom transport headers  can be sent to non-HTTP transports using Callout mediator2453Passed
60708ESB-39441Make sure custom transport headers  can be sent to HTTP transports using Callout mediator[SOAP 11]2453Passed
64696ESB-45091Verify fault data can be retrieved by properties a soap fault received2453Not Run
62241ESB-41551Validate mediator with secure processing true2453Passed
61718ESB-40671Send mediator with Address endpoint when receiving sequence is in governance registry2453Passed
60123ESB-39181Verify call mediator failure when used within an API[Inline inSequence and Target fault Sequence]2453Passed
60714ESB-39451Make sure custom transport headers  can be sent to HTTP transports using Callout mediator[SOAP 12]2453Passed
62245ESB-41561Validate mediator with additional resources2453Passed
61723ESB-40681Send mediator with Default endpoint when receiving sequence is in Local registry2453Passed
60128ESB-39191Verify call mediator failure when used within an API[Target in Sequence and Target fault Sequence]2453Passed
64280ESB-44851Proxy as a jms consumer2453Passed
62269ESB-41591Validate mediator with JSON schema stored in local registry2453Passed
61726ESB-40691Send mediator with Default endpoint when receiving sequence is in Config registry2453Passed
60134ESB-39201Verify call mediator failure when used within an API[Target in Sequence and Inline fault Sequence]2453Passed
60375ESB-39401Verify the callout mediator functionality when used with a OUT_ONLY message2453Passed
62276ESB-41601Validate mediator with JSON schema stored in config registry2453Passed
61729ESB-40701Send mediator with Default endpoint when receiving sequence is in Governance registry2453Passed
60620ESB-39411Verify the callout mediator functionality with registry saved endpoint2453Passed
63865ESB-44001Add, enable stats and delete HTTP endpoint2453Passed
60139ESB-39211Verify the call mediator failure when proxy service defined with onError sequence2453Passed
62284ESB-41611Validate mediator with JSON schema stored in local registry when an element in payload is invalid2453Passed
60636ESB-39421Invoke a backend with inbound and Outbound security using callout mediator2453Not Run
61737ESB-40721Send mediator with WSDL endpoint when receiving sequence is in Local registry2453Passed
63898ESB-44071Sending a POST request to a SOAP HTTP endpoint2453Passed
60146ESB-39221Using call mediator inside an API2453Not Run
62296ESB-41631Validate mediator with JSON schema stored in config registry when an element in payload is invalid2453Passed
63552ESB-43181Dynamic URL with HTTP endpoint2453Passed
63904ESB-44081GET request for an HTTP endpoint with an invalid URI2453Passed
61746ESB-40731Send mediator with WSDL endpoint when receiving sequence is in Config registry2453Passed
60652ESB-39431Invoke a backend with enable security using callout mediator2453Not Run
60150ESB-39231Using call mediator inside In and Out sequences of a proxy service2453Passed
63907ESB-44091GET request to HTTP endpoint with missing uri.var variable2453Passed
61751ESB-40751Send mediator with WSDL endpoint when receiving sequence is in Governance registry2453Passed
62306ESB-41651Validate mediator with JSON schema stored in local registry when JSON path in payload in invalid2453Passed
60154ESB-39241Using call mediator inside a Clone target sequence2453Passed
52084ESB-36291Defining dynamic endpoint timeout value through property mediator2453Not Run
64260ESB-44811jms inbound endpoint with transaction commit2453Not Run
61381ESB-39941Read xml file from Inbound Endpoint2453Failed
63910ESB-44101Service chaining with HTTP endpoint2453Passed
61758ESB-40761Send mediator with Failover endpoint when receiving sequence is in Local registry2453Passed
63738ESB-43681Address endpoint add, delete and stats2453Passed
62310ESB-41661Validate mediator with JSON schema stored in local registry when JSON payload is empty2453Passed
60160ESB-39251Using call mediator inside a Clone target2453Passed
63364ESB-42751callout mediator with JMS endpoints2453Passed
64264ESB-44821jms inbound endpoint with transaction rollback2453Not Run
63748ESB-43701Invoke an address endpoint saved in config registry2453Passed
61388ESB-39961Read File from Inbound Endpoint with invalid username2453Passed
63916ESB-44121Sending a message to an indirect endpoint2453Passed
61761ESB-40771Send mediator with Failover endpoint when receiving sequence is in config registry with buildmessage True2453Passed
62329ESB-41681[Tenant] STRATOS-2297 - Validate mediator should work for tenant when schema saved in config registry2453Passed
60177ESB-39281Using call mediator inside an iterate mediator and aggregate responces2453Not Run
61609ESB-40421Verify that user didnt get two SOAP envelopes when policy violation occured in backend service2453Passed
63593ESB-43281Header case sensitivity validation for callout mediator2453Passed
64268ESB-44831Update jms inbound endpoint2453Passed
63751ESB-43711Invoke an in valid address endpoint2453Passed
61764ESB-40781Send mediator with Failover endpoint when receiving sequence is in gov registry with buildmessage True2453Passed
63938ESB-44181Create WSDL endpoint enable stats and delete2453Passed
60200ESB-39291Using call mediator inside the main sequnce 2453Passed
52144ESB-36311Defining dynamic endpoint timeout value through endpoint template2453Not Run
61412ESB-40001Read plain text File from Inbound Endpoint2453Passed
64273ESB-44841Delete jms inbound endpoint2453Passed
63597ESB-43291Callout mediator for a SOAP request with header2453Passed
63754ESB-43721Address endpoint with invalid scope2453Passed
63943ESB-44191Sending message to a WSDL endpoint2453Passed
61773ESB-40791Send mediator with dynamic receiving sequence calling address endpoint2453Passed
60204ESB-39301Using call mediator inside a nested filter switch like filter--Switch--Switch2453Passed
61428ESB-40011Read xml file name with special characters from Inbound Endpoint2453Not Run
63757ESB-43731Adding a duplicate address endpoint via web service2453Passed
61511ESB-40211Read xml file with invalid content type from Inbound Endpoint2453Not Run
63946ESB-44201Sending message to a WSDL endpoint saved in config registry2453Passed
61786ESB-40811Send mediator with dynamic receiving sequence calling default endpoint2453Passed
60220ESB-39311Using call mediator inside a nested filter switch2453Passed
63761ESB-43741Creating an address endpoint with timeout2453Passed
60251ESB-39321Using call mediator inside a nested filter2453Passed
61518ESB-40221Read xml file with without a content type from Inbound Endpoint2453Not Run
61791ESB-40821Send mediator with dynamic receiving sequence calling WSDL endpoint2453Passed
60260ESB-39331Using non-blocking Call Mediator inside a Switch mediator2453Passed
61546ESB-40271Read a xml file from File Inbound Endpoint with Action After Process is MOVE2453Not Run
61796ESB-40831Send mediator with dynamic receiving sequence calling Failover endpoint2453Passed
63826ESB-43921Action header for SOAP12 in address endpoints2453Passed
61810ESB-40851Send mediator with dynamic receiving sequence calling address endpoint with buildmessage True2453Passed
60267ESB-39341Using non blocking Call Mediator with call template2453Passed
61834ESB-40881Send mediator with dynamic receiving sequence calling default endpoint with buildmessage True2453Passed
54683ESB-37511Verify dynamic endpoint timeout for long period of time2453Not Run
60281ESB-39351Using non-blocking Call Mediator with OUT_ONLY property and With a ContentAware Mediator2453Passed
54689ESB-37531Verify dynamic endpoint timeout for short period of time2453Passed
60290ESB-39361Using non-blocking Call Mediator with OUT_ONLY property and Without a ContentAware Mediator2453Passed
61845ESB-40891Send mediator with dynamic receiving sequence calling WSDL endpoint with buildmessage True2453Passed
62841ESB-41981Verify synapse handler behavior when call mediator is used in blocking mode2453Not Run
61854ESB-40901Send mediator with dynamic receiving sequence calling Failover endpoint with buildmessage True2453Passed
63473ESB-43021Invoke Fault sequence after javax.net.ssl.SSLException2453Not Run
61884ESB-40941Send mediator with Load Balance endpoint configured for weighted round robin algorithm2453Not Run
61887ESB-40951Send mediator with Load Balance endpoint configured for round robin algorithm2453Not Run
61890ESB-40961Send mediator with Load Balance endpoint configured for weighted round robin algorithm and buildmessage True2453Not Run
61899ESB-40991Send mediator with Load Balance endpoint configured for round robin algorithm and buildmessage True2453Not Run
61913ESB-41021Send mediator with Load Balance endpoint configured for weighted round robin algorithm when receiving sequence is in conf registry2453Not Run
61916ESB-41031Send mediator with Load Balance endpoint configured for round robin algorithm when the receiving sequence is in conf registry2453Not Run
61919ESB-41041Send mediator with Load Balance endpoint configured for weighted round robin algorithm when buildmessage is True and receiving sequence is in conf reg2453Not Run
61928ESB-41071Send mediator with Load Balance endpoint configured for round robin algorithm when buildmessage is True and receiving sequence is in conf registry2453Not Run
61946ESB-41111Send mediator with Load Balance endpoint configured for weighted round robin algorithm when receiving sequence is in gov registry2453Not Run
61950ESB-41121Send mediator with Load Balance endpoint configured for round robin algorithm when buildmessage is True and receiving sequence is in gov registry2453Not Run
3013ESB-2611Mediation with an available sequence template with parameters2453Not Run
2890ESB-1431Acces 'PRESERVE_WS_ADDRESSING' (Generic Property)2453Passed
2923ESB-1591Access 'POST_TO_URI'2453Passed
3874ESB-5291Mediate with sequential option set to True and verify sequential message processing2453Passed
3003ESB-1941Access 'synapse:get-property()'  (XPath Extension function)2453Passed
2892ESB-1441Access 'RESPONSE' (Generic Property)2453Passed
2459ESB-41Sample 0 : Introduction2453Passed
2925ESB-1601Access 'FORCE_SC_ACCEPTED' when set to 'True'2453Passed
2967ESB-1801Access 'ConcurrentConsumers' and 'MaxConcurrentConsumers'2453Passed
2894ESB-1451Access 'OUT_ONLY' when the property set to 'FALSE'2453Passed
3777ESB-5101Mediate with a value To Address in iterate target with an HTTP endpoint2453Passed
4439ESB-7021Sample 1 verification : Simple Content-Based Routing (CBR) of Messages2453Passed
2927ESB-1611Access 'DISABLE_CHUNKING'2453Passed
3881ESB-5311Mediate with  continueParent option set to True and verify continued processing of original message2453Not Run
3779ESB-5111Mediate with a valie To Address in iterate target with an HTTPS endpoint2453Passed
20131ESB-12521Deleting messages from an In Memory Message store2453Passed
2971ESB-1821Access 'JMS_COORELATION_ID'  (Axis2 property)2453Passed
3883ESB-5321Mediate with continueParent option set to False and verify abandonment of processing of original message2453Not Run
2931ESB-1631Access 'FORCE_HTTP_1.0' when set to 'TRUE'2453Not Run
4222ESB-6661Rule mediator with ruleset source with a key from governance registry2453Passed
2933ESB-1641Access 'HTTP_SC'2453Passed
3025ESB-2671Mediate with both value and expression parameters2453Passed
3792ESB-5151Iterate mediator with a valid SOAPAction and a To Address of the target endpoints2453Passed
3794ESB-5161Iterate mediator with an iterate target calling an anonymous sequence2453Passed
2937ESB-1661Access 'NO_KEEPALIVE' when set to 'TRUE'2453Passed
64504ESB-44911ESB as a JMS Producer when nonBlockingLocal transport is enabled2453Passed
2939ESB-1671Access 'REST_URL_POSTFIX'2453Not Run
3806ESB-5171Iterate mediator with an iterate target calling a named sequence2453Passed
2908ESB-1521Access 'disableAddressingForOutMessages' (Generic Property)2453Passed
64534ESB-44951ESB as a JMS Consumer forwards the message to REST service2453Passed
3808ESB-5181Iterate mediator with an iterate target calling an anonymous endpoint2453Passed
64542ESB-44961ESB proxy as a JMS Consumer and producer2453Passed
3810ESB-5191terate mediator with an iterate target calling a named endpoint2453Passed
64551ESB-44971ESB proxy as a JMS Consumer to handle jms map messages2453Passed
4235ESB-6721Rule mediator with stateless session property2453Not Run
2945ESB-1701Access 'FORCE_HTTP_CONTENT_LENGTH' when set to 'TRUE'2453Passed
3812ESB-5201Iterate mediator with an iterate target calling an endpoint from config registry2453Not Run
64617ESB-45011ESB proxy as a JMS producer with OUT_ONLY & FORCE_SC_ACCEPTED2453Passed
2914ESB-1551Access 'TRANSPORT_IN_NAME' (Generic Property)2453Passed
3814ESB-5211Iterate mediator with an iterate target calling an endpoint from governance registry2453Passed
64621ESB-45021Create a proxy to publish a message to a queue with a POX format message2453Passed
64625ESB-45031Create a proxy to publish a message to a queue with a Soap11 format message2453Passed
64632ESB-45041Create a proxy to publish a message to a queue with a Soap12 format message2453Passed
64637ESB-45051Verify a proxy service with jms transport2453Passed
64652ESB-45061When registry caching is enabled verify if stale connections are cleared if broker restarts.2453Passed
60733ESB-39461Sample 750:Stereotyping XSLT Transformations with Templates2453Passed
64690ESB-45081Verify fault response is sent if a jms endpoint times out2453Not Run
63189ESB-42411Local entry retrieval for endpoint URL2453Passed
30264ESB-12871Upload a CAR with a proxy that has startOnLoad="false"2453Passed
42481ESB-18541User configures request throttling with maximum concurrent accesses2453Passed
62093ESB-41291Invoke proxy through local transport2453Passed
31799ESB-13111Add In-lined Text Entry2453Passed
45594ESB-21901Retrieving message context properties using class mediator2453Not Run
62034ESB-41181Verify http.headers.preserve property with different response headers2453Passed
62064ESB-41231Verify charset when the message is built in outsequence2453Passed
61101ESB-39611Verify HTTP Transport Authorization header2453Passed
63535ESB-43141Pausing JMS Listener2453Not Run
66831ESB-46341Sample 18 verification : Transforming a Message Using ForEach Mediator2453Passed
62815ESB-41921Gzip compression inside in sequence2453Passed
62854ESB-42011Receiving emails for a specific folder2453Not Run
58504ESB-38801Send integer value in JSON format through a Proxy2453Not Run
63225ESB-42481Local entry media type in registry2453Not Run
63248ESB-42511Priority executor media type in registry2453Not Run
7511ESB-10381Loopback mediator basic functionality2453Passed
46538ESB-23031Enclosing Element Property with valid property = Clone mediator2453Passed
61693ESB-40621Add a custom inbound endpoint that inject a message2453Not Run
63662ESB-43471Handling the error response 1015082453Passed
63433ESB-42911URI Template Expand With Percent Encoding2453Passed
66947ESB-46541Verify that ESB passes the content type sent from the backend to the API for all content types.2453Passed
61618ESB-40441Verify that "FORCE_ERROR_ON_SOAP_FAULT" property work as expected2453Passed
61800ESB-40841Add a custom inbound endpoint without a sequence2453Not Run
63996ESB-44271Create a sequence as a local entry2453Passed
45026ESB-20981Replacing body of payload using source defined inline2453Passed
62825ESB-41951Gzip compression inside out sequence2453Passed
39408ESB-16531User saves WSDL proxy using a different publishing WSDL defined inline2453Passed
45616ESB-21931Accessing message body through class mediator2453Not Run
65034ESB-45271Verify MTOM enabled property can  be disabled in a response sequence2453Not Run
67457ESB-47501Secured proxy invocation without auth headers2453Passed
35439ESB-14091User saves failover group with Address Endpoint in Configuration Registry2453Passed
63485ESB-43051Error handling when calling an invalid endpoint via sequences2453Passed
7788ESB-10551Successfully logged in user should be able to create a validate mediator gives Static key for schema2453Passed
63665ESB-43481Custom status message with passthrough2453Passed
63436ESB-42921URI Template Expand With Escaped Percent Encoding2453Passed
63215ESB-42461Dynamic endpoint media type in registry2453Passed
64008ESB-44311Create throttling policy as a local entry2453Passed
63512ESB-43101Error Handling for nested sequences2453Passed
62830ESB-41961Gzip compression inside in and out sequences2453Passed
45630ESB-21951Setting properties to message context through class mediator2453Not Run
67464ESB-47511Secured proxy invocation with incorrect auth headers2453Passed
63220ESB-42471Defined endpoint media type in registry2453Not Run
7794ESB-10561Successfully logged in user should be able to create a validate mediator and Specify a dynamic key as schema key2453Passed
62793ESB-41901Sending email with BCC2453Not Run
63644ESB-43421Server startup with registry mounted without any errors2453Not Run
63439ESB-42931URI Template Expand With Percent Encoding Path Param Case2453Passed
63680ESB-43521Accessing a registry resource inside a scheduled task2453Passed
38600ESB-16031User saves Pass through proxy with endpoint defined through URL2453Passed
63136ESB-42291Verify the execution of fault sequence when multiple proceeding fault sequences exists2453Passed
39620ESB-16661User saves Logging proxy with endpoint defined through URL2453Passed
62835ESB-41971Sending gzip compressed payload to ESB2453Passed
39436ESB-16551User saves WSDL proxy using a different publishing WSDL defined through source URL2453Passed
61314ESB-39811Remove a property and add a new property using class mediator2453Not Run
62800ESB-41911Sending email with Multipart2453Not Run
63651ESB-43441Invoke HTTPS endpoint from Proxy service2453Passed
63668ESB-43491Generating access logs2453Passed
44295ESB-19911Entire response transformation, XSLT loaded from conf registry2453Passed
63442ESB-42941URI Template Expand With Escaped Percent Encoding Path Param2453Passed
42510ESB-18611User saves request throttling with MaximumConcurrentAccess policy from config.registry2453Passed
40547ESB-17311User saves Transformer proxy with endpoint defined through URL2453Passed
61328ESB-39841Remove a property using class mediator2453Not Run
63999ESB-44281Remove in-lined text entry2453Passed
45044ESB-21011Replacing body of payload using source defined by property2453Passed
39453ESB-16561User saves WSDL proxy using a different publishing WSDL saved in conf.registry2453Passed
62846ESB-41991Sending and receiving gzip compressed payload to client2453Passed
44303ESB-19931Entire response transformation, XSLT loaded from gov registry2453Passed
61459ESB-40071Script mediator with a java script function saved in registry2453Passed
38636ESB-16051User saves Pass through proxy with endpoint saved in conf.registry2453Passed
63445ESB-42951URI Template Parameter Decoding Space Character Case2453Passed
64002ESB-44291Remove inline XML entry2453Passed
62851ESB-42001Sending and receiving gzip compressed payload 2453Passed
61462ESB-40081Inline Groovy script with script mediator2453Not Run
63448ESB-42961URI Template Parameter Decoding Plus Character Case2453Passed
40575ESB-17331User saves Transformer proxy with endpoint saved in conf.registry2453Passed
64005ESB-44301Remove source URL entry2453Passed
62085ESB-41271Set file transfer type to ASCII2453Passed
7466ESB-10321[Negative] A sucessfully logged in user who has persmission, should be able to login to the system,Create a sequence with an Out mediator that has no child mediators 2453Passed
61465ESB-40091Setting a payload in mediation flow by using a script mediator with groovy script2453Not Run
63451ESB-42971URI Template Parameter Decoding With Percent Encoding Escaped At Expansion2453Passed
62089ESB-41281Set file transfer type to Binary2453Passed
61467ESB-40101Inline JS within the script mediator2453Passed
7595ESB-10431[Negative] A sucessfully logged in user who has persmission, should be able to login to the system,Create a sequence with multiple Out mediators 2453Passed
63454ESB-42981URI Template Special Case Variable With Full URL2453Passed
45079ESB-21081Adding source property to the target body as child2453Passed
61337ESB-39851Invoke proxy service at high concurrency, when the out sequence is content aware2453Passed
38704ESB-16091User saves Pass Through Proxy with publishing WSDL defined inline2453Passed
63654ESB-43451Encoding the value of REST_URL_POSTFIX property2453Passed
61480ESB-40131Script mediator with ruby source file2453Passed
40622ESB-17371User saves Transformer Proxy with publishing WSDL defined inline2453Passed
38732ESB-16101User saves Pass Through Proxy with publishing WSDL defined through source URL2453Passed
39746ESB-16741User saves Logging Proxy with publishing WSDL defined inline2453Passed
61483ESB-40141Script mediator with ruby source saved in governance registry2453Passed
38743ESB-16111User saves Pass Through Proxy with publish WSDL saved in conf.registry2453Passed
44891ESB-20801ForEach mediator use payloadFactory to change the content2453Passed
62256ESB-41571Verify proxy deployment when WSDL is not retrieved2453Not Run
40650ESB-17391User saves Transformer Proxy with publishing WSDL defined through source URL2453Passed
39188ESB-16341User saves secure Proxy with WSDL saved in conf.registry2453Not Run
39779ESB-16771User saves Logging Proxy with publish WSDL saved in conf.registry2453Not Run
64241ESB-44761WSDL based proxy when the endpoint taken from a remote server2453Passed
40664ESB-17401User saves Transformer Proxy with publish WSDL saved in conf.registry2453Passed
63690ESB-43541VFS SFTP use of private key with passphrase2453Passed
45123ESB-21161Adding sibling to message body source defined by xpath2453Passed
64244ESB-44771WSDL based proxy with publish the same contract option2453Passed
63693ESB-43551VFS support for encrypted passwords2453Passed
44489ESB-20251Extracting elements based on the property defined in xslt loaded as dynamic key2453Passed
45145ESB-21191Adding source property to the target body as sibling2453Passed
63696ESB-43561Encrypted password with 2048 key strength for VFS2453Passed
38835ESB-16171User saves Pass through Proxy with HTTPS transport2453Passed
45564ESB-21851Multiple ForEach mediators as Parent and Child ( Nested ForEachs )2453Passed
38853ESB-16181User saves Pass through Proxy with HTTP transport2453Passed
65071ESB-45281Verify VFS FTP directly located in root directory2453Passed
65082ESB-45291Verify VFS FTP directly located in directory under root2453Passed
45452ESB-21641Validate mediator without specifying XPath expression2453Passed
65123ESB-45301Verify VFS listener hides the password in a error log2453Passed
64937ESB-45191Invoke HTTPS inbound Endpoint in Tenant space2453Passed
65127ESB-45311Verify VFS sender hides the password in a error log2453Passed
64956ESB-45211Create HTTPS Inbound  and invoke it2453Passed
65131ESB-45321Verify VFS with transport.vfs.Append=true creates the file correctly2453Passed
40886ESB-17521User saves Transformer Proxy with HTTPS transport2453Passed
45187ESB-21261Replacing target message defined through xpath by source  property2453Passed
65135ESB-45331Verify VFS proxy works without content type2453Not Run
40897ESB-17531User saves Transformer Proxy with HTTP transport2453Passed
45192ESB-21271Replacing target message defined through xpath by source inline content2453Passed
39974ESB-17031User saves Logging proxy with HTTPS transport2453Not Run
65143ESB-45341Verify VFS proxy does not process the same file if a failure occurs2453Not Run
39256ESB-16391User saves secure Proxy with HTTPS transport2453Not Run
36123ESB-14291User configures failover endpoint with multiple child endpoints2453Passed
45197ESB-21281Replacing target message defined through xpath by source inline content loaded from conf registry2453Passed
39985ESB-17041User saves Logging proxy with HTTP transport2453Passed
65176ESB-45371Verify VFS proxy with PollInterval set to 12453Not Run
65185ESB-45381Verify VFS proxy with PollInterval set to 302453Not Run
45210ESB-21301Adding child to target message body source defined by xpath2453Passed
64055ESB-44461Logging proxy with an endpoint saved in registry2453Passed
65190ESB-45391Verify VFS proxy successfully writes text/plain content and xml2453Not Run
45216ESB-21311Adding child to target message body using source body2453Passed
64057ESB-44471Logging proxy service with providing endpoint through url2453Not Run
64196ESB-44741Transformer proxy with invalid XSLT2453Passed
45223ESB-21321Adding child to target message body using source property2453Passed
65200ESB-45401Verify vfs proxy supports regex for all file name patterns2453Not Run
64060ESB-44481Verify info logs for proxy service2453Passed
45489ESB-21751Validate mediator with external schema - WSDL resource2453Passed
45231ESB-21331Adding child to target message body using source inline content2453Passed
65207ESB-45411Verify vfs proxy supports no file name pattern specified2453Not Run
45493ESB-21761Validate mediator with dynamic schema changes2453Passed
65361ESB-45521Set vfs proxy file URI in linux path with content type xml2453Not Run
45495ESB-21771Validate mediator with invalid xpath expression2453Passed
39378ESB-16501Add HL7 inbound endpoint with message preprocessor2453Not Run
65377ESB-45541Set vfs proxy file URI in linux path with content type plain2453Not Run
65381ESB-45551Verify action after process set to move works accordingly2453Not Run
65387ESB-45561Verify action after process set to DELETE will delete the file that was processed2453Not Run
45266ESB-21431Adding sibling to target message body using source  property2453Passed
65395ESB-45571Verify VFS reply file name can contain normal characters2453Not Run
45273ESB-21451Adding sibling to target message body using source inline content2453Passed
65399ESB-45581Verify VFS reply file name can contain special characters2453Not Run
65403ESB-45591Verify VFS proxy with reply file name property not been set2453Not Run
65414ESB-45611Verify VFS proxy moves after failure to the specified folder2453Not Run
45304ESB-21501Changing target property, using source body2453Passed
65442ESB-45621Verify VFS proxy will delete the the file after a failure occurrers2453Not Run
45759ESB-22161User enables statistics for a sequence2453Passed
65465ESB-45631Verify when action after process is not specified the vfs proxy works without any issue2453Not Run
63788ESB-43821Create a dynamic inline WSDL endpoint via web services2453Not Run
63919ESB-44131Create an inline WSDL endpoint with stats enabled and then delete via web services2453Passed
63488ESB-43061Sending empty payload to a loadbalancing endpoint2453Passed
63791ESB-43831Create dynamic load balance endpoint via web services2453Passed
63603ESB-43311Enrich mediator when source type property and clone is set to false2453Passed
63818ESB-43901Load balancing with failed endpoint2453Passed
63609ESB-43331Enrich mediator Operation Context for multiple messages2453Passed
63924ESB-44141Create load balancing endpoint, enable stats and delete load balancing endpoint2453Passed
63929ESB-44151Sending a message to a load balancing endpoint2453Passed
63829ESB-43931Failover endpoint with a single endpoint2453Passed
63932ESB-44161Send a message to a load balancing endpoint saved in config registry2453Passed
63832ESB-43941Invoking a failover endpoint2453Passed
63935ESB-44171Sending a message to a dynamically resolved endpoint2453Passed
63838ESB-43961Failover endpoint when primary endpoint is timing out2453Not Run
47939ESB-25101Validate XML to XML transform from DataMapper mediator2453Not Run
47941ESB-25111Validate JSON TO JSON transform with DataMapper mediator2453Not Run

Identified problems

There are test failures

[INFO] [ERROR] Failed to execute goal org.apache.maven.plugins:maven-surefire-plugin:2.18.1:test (default-test) on project
Indication 1

Connection reset

ERROR: Failed to deploy artifacts: Could not transfer artifact [.*Connection reset.*]
Indication 2

testPayloadFactoryArgsWithXmlBeginAndEndTags

java.lang.AssertionError: expected: but was: at org.testng.Assert.fail(Assert.java:89) at org.testng.Assert.failNotEquals(Assert.java:489) at org.testng.Assert.assertTrue(Assert.java:37) at org.testng.Assert.assertTrue(Assert.java:47) at org.wso2.carbon.esb.mediators.payloadFactory.ESBJAVA3573PayloadFormatWithBeginHtmlTagArgument.testPayloadFactoryArgsWithXmlBeginAndEndTags(ESBJAVA3573PayloadFormatWithBeginHtmlTagArgument.java:84)

testInboundEnpointReadFile_ContentType_XML

java.lang.AssertionError: The XML file is not getting read expected: but was: at org.testng.Assert.fail(Assert.java:89) at org.testng.Assert.failNotEquals(Assert.java:489) at org.testng.Assert.assertTrue(Assert.java:37) at org.wso2.carbon.esb.file.inbound.transport.test.InboundTransportTest.testInboundEnpointReadFile_ContentType_XML(InboundTransportTest.java:104)

initialize

org.wso2.esb.integration.common.utils.exception.ESBMailTransportIntegrationTestException: Error when creating the email store at org.wso2.esb.integration.common.utils.MailToTransportUtil.getConnection(MailToTransportUtil.java:198) at org.wso2.esb.integration.common.utils.MailToTransportUtil.deleteAllUnreadEmailsFromGmail(MailToTransportUtil.java:210) at org.wso2.carbon.esb.mailto.transport.receiver.test.MailToTransportFolderTestCase.initialize(MailToTransportFolderTestCase.java:46) Caused by: javax.mail.MessagingException: sun.security.validator.ValidatorException: PKIX path building failed: sun.security.provider.certpath.SunCertPathBuilderException: unable to find valid certification path to requested target; nested exception is: javax.net.ssl.SSLHandshakeException: sun.security.validator.ValidatorException: PKIX path building failed: sun.security.provider.certpath.SunCertPathBuilderException: unable to find valid certification path to requested target at com.sun.mail.imap.IMAPStore.protocolConnect(IMAPStore.java:665) at javax.mail.Service.connect(Service.java:317) at javax.mail.Service.connect(Service.java:176) at javax.mail.Service.connect(Service.java:125) at org.wso2.esb.integration.common.utils.MailToTransportUtil.getConnection(MailToTransportUtil.java:194) ... 36 more Caused by: javax.net.ssl.SSLHandshakeException: sun.security.validator.ValidatorException: PKIX path building failed: sun.security.provider.certpath.SunCertPathBuilderException: unable to find valid certification path to requested target at sun.security.ssl.Alerts.getSSLException(Alerts.java:192) at sun.security.ssl.SSLSocketImpl.fatal(SSLSocketImpl.java:1937) at sun.security.ssl.Handshaker.fatalSE(Handshaker.java:302) at sun.security.ssl.Handshaker.fatalSE(Handshaker.java:296) at sun.security.ssl.ClientHandshaker.serverCertificate(ClientHandshaker.java:1478) at sun.security.ssl.ClientHandshaker.processMessage(ClientHandshaker.java:212) at sun.security.ssl.Handshaker.processLoop(Handshaker.java:979) at sun.security.ssl.Handshaker.process_record(Handshaker.java:914) at sun.security.ssl.SSLSocketImpl.readRecord(SSLSocketImpl.java:1050) at sun.security.ssl.SSLSocketImpl.performInitialHandshake(SSLSocketImpl.java:1363) at sun.security.ssl.SSLSocketImpl.startHandshake(SSLSocketImpl.java:1391) at sun.security.ssl.SSLSocketImpl.startHandshake(SSLSocketImpl.java:1375) at com.sun.mail.util.SocketFetcher.configureSSLSocket(SocketFetcher.java:507) at com.sun.mail.util.SocketFetcher.getSocket(SocketFetcher.java:238) at com.sun.mail.iap.Protocol.(Protocol.java:113) at com.sun.mail.imap.protocol.IMAPProtocol.(IMAPProtocol.java:110) at com.sun.mail.imap.IMAPStore.protocolConnect(IMAPStore.java:632) ... 40 more Caused by: sun.security.validator.ValidatorException: PKIX path building failed: sun.security.provider.certpath.SunCertPathBuilderException: unable to find valid certification path to requested target at sun.security.validator.PKIXValidator.doBuild(PKIXValidator.java:387) at sun.security.validator.PKIXValidator.engineValidate(PKIXValidator.java:292) at sun.security.validator.Validator.validate(Validator.java:260) at sun.security.ssl.X509TrustManagerImpl.validate(X509TrustManagerImpl.java:324) at sun.security.ssl.X509TrustManagerImpl.checkTrusted(X509TrustManagerImpl.java:229) at sun.security.ssl.X509TrustManagerImpl.checkServerTrusted(X509TrustManagerImpl.java:124) at sun.security.ssl.ClientHandshaker.serverCertificate(ClientHandshaker.java:1460) ... 52 more Caused by: sun.security.provider.certpath.SunCertPathBuilderException: unable to find valid certification path to requested target at sun.security.provider.certpath.SunCertPathBuilder.build(SunCertPathBuilder.java:145) at sun.security.provider.certpath.SunCertPathBuilder.engineBuild(SunCertPathBuilder.java:131) at java.security.cert.CertPathBuilder.build(CertPathBuilder.java:280) at sun.security.validator.PKIXValidator.doBuild(PKIXValidator.java:382) ... 58 more

initialize

org.wso2.esb.integration.common.utils.exception.ESBMailTransportIntegrationTestException: Error when creating the email store at org.wso2.esb.integration.common.utils.MailToTransportUtil.getConnection(MailToTransportUtil.java:198) at org.wso2.esb.integration.common.utils.MailToTransportUtil.deleteAllUnreadEmailsFromGmail(MailToTransportUtil.java:210) at org.wso2.carbon.esb.mailto.transport.receiver.test.MailToTransportActionAfterProcessMoveTestCase.initialize(MailToTransportActionAfterProcessMoveTestCase.java:50) Caused by: javax.mail.MessagingException: sun.security.validator.ValidatorException: PKIX path building failed: sun.security.provider.certpath.SunCertPathBuilderException: unable to find valid certification path to requested target; nested exception is: javax.net.ssl.SSLHandshakeException: sun.security.validator.ValidatorException: PKIX path building failed: sun.security.provider.certpath.SunCertPathBuilderException: unable to find valid certification path to requested target at com.sun.mail.imap.IMAPStore.protocolConnect(IMAPStore.java:665) at javax.mail.Service.connect(Service.java:317) at javax.mail.Service.connect(Service.java:176) at javax.mail.Service.connect(Service.java:125) at org.wso2.esb.integration.common.utils.MailToTransportUtil.getConnection(MailToTransportUtil.java:194) ... 36 more Caused by: javax.net.ssl.SSLHandshakeException: sun.security.validator.ValidatorException: PKIX path building failed: sun.security.provider.certpath.SunCertPathBuilderException: unable to find valid certification path to requested target at sun.security.ssl.Alerts.getSSLException(Alerts.java:192) at sun.security.ssl.SSLSocketImpl.fatal(SSLSocketImpl.java:1937) at sun.security.ssl.Handshaker.fatalSE(Handshaker.java:302) at sun.security.ssl.Handshaker.fatalSE(Handshaker.java:296) at sun.security.ssl.ClientHandshaker.serverCertificate(ClientHandshaker.java:1478) at sun.security.ssl.ClientHandshaker.processMessage(ClientHandshaker.java:212) at sun.security.ssl.Handshaker.processLoop(Handshaker.java:979) at sun.security.ssl.Handshaker.process_record(Handshaker.java:914) at sun.security.ssl.SSLSocketImpl.readRecord(SSLSocketImpl.java:1050) at sun.security.ssl.SSLSocketImpl.performInitialHandshake(SSLSocketImpl.java:1363) at sun.security.ssl.SSLSocketImpl.startHandshake(SSLSocketImpl.java:1391) at sun.security.ssl.SSLSocketImpl.startHandshake(SSLSocketImpl.java:1375) at com.sun.mail.util.SocketFetcher.configureSSLSocket(SocketFetcher.java:507) at com.sun.mail.util.SocketFetcher.getSocket(SocketFetcher.java:238) at com.sun.mail.iap.Protocol.(Protocol.java:113) at com.sun.mail.imap.protocol.IMAPProtocol.(IMAPProtocol.java:110) at com.sun.mail.imap.IMAPStore.protocolConnect(IMAPStore.java:632) ... 40 more Caused by: sun.security.validator.ValidatorException: PKIX path building failed: sun.security.provider.certpath.SunCertPathBuilderException: unable to find valid certification path to requested target at sun.security.validator.PKIXValidator.doBuild(PKIXValidator.java:387) at sun.security.validator.PKIXValidator.engineValidate(PKIXValidator.java:292) at sun.security.validator.Validator.validate(Validator.java:260) at sun.security.ssl.X509TrustManagerImpl.validate(X509TrustManagerImpl.java:324) at sun.security.ssl.X509TrustManagerImpl.checkTrusted(X509TrustManagerImpl.java:229) at sun.security.ssl.X509TrustManagerImpl.checkServerTrusted(X509TrustManagerImpl.java:124) at sun.security.ssl.ClientHandshaker.serverCertificate(ClientHandshaker.java:1460) ... 52 more Caused by: sun.security.provider.certpath.SunCertPathBuilderException: unable to find valid certification path to requested target at sun.security.provider.certpath.SunCertPathBuilder.build(SunCertPathBuilder.java:145) at sun.security.provider.certpath.SunCertPathBuilder.engineBuild(SunCertPathBuilder.java:131) at java.security.cert.CertPathBuilder.build(CertPathBuilder.java:280) at sun.security.validator.PKIXValidator.doBuild(PKIXValidator.java:382) ... 58 more

initialize

org.wso2.esb.integration.common.utils.exception.ESBMailTransportIntegrationTestException: Error when creating the email store at org.wso2.esb.integration.common.utils.MailToTransportUtil.getConnection(MailToTransportUtil.java:198) at org.wso2.esb.integration.common.utils.MailToTransportUtil.deleteAllUnreadEmailsFromGmail(MailToTransportUtil.java:210) at org.wso2.carbon.esb.mailto.transport.receiver.test.MailToTransportActionAfterFailureDELETETestCase.initialize(MailToTransportActionAfterFailureDELETETestCase.java:51) Caused by: javax.mail.MessagingException: sun.security.validator.ValidatorException: PKIX path building failed: sun.security.provider.certpath.SunCertPathBuilderException: unable to find valid certification path to requested target; nested exception is: javax.net.ssl.SSLHandshakeException: sun.security.validator.ValidatorException: PKIX path building failed: sun.security.provider.certpath.SunCertPathBuilderException: unable to find valid certification path to requested target at com.sun.mail.imap.IMAPStore.protocolConnect(IMAPStore.java:665) at javax.mail.Service.connect(Service.java:317) at javax.mail.Service.connect(Service.java:176) at javax.mail.Service.connect(Service.java:125) at org.wso2.esb.integration.common.utils.MailToTransportUtil.getConnection(MailToTransportUtil.java:194) ... 36 more Caused by: javax.net.ssl.SSLHandshakeException: sun.security.validator.ValidatorException: PKIX path building failed: sun.security.provider.certpath.SunCertPathBuilderException: unable to find valid certification path to requested target at sun.security.ssl.Alerts.getSSLException(Alerts.java:192) at sun.security.ssl.SSLSocketImpl.fatal(SSLSocketImpl.java:1937) at sun.security.ssl.Handshaker.fatalSE(Handshaker.java:302) at sun.security.ssl.Handshaker.fatalSE(Handshaker.java:296) at sun.security.ssl.ClientHandshaker.serverCertificate(ClientHandshaker.java:1478) at sun.security.ssl.ClientHandshaker.processMessage(ClientHandshaker.java:212) at sun.security.ssl.Handshaker.processLoop(Handshaker.java:979) at sun.security.ssl.Handshaker.process_record(Handshaker.java:914) at sun.security.ssl.SSLSocketImpl.readRecord(SSLSocketImpl.java:1050) at sun.security.ssl.SSLSocketImpl.performInitialHandshake(SSLSocketImpl.java:1363) at sun.security.ssl.SSLSocketImpl.startHandshake(SSLSocketImpl.java:1391) at sun.security.ssl.SSLSocketImpl.startHandshake(SSLSocketImpl.java:1375) at com.sun.mail.util.SocketFetcher.configureSSLSocket(SocketFetcher.java:507) at com.sun.mail.util.SocketFetcher.getSocket(SocketFetcher.java:238) at com.sun.mail.iap.Protocol.(Protocol.java:113) at com.sun.mail.imap.protocol.IMAPProtocol.(IMAPProtocol.java:110) at com.sun.mail.imap.IMAPStore.protocolConnect(IMAPStore.java:632) ... 40 more Caused by: sun.security.validator.ValidatorException: PKIX path building failed: sun.security.provider.certpath.SunCertPathBuilderException: unable to find valid certification path to requested target at sun.security.validator.PKIXValidator.doBuild(PKIXValidator.java:387) at sun.security.validator.PKIXValidator.engineValidate(PKIXValidator.java:292) at sun.security.validator.Validator.validate(Validator.java:260) at sun.security.ssl.X509TrustManagerImpl.validate(X509TrustManagerImpl.java:324) at sun.security.ssl.X509TrustManagerImpl.checkTrusted(X509TrustManagerImpl.java:229) at sun.security.ssl.X509TrustManagerImpl.checkServerTrusted(X509TrustManagerImpl.java:124) at sun.security.ssl.ClientHandshaker.serverCertificate(ClientHandshaker.java:1460) ... 52 more Caused by: sun.security.provider.certpath.SunCertPathBuilderException: unable to find valid certification path to requested target at sun.security.provider.certpath.SunCertPathBuilder.build(SunCertPathBuilder.java:145) at sun.security.provider.certpath.SunCertPathBuilder.engineBuild(SunCertPathBuilder.java:131) at java.security.cert.CertPathBuilder.build(CertPathBuilder.java:280) at sun.security.validator.PKIXValidator.doBuild(PKIXValidator.java:382) ... 58 more

initialize

org.wso2.esb.integration.common.utils.exception.ESBMailTransportIntegrationTestException: Error when creating the email store at org.wso2.esb.integration.common.utils.MailToTransportUtil.getConnection(MailToTransportUtil.java:198) at org.wso2.esb.integration.common.utils.MailToTransportUtil.deleteAllUnreadEmailsFromGmail(MailToTransportUtil.java:210) at org.wso2.carbon.esb.mailto.transport.receiver.test.MailToTransportActionAfterFailureMOVETestCase.initialize(MailToTransportActionAfterFailureMOVETestCase.java:51) Caused by: javax.mail.MessagingException: sun.security.validator.ValidatorException: PKIX path building failed: sun.security.provider.certpath.SunCertPathBuilderException: unable to find valid certification path to requested target; nested exception is: javax.net.ssl.SSLHandshakeException: sun.security.validator.ValidatorException: PKIX path building failed: sun.security.provider.certpath.SunCertPathBuilderException: unable to find valid certification path to requested target at com.sun.mail.imap.IMAPStore.protocolConnect(IMAPStore.java:665) at javax.mail.Service.connect(Service.java:317) at javax.mail.Service.connect(Service.java:176) at javax.mail.Service.connect(Service.java:125) at org.wso2.esb.integration.common.utils.MailToTransportUtil.getConnection(MailToTransportUtil.java:194) ... 36 more Caused by: javax.net.ssl.SSLHandshakeException: sun.security.validator.ValidatorException: PKIX path building failed: sun.security.provider.certpath.SunCertPathBuilderException: unable to find valid certification path to requested target at sun.security.ssl.Alerts.getSSLException(Alerts.java:192) at sun.security.ssl.SSLSocketImpl.fatal(SSLSocketImpl.java:1937) at sun.security.ssl.Handshaker.fatalSE(Handshaker.java:302) at sun.security.ssl.Handshaker.fatalSE(Handshaker.java:296) at sun.security.ssl.ClientHandshaker.serverCertificate(ClientHandshaker.java:1478) at sun.security.ssl.ClientHandshaker.processMessage(ClientHandshaker.java:212) at sun.security.ssl.Handshaker.processLoop(Handshaker.java:979) at sun.security.ssl.Handshaker.process_record(Handshaker.java:914) at sun.security.ssl.SSLSocketImpl.readRecord(SSLSocketImpl.java:1050) at sun.security.ssl.SSLSocketImpl.performInitialHandshake(SSLSocketImpl.java:1363) at sun.security.ssl.SSLSocketImpl.startHandshake(SSLSocketImpl.java:1391) at sun.security.ssl.SSLSocketImpl.startHandshake(SSLSocketImpl.java:1375) at com.sun.mail.util.SocketFetcher.configureSSLSocket(SocketFetcher.java:507) at com.sun.mail.util.SocketFetcher.getSocket(SocketFetcher.java:238) at com.sun.mail.iap.Protocol.(Protocol.java:113) at com.sun.mail.imap.protocol.IMAPProtocol.(IMAPProtocol.java:110) at com.sun.mail.imap.IMAPStore.protocolConnect(IMAPStore.java:632) ... 40 more Caused by: sun.security.validator.ValidatorException: PKIX path building failed: sun.security.provider.certpath.SunCertPathBuilderException: unable to find valid certification path to requested target at sun.security.validator.PKIXValidator.doBuild(PKIXValidator.java:387) at sun.security.validator.PKIXValidator.engineValidate(PKIXValidator.java:292) at sun.security.validator.Validator.validate(Validator.java:260) at sun.security.ssl.X509TrustManagerImpl.validate(X509TrustManagerImpl.java:324) at sun.security.ssl.X509TrustManagerImpl.checkTrusted(X509TrustManagerImpl.java:229) at sun.security.ssl.X509TrustManagerImpl.checkServerTrusted(X509TrustManagerImpl.java:124) at sun.security.ssl.ClientHandshaker.serverCertificate(ClientHandshaker.java:1460) ... 52 more Caused by: sun.security.provider.certpath.SunCertPathBuilderException: unable to find valid certification path to requested target at sun.security.provider.certpath.SunCertPathBuilder.build(SunCertPathBuilder.java:145) at sun.security.provider.certpath.SunCertPathBuilder.engineBuild(SunCertPathBuilder.java:131) at java.security.cert.CertPathBuilder.build(CertPathBuilder.java:280) at sun.security.validator.PKIXValidator.doBuild(PKIXValidator.java:382) ... 58 more

initialize

org.wso2.esb.integration.common.utils.exception.ESBMailTransportIntegrationTestException: Error when creating the email store at org.wso2.esb.integration.common.utils.MailToTransportUtil.getConnection(MailToTransportUtil.java:198) at org.wso2.esb.integration.common.utils.MailToTransportUtil.deleteAllUnreadEmailsFromGmail(MailToTransportUtil.java:210) at org.wso2.carbon.esb.mailto.transport.receiver.test.MailToTransportHeadersTestCase.initialize(MailToTransportHeadersTestCase.java:50) Caused by: javax.mail.MessagingException: sun.security.validator.ValidatorException: PKIX path building failed: sun.security.provider.certpath.SunCertPathBuilderException: unable to find valid certification path to requested target; nested exception is: javax.net.ssl.SSLHandshakeException: sun.security.validator.ValidatorException: PKIX path building failed: sun.security.provider.certpath.SunCertPathBuilderException: unable to find valid certification path to requested target at com.sun.mail.imap.IMAPStore.protocolConnect(IMAPStore.java:665) at javax.mail.Service.connect(Service.java:317) at javax.mail.Service.connect(Service.java:176) at javax.mail.Service.connect(Service.java:125) at org.wso2.esb.integration.common.utils.MailToTransportUtil.getConnection(MailToTransportUtil.java:194) ... 36 more Caused by: javax.net.ssl.SSLHandshakeException: sun.security.validator.ValidatorException: PKIX path building failed: sun.security.provider.certpath.SunCertPathBuilderException: unable to find valid certification path to requested target at sun.security.ssl.Alerts.getSSLException(Alerts.java:192) at sun.security.ssl.SSLSocketImpl.fatal(SSLSocketImpl.java:1937) at sun.security.ssl.Handshaker.fatalSE(Handshaker.java:302) at sun.security.ssl.Handshaker.fatalSE(Handshaker.java:296) at sun.security.ssl.ClientHandshaker.serverCertificate(ClientHandshaker.java:1478) at sun.security.ssl.ClientHandshaker.processMessage(ClientHandshaker.java:212) at sun.security.ssl.Handshaker.processLoop(Handshaker.java:979) at sun.security.ssl.Handshaker.process_record(Handshaker.java:914) at sun.security.ssl.SSLSocketImpl.readRecord(SSLSocketImpl.java:1050) at sun.security.ssl.SSLSocketImpl.performInitialHandshake(SSLSocketImpl.java:1363) at sun.security.ssl.SSLSocketImpl.startHandshake(SSLSocketImpl.java:1391) at sun.security.ssl.SSLSocketImpl.startHandshake(SSLSocketImpl.java:1375) at com.sun.mail.util.SocketFetcher.configureSSLSocket(SocketFetcher.java:507) at com.sun.mail.util.SocketFetcher.getSocket(SocketFetcher.java:238) at com.sun.mail.iap.Protocol.(Protocol.java:113) at com.sun.mail.imap.protocol.IMAPProtocol.(IMAPProtocol.java:110) at com.sun.mail.imap.IMAPStore.protocolConnect(IMAPStore.java:632) ... 40 more Caused by: sun.security.validator.ValidatorException: PKIX path building failed: sun.security.provider.certpath.SunCertPathBuilderException: unable to find valid certification path to requested target at sun.security.validator.PKIXValidator.doBuild(PKIXValidator.java:387) at sun.security.validator.PKIXValidator.engineValidate(PKIXValidator.java:292) at sun.security.validator.Validator.validate(Validator.java:260) at sun.security.ssl.X509TrustManagerImpl.validate(X509TrustManagerImpl.java:324) at sun.security.ssl.X509TrustManagerImpl.checkTrusted(X509TrustManagerImpl.java:229) at sun.security.ssl.X509TrustManagerImpl.checkServerTrusted(X509TrustManagerImpl.java:124) at sun.security.ssl.ClientHandshaker.serverCertificate(ClientHandshaker.java:1460) ... 52 more Caused by: sun.security.provider.certpath.SunCertPathBuilderException: unable to find valid certification path to requested target at sun.security.provider.certpath.SunCertPathBuilder.build(SunCertPathBuilder.java:145) at sun.security.provider.certpath.SunCertPathBuilder.engineBuild(SunCertPathBuilder.java:131) at java.security.cert.CertPathBuilder.build(CertPathBuilder.java:280) at sun.security.validator.PKIXValidator.doBuild(PKIXValidator.java:382) ... 58 more

initialize

org.wso2.esb.integration.common.utils.exception.ESBMailTransportIntegrationTestException: Error when creating the email store at org.wso2.esb.integration.common.utils.MailToTransportUtil.getConnection(MailToTransportUtil.java:198) at org.wso2.esb.integration.common.utils.MailToTransportUtil.deleteAllUnreadEmailsFromGmail(MailToTransportUtil.java:210) at org.wso2.carbon.esb.mailto.transport.receiver.test.MailToTransportActionAfterProcessDeleteTestCase.initialize(MailToTransportActionAfterProcessDeleteTestCase.java:50) Caused by: javax.mail.MessagingException: sun.security.validator.ValidatorException: PKIX path building failed: sun.security.provider.certpath.SunCertPathBuilderException: unable to find valid certification path to requested target; nested exception is: javax.net.ssl.SSLHandshakeException: sun.security.validator.ValidatorException: PKIX path building failed: sun.security.provider.certpath.SunCertPathBuilderException: unable to find valid certification path to requested target at com.sun.mail.imap.IMAPStore.protocolConnect(IMAPStore.java:665) at javax.mail.Service.connect(Service.java:317) at javax.mail.Service.connect(Service.java:176) at javax.mail.Service.connect(Service.java:125) at org.wso2.esb.integration.common.utils.MailToTransportUtil.getConnection(MailToTransportUtil.java:194) ... 36 more Caused by: javax.net.ssl.SSLHandshakeException: sun.security.validator.ValidatorException: PKIX path building failed: sun.security.provider.certpath.SunCertPathBuilderException: unable to find valid certification path to requested target at sun.security.ssl.Alerts.getSSLException(Alerts.java:192) at sun.security.ssl.SSLSocketImpl.fatal(SSLSocketImpl.java:1937) at sun.security.ssl.Handshaker.fatalSE(Handshaker.java:302) at sun.security.ssl.Handshaker.fatalSE(Handshaker.java:296) at sun.security.ssl.ClientHandshaker.serverCertificate(ClientHandshaker.java:1478) at sun.security.ssl.ClientHandshaker.processMessage(ClientHandshaker.java:212) at sun.security.ssl.Handshaker.processLoop(Handshaker.java:979) at sun.security.ssl.Handshaker.process_record(Handshaker.java:914) at sun.security.ssl.SSLSocketImpl.readRecord(SSLSocketImpl.java:1050) at sun.security.ssl.SSLSocketImpl.performInitialHandshake(SSLSocketImpl.java:1363) at sun.security.ssl.SSLSocketImpl.startHandshake(SSLSocketImpl.java:1391) at sun.security.ssl.SSLSocketImpl.startHandshake(SSLSocketImpl.java:1375) at com.sun.mail.util.SocketFetcher.configureSSLSocket(SocketFetcher.java:507) at com.sun.mail.util.SocketFetcher.getSocket(SocketFetcher.java:238) at com.sun.mail.iap.Protocol.(Protocol.java:113) at com.sun.mail.imap.protocol.IMAPProtocol.(IMAPProtocol.java:110) at com.sun.mail.imap.IMAPStore.protocolConnect(IMAPStore.java:632) ... 40 more Caused by: sun.security.validator.ValidatorException: PKIX path building failed: sun.security.provider.certpath.SunCertPathBuilderException: unable to find valid certification path to requested target at sun.security.validator.PKIXValidator.doBuild(PKIXValidator.java:387) at sun.security.validator.PKIXValidator.engineValidate(PKIXValidator.java:292) at sun.security.validator.Validator.validate(Validator.java:260) at sun.security.ssl.X509TrustManagerImpl.validate(X509TrustManagerImpl.java:324) at sun.security.ssl.X509TrustManagerImpl.checkTrusted(X509TrustManagerImpl.java:229) at sun.security.ssl.X509TrustManagerImpl.checkServerTrusted(X509TrustManagerImpl.java:124) at sun.security.ssl.ClientHandshaker.serverCertificate(ClientHandshaker.java:1460) ... 52 more Caused by: sun.security.provider.certpath.SunCertPathBuilderException: unable to find valid certification path to requested target at sun.security.provider.certpath.SunCertPathBuilder.build(SunCertPathBuilder.java:145) at sun.security.provider.certpath.SunCertPathBuilder.engineBuild(SunCertPathBuilder.java:131) at java.security.cert.CertPathBuilder.build(CertPathBuilder.java:280) at sun.security.validator.PKIXValidator.doBuild(PKIXValidator.java:382) ... 58 more

initialize

org.wso2.esb.integration.common.utils.exception.ESBMailTransportIntegrationTestException: Error when creating the email store at org.wso2.esb.integration.common.utils.MailToTransportUtil.getConnection(MailToTransportUtil.java:198) at org.wso2.esb.integration.common.utils.MailToTransportUtil.deleteAllUnreadEmailsFromGmail(MailToTransportUtil.java:210) at org.wso2.carbon.esb.mailto.transport.receiver.test.MailToTransportAddressTestCase.initialize(MailToTransportAddressTestCase.java:52) Caused by: javax.mail.MessagingException: sun.security.validator.ValidatorException: PKIX path building failed: sun.security.provider.certpath.SunCertPathBuilderException: unable to find valid certification path to requested target; nested exception is: javax.net.ssl.SSLHandshakeException: sun.security.validator.ValidatorException: PKIX path building failed: sun.security.provider.certpath.SunCertPathBuilderException: unable to find valid certification path to requested target at com.sun.mail.imap.IMAPStore.protocolConnect(IMAPStore.java:665) at javax.mail.Service.connect(Service.java:317) at javax.mail.Service.connect(Service.java:176) at javax.mail.Service.connect(Service.java:125) at org.wso2.esb.integration.common.utils.MailToTransportUtil.getConnection(MailToTransportUtil.java:194) ... 36 more Caused by: javax.net.ssl.SSLHandshakeException: sun.security.validator.ValidatorException: PKIX path building failed: sun.security.provider.certpath.SunCertPathBuilderException: unable to find valid certification path to requested target at sun.security.ssl.Alerts.getSSLException(Alerts.java:192) at sun.security.ssl.SSLSocketImpl.fatal(SSLSocketImpl.java:1937) at sun.security.ssl.Handshaker.fatalSE(Handshaker.java:302) at sun.security.ssl.Handshaker.fatalSE(Handshaker.java:296) at sun.security.ssl.ClientHandshaker.serverCertificate(ClientHandshaker.java:1478) at sun.security.ssl.ClientHandshaker.processMessage(ClientHandshaker.java:212) at sun.security.ssl.Handshaker.processLoop(Handshaker.java:979) at sun.security.ssl.Handshaker.process_record(Handshaker.java:914) at sun.security.ssl.SSLSocketImpl.readRecord(SSLSocketImpl.java:1050) at sun.security.ssl.SSLSocketImpl.performInitialHandshake(SSLSocketImpl.java:1363) at sun.security.ssl.SSLSocketImpl.startHandshake(SSLSocketImpl.java:1391) at sun.security.ssl.SSLSocketImpl.startHandshake(SSLSocketImpl.java:1375) at com.sun.mail.util.SocketFetcher.configureSSLSocket(SocketFetcher.java:507) at com.sun.mail.util.SocketFetcher.getSocket(SocketFetcher.java:238) at com.sun.mail.iap.Protocol.(Protocol.java:113) at com.sun.mail.imap.protocol.IMAPProtocol.(IMAPProtocol.java:110) at com.sun.mail.imap.IMAPStore.protocolConnect(IMAPStore.java:632) ... 40 more Caused by: sun.security.validator.ValidatorException: PKIX path building failed: sun.security.provider.certpath.SunCertPathBuilderException: unable to find valid certification path to requested target at sun.security.validator.PKIXValidator.doBuild(PKIXValidator.java:387) at sun.security.validator.PKIXValidator.engineValidate(PKIXValidator.java:292) at sun.security.validator.Validator.validate(Validator.java:260) at sun.security.ssl.X509TrustManagerImpl.validate(X509TrustManagerImpl.java:324) at sun.security.ssl.X509TrustManagerImpl.checkTrusted(X509TrustManagerImpl.java:229) at sun.security.ssl.X509TrustManagerImpl.checkServerTrusted(X509TrustManagerImpl.java:124) at sun.security.ssl.ClientHandshaker.serverCertificate(ClientHandshaker.java:1460) ... 52 more Caused by: sun.security.provider.certpath.SunCertPathBuilderException: unable to find valid certification path to requested target at sun.security.provider.certpath.SunCertPathBuilder.build(SunCertPathBuilder.java:145) at sun.security.provider.certpath.SunCertPathBuilder.engineBuild(SunCertPathBuilder.java:131) at java.security.cert.CertPathBuilder.build(CertPathBuilder.java:280) at sun.security.validator.PKIXValidator.doBuild(PKIXValidator.java:382) ... 58 more

initialize

org.wso2.esb.integration.common.utils.exception.ESBMailTransportIntegrationTestException: Error when creating the email store at org.wso2.esb.integration.common.utils.MailToTransportUtil.getConnection(MailToTransportUtil.java:198) at org.wso2.esb.integration.common.utils.MailToTransportUtil.deleteAllUnreadEmailsFromGmail(MailToTransportUtil.java:210) at org.wso2.carbon.esb.mailto.transport.receiver.test.MailToTransportInvalidAddressTestCase.initialize(MailToTransportInvalidAddressTestCase.java:47) Caused by: javax.mail.MessagingException: sun.security.validator.ValidatorException: PKIX path building failed: sun.security.provider.certpath.SunCertPathBuilderException: unable to find valid certification path to requested target; nested exception is: javax.net.ssl.SSLHandshakeException: sun.security.validator.ValidatorException: PKIX path building failed: sun.security.provider.certpath.SunCertPathBuilderException: unable to find valid certification path to requested target at com.sun.mail.imap.IMAPStore.protocolConnect(IMAPStore.java:665) at javax.mail.Service.connect(Service.java:317) at javax.mail.Service.connect(Service.java:176) at javax.mail.Service.connect(Service.java:125) at org.wso2.esb.integration.common.utils.MailToTransportUtil.getConnection(MailToTransportUtil.java:194) ... 36 more Caused by: javax.net.ssl.SSLHandshakeException: sun.security.validator.ValidatorException: PKIX path building failed: sun.security.provider.certpath.SunCertPathBuilderException: unable to find valid certification path to requested target at sun.security.ssl.Alerts.getSSLException(Alerts.java:192) at sun.security.ssl.SSLSocketImpl.fatal(SSLSocketImpl.java:1937) at sun.security.ssl.Handshaker.fatalSE(Handshaker.java:302) at sun.security.ssl.Handshaker.fatalSE(Handshaker.java:296) at sun.security.ssl.ClientHandshaker.serverCertificate(ClientHandshaker.java:1478) at sun.security.ssl.ClientHandshaker.processMessage(ClientHandshaker.java:212) at sun.security.ssl.Handshaker.processLoop(Handshaker.java:979) at sun.security.ssl.Handshaker.process_record(Handshaker.java:914) at sun.security.ssl.SSLSocketImpl.readRecord(SSLSocketImpl.java:1050) at sun.security.ssl.SSLSocketImpl.performInitialHandshake(SSLSocketImpl.java:1363) at sun.security.ssl.SSLSocketImpl.startHandshake(SSLSocketImpl.java:1391) at sun.security.ssl.SSLSocketImpl.startHandshake(SSLSocketImpl.java:1375) at com.sun.mail.util.SocketFetcher.configureSSLSocket(SocketFetcher.java:507) at com.sun.mail.util.SocketFetcher.getSocket(SocketFetcher.java:238) at com.sun.mail.iap.Protocol.(Protocol.java:113) at com.sun.mail.imap.protocol.IMAPProtocol.(IMAPProtocol.java:110) at com.sun.mail.imap.IMAPStore.protocolConnect(IMAPStore.java:632) ... 40 more Caused by: sun.security.validator.ValidatorException: PKIX path building failed: sun.security.provider.certpath.SunCertPathBuilderException: unable to find valid certification path to requested target at sun.security.validator.PKIXValidator.doBuild(PKIXValidator.java:387) at sun.security.validator.PKIXValidator.engineValidate(PKIXValidator.java:292) at sun.security.validator.Validator.validate(Validator.java:260) at sun.security.ssl.X509TrustManagerImpl.validate(X509TrustManagerImpl.java:324) at sun.security.ssl.X509TrustManagerImpl.checkTrusted(X509TrustManagerImpl.java:229) at sun.security.ssl.X509TrustManagerImpl.checkServerTrusted(X509TrustManagerImpl.java:124) at sun.security.ssl.ClientHandshaker.serverCertificate(ClientHandshaker.java:1460) ... 52 more Caused by: sun.security.provider.certpath.SunCertPathBuilderException: unable to find valid certification path to requested target at sun.security.provider.certpath.SunCertPathBuilder.build(SunCertPathBuilder.java:145) at sun.security.provider.certpath.SunCertPathBuilder.engineBuild(SunCertPathBuilder.java:131) at java.security.cert.CertPathBuilder.build(CertPathBuilder.java:280) at sun.security.validator.PKIXValidator.doBuild(PKIXValidator.java:382) ... 58 more

initialize

org.wso2.esb.integration.common.utils.exception.ESBMailTransportIntegrationTestException: Error when creating the email store at org.wso2.esb.integration.common.utils.MailToTransportUtil.getConnection(MailToTransportUtil.java:198) at org.wso2.esb.integration.common.utils.MailToTransportUtil.deleteAllUnreadEmailsFromGmail(MailToTransportUtil.java:210) at org.wso2.carbon.esb.mailto.transport.receiver.test.MailToTransportProtocolIMAPTestCase.initialize(MailToTransportProtocolIMAPTestCase.java:52) Caused by: javax.mail.MessagingException: sun.security.validator.ValidatorException: PKIX path building failed: sun.security.provider.certpath.SunCertPathBuilderException: unable to find valid certification path to requested target; nested exception is: javax.net.ssl.SSLHandshakeException: sun.security.validator.ValidatorException: PKIX path building failed: sun.security.provider.certpath.SunCertPathBuilderException: unable to find valid certification path to requested target at com.sun.mail.imap.IMAPStore.protocolConnect(IMAPStore.java:665) at javax.mail.Service.connect(Service.java:317) at javax.mail.Service.connect(Service.java:176) at javax.mail.Service.connect(Service.java:125) at org.wso2.esb.integration.common.utils.MailToTransportUtil.getConnection(MailToTransportUtil.java:194) ... 36 more Caused by: javax.net.ssl.SSLHandshakeException: sun.security.validator.ValidatorException: PKIX path building failed: sun.security.provider.certpath.SunCertPathBuilderException: unable to find valid certification path to requested target at sun.security.ssl.Alerts.getSSLException(Alerts.java:192) at sun.security.ssl.SSLSocketImpl.fatal(SSLSocketImpl.java:1937) at sun.security.ssl.Handshaker.fatalSE(Handshaker.java:302) at sun.security.ssl.Handshaker.fatalSE(Handshaker.java:296) at sun.security.ssl.ClientHandshaker.serverCertificate(ClientHandshaker.java:1478) at sun.security.ssl.ClientHandshaker.processMessage(ClientHandshaker.java:212) at sun.security.ssl.Handshaker.processLoop(Handshaker.java:979) at sun.security.ssl.Handshaker.process_record(Handshaker.java:914) at sun.security.ssl.SSLSocketImpl.readRecord(SSLSocketImpl.java:1050) at sun.security.ssl.SSLSocketImpl.performInitialHandshake(SSLSocketImpl.java:1363) at sun.security.ssl.SSLSocketImpl.startHandshake(SSLSocketImpl.java:1391) at sun.security.ssl.SSLSocketImpl.startHandshake(SSLSocketImpl.java:1375) at com.sun.mail.util.SocketFetcher.configureSSLSocket(SocketFetcher.java:507) at com.sun.mail.util.SocketFetcher.getSocket(SocketFetcher.java:238) at com.sun.mail.iap.Protocol.(Protocol.java:113) at com.sun.mail.imap.protocol.IMAPProtocol.(IMAPProtocol.java:110) at com.sun.mail.imap.IMAPStore.protocolConnect(IMAPStore.java:632) ... 40 more Caused by: sun.security.validator.ValidatorException: PKIX path building failed: sun.security.provider.certpath.SunCertPathBuilderException: unable to find valid certification path to requested target at sun.security.validator.PKIXValidator.doBuild(PKIXValidator.java:387) at sun.security.validator.PKIXValidator.engineValidate(PKIXValidator.java:292) at sun.security.validator.Validator.validate(Validator.java:260) at sun.security.ssl.X509TrustManagerImpl.validate(X509TrustManagerImpl.java:324) at sun.security.ssl.X509TrustManagerImpl.checkTrusted(X509TrustManagerImpl.java:229) at sun.security.ssl.X509TrustManagerImpl.checkServerTrusted(X509TrustManagerImpl.java:124) at sun.security.ssl.ClientHandshaker.serverCertificate(ClientHandshaker.java:1460) ... 52 more Caused by: sun.security.provider.certpath.SunCertPathBuilderException: unable to find valid certification path to requested target at sun.security.provider.certpath.SunCertPathBuilder.build(SunCertPathBuilder.java:145) at sun.security.provider.certpath.SunCertPathBuilder.engineBuild(SunCertPathBuilder.java:131) at java.security.cert.CertPathBuilder.build(CertPathBuilder.java:280) at sun.security.validator.PKIXValidator.doBuild(PKIXValidator.java:382) ... 58 more

initialize

org.wso2.esb.integration.common.utils.exception.ESBMailTransportIntegrationTestException: Error when creating the email store at org.wso2.esb.integration.common.utils.MailToTransportUtil.getConnection(MailToTransportUtil.java:198) at org.wso2.esb.integration.common.utils.MailToTransportUtil.deleteAllUnreadEmailsFromGmail(MailToTransportUtil.java:210) at org.wso2.carbon.esb.mailto.transport.receiver.test.MailToTransportInvalidFolderTestCase.initialize(MailToTransportInvalidFolderTestCase.java:44) Caused by: javax.mail.MessagingException: sun.security.validator.ValidatorException: PKIX path building failed: sun.security.provider.certpath.SunCertPathBuilderException: unable to find valid certification path to requested target; nested exception is: javax.net.ssl.SSLHandshakeException: sun.security.validator.ValidatorException: PKIX path building failed: sun.security.provider.certpath.SunCertPathBuilderException: unable to find valid certification path to requested target at com.sun.mail.imap.IMAPStore.protocolConnect(IMAPStore.java:665) at javax.mail.Service.connect(Service.java:317) at javax.mail.Service.connect(Service.java:176) at javax.mail.Service.connect(Service.java:125) at org.wso2.esb.integration.common.utils.MailToTransportUtil.getConnection(MailToTransportUtil.java:194) ... 36 more Caused by: javax.net.ssl.SSLHandshakeException: sun.security.validator.ValidatorException: PKIX path building failed: sun.security.provider.certpath.SunCertPathBuilderException: unable to find valid certification path to requested target at sun.security.ssl.Alerts.getSSLException(Alerts.java:192) at sun.security.ssl.SSLSocketImpl.fatal(SSLSocketImpl.java:1937) at sun.security.ssl.Handshaker.fatalSE(Handshaker.java:302) at sun.security.ssl.Handshaker.fatalSE(Handshaker.java:296) at sun.security.ssl.ClientHandshaker.serverCertificate(ClientHandshaker.java:1478) at sun.security.ssl.ClientHandshaker.processMessage(ClientHandshaker.java:212) at sun.security.ssl.Handshaker.processLoop(Handshaker.java:979) at sun.security.ssl.Handshaker.process_record(Handshaker.java:914) at sun.security.ssl.SSLSocketImpl.readRecord(SSLSocketImpl.java:1050) at sun.security.ssl.SSLSocketImpl.performInitialHandshake(SSLSocketImpl.java:1363) at sun.security.ssl.SSLSocketImpl.startHandshake(SSLSocketImpl.java:1391) at sun.security.ssl.SSLSocketImpl.startHandshake(SSLSocketImpl.java:1375) at com.sun.mail.util.SocketFetcher.configureSSLSocket(SocketFetcher.java:507) at com.sun.mail.util.SocketFetcher.getSocket(SocketFetcher.java:238) at com.sun.mail.iap.Protocol.(Protocol.java:113) at com.sun.mail.imap.protocol.IMAPProtocol.(IMAPProtocol.java:110) at com.sun.mail.imap.IMAPStore.protocolConnect(IMAPStore.java:632) ... 40 more Caused by: sun.security.validator.ValidatorException: PKIX path building failed: sun.security.provider.certpath.SunCertPathBuilderException: unable to find valid certification path to requested target at sun.security.validator.PKIXValidator.doBuild(PKIXValidator.java:387) at sun.security.validator.PKIXValidator.engineValidate(PKIXValidator.java:292) at sun.security.validator.Validator.validate(Validator.java:260) at sun.security.ssl.X509TrustManagerImpl.validate(X509TrustManagerImpl.java:324) at sun.security.ssl.X509TrustManagerImpl.checkTrusted(X509TrustManagerImpl.java:229) at sun.security.ssl.X509TrustManagerImpl.checkServerTrusted(X509TrustManagerImpl.java:124) at sun.security.ssl.ClientHandshaker.serverCertificate(ClientHandshaker.java:1460) ... 52 more Caused by: sun.security.provider.certpath.SunCertPathBuilderException: unable to find valid certification path to requested target at sun.security.provider.certpath.SunCertPathBuilder.build(SunCertPathBuilder.java:145) at sun.security.provider.certpath.SunCertPathBuilder.engineBuild(SunCertPathBuilder.java:131) at java.security.cert.CertPathBuilder.build(CertPathBuilder.java:280) at sun.security.validator.PKIXValidator.doBuild(PKIXValidator.java:382) ... 58 more

Environment Variables(60)47 different
Slave Information(83)47 different
Project Information(15)2 different

Module Builds

Success ESB Integration Test Admin Clients10 sec
Success WSO2 ESB - Features Aggregator Module88 ms
Success WSO2 ESB - Features Parent57 ms
Success WSO2 ESB - Integration Parent74 ms
Success WSO2 ESB - Aggregator Module5.3 sec
Success WSO2 ESB - Samples Parent71 ms
Success WSO2 ESB - Styles Parent71 ms
Success ESB Integration Extensions5.6 sec
Success integration-test-common38 sec
Success ESB Integration Test Common Utils12 sec
Success Integration Test Reporting2.1 sec
Success ESB test Module-mediator-134 min
Success ESB test Module-mediator-226 min
Success ESB test Module-Other14 min
Unstable ESB test Module - Test Patches52 min
Success ESB Test Module - Platform95 ms
Success ESB test Module - Platform - RabbitMQ Transport4.3 sec
Success ESB test Module - Platform - with WSO2MB4.7 sec
Success ESB test Module - Sample20 min
Success ESB test Module-Service19 min
Unstable ESB test Module-Transport38 min
Success ESB test Module - Sample4.4 sec
Success WSO2 ESB - Samples22 sec
Success WSO2 ESB - Samples Features0.48 sec
Success WSO2 ESB - Styles2 sec
Success WSO2 ESB - Styles Features14 sec
Success ESB Test Service Module2.2 sec
Success ESB Integration Test UI Pages4.3 sec
Success WSO2 ESB - Distribution31 sec
Success WSO2 ESB - P2 Profile Generation2 min 9 sec