Started 16 days ago
Took 7 hr 34 min on ECS_PRODUCTION-1ce4eced53d61e

Failed Build #420 (Jan 4, 2022 6:36:09 PM)

Build Artifacts
dependency-updates-report.xml322.71 KB view
Changes
  1. Fix test failure due to olingo version update (commit: 1247f7d) (details)

Started by an SCM change

Revision: 1247f7dd7837122a1b224dc342f28eab2c282291
  • refs/remotes/origin/master
Test Result (6 failures / +2)Show all failed tests >>>

Identified problems

xsltTransformationFromUrl

org.apache.axis2.AxisFault: org.apache.synapse.SynapseException: Content-Type:text/xml; charset=UTF-8,Host:localhost:8480,SOAPAction:"urn:getQuote", Unexpected error sending message back at org.apache.axis2.util.Utils.getInboundFaultFromMessageContext(Utils.java:531) at org.apache.axis2.description.OutInAxisOperationClient.handleResponse(OutInAxisOperation.java:382) at org.apache.axis2.description.OutInAxisOperationClient.send(OutInAxisOperation.java:457) at org.apache.axis2.description.OutInAxisOperationClient.executeImpl(OutInAxisOperation.java:228) at org.apache.axis2.client.OperationClient.execute(OperationClient.java:149) at org.apache.axis2.client.ServiceClient.sendReceive(ServiceClient.java:554) at org.apache.axis2.client.ServiceClient.sendReceive(ServiceClient.java:530) at org.wso2.esb.integration.common.utils.clients.stockquoteclient.StockQuoteClient.sendCustomQuoteRequest(StockQuoteClient.java:166) at org.wso2.carbon.esb.mediator.test.xslt.XsltTransformationFromUrlTestCase.xsltTransformationFromUrl(XsltTransformationFromUrlTestCase.java:42)

testMessagesInMessageProcessor

java.lang.AssertionError: Message Processor : mspAdminTestInMemoryMessageProcessor did not de-activate after failed delivery attempts with OUT_ONLY property. expected: but was: at org.testng.Assert.fail(Assert.java:89) at org.testng.Assert.failNotEquals(Assert.java:489) at org.testng.Assert.assertFalse(Assert.java:58) at org.wso2.carbon.esb.message.processor.test.MessageProcessorAdminTestCase.testMessagesInMessageProcessor(MessageProcessorAdminTestCase.java:191)

testPreserveContentTypeHeader

java.lang.AssertionError: Response header modified at org.junit.Assert.fail(Assert.java:88) at org.junit.Assert.assertTrue(Assert.java:41) at org.wso2.carbon.esb.passthru.transport.test.PreseveResponseHeaderTestCase.testPreserveContentTypeHeader(PreseveResponseHeaderTestCase.java:57)

testPollingWithSuspensionLimit

java.lang.AssertionError: JMS Polling suspension is not enabled. expected: but was: at org.testng.Assert.fail(Assert.java:89) at org.testng.Assert.failNotEquals(Assert.java:489) at org.testng.Assert.assertTrue(Assert.java:37) at org.wso2.carbon.esb.jms.transport.test.EI1622JMSInboundMessagePollingConsumerTest.testPollingWithSuspensionLimit(EI1622JMSInboundMessagePollingConsumerTest.java:62)

testPollingWithSuspensionLimitAsZero

java.lang.AssertionError: JMS Polling is not permanently suspended though the suspension limit is 0. expected: but was: at org.testng.Assert.fail(Assert.java:89) at org.testng.Assert.failNotEquals(Assert.java:489) at org.testng.Assert.assertTrue(Assert.java:37) at org.wso2.carbon.esb.jms.transport.test.EI1622JMSInboundMessagePollingConsumerTest.testPollingWithSuspensionLimitAsZero(EI1622JMSInboundMessagePollingConsumerTest.java:74)

testMalformedJSONPayloadInFaultySequence

java.lang.AssertionError: The status code set in the faulty sequence is not received expected:<500> but was:<202> at org.testng.Assert.fail(Assert.java:89) at org.testng.Assert.failNotEquals(Assert.java:489) at org.testng.Assert.assertEquals(Assert.java:118) at org.testng.Assert.assertEquals(Assert.java:365) at org.wso2.carbon.esb.json.EI2757MalformedJSONPayloadFaultyTestCase.testMalformedJSONPayloadInFaultySequence(EI2757MalformedJSONPayloadFaultyTestCase.java:44)

Environment Variables(63)18 different
Slave Information(87)11 different
Project Information(15)2 different

Module Builds

 AdminApiHelper (didn’t run)
Success EI Integration Test Admin Clients59 sec
Success WSO2 Enterprise Integrator - Automation Extensions1 min 25 sec
Success WSO2 BPS Samples1 min 5 sec
Success DataServices Clients1 min 20 sec
Success WSO2 Enterprise Integrator - Data Service Hosting Integration Tests51 sec
Success WSO2 DataServices Integration Test52 sec
Success WSO2 DataServices Integration Test Common51 sec
Success WSO2 DataServices Samples Parent52 sec
Success WSO2 Enterprise Integrator - Component Parent52 sec
Success WSO2 Enterprise Integrator - P2 Profile Generation2 min 4 sec
Success WSO2 Enterprise Integrator - Samples Parent51 sec
Success EI Test Common Module1 min 4 sec
Success EI Integration Test Common Utils1 min 13 sec
Success WSO2 Enterprise Integrator - Integration Tests52 sec
Success WSO2 Enterprise Integrator - Feature Aggregator Module51 sec
Success JAX-RS Basic Demo8.5 sec
 WSO2 Enterprise Integrator - Lightweight P2 Profile Generation (didn’t run)
Success Integration Test Module51 sec
Success WSO2 MB - Integration Tests56 sec
Success WSO2 Enterprise Integrator - Mediation Integration Tests51 sec
 WSO2 Enterprise Integrator - micro-integrator P2 Profile Generation (didn’t run)
 WSO2 Enterprise Integrator - microIntegrator P2 Profile Generation (didn’t run)
 WSO2 MSF4J Runtime (didn’t run)
Success WSO2 Business Process Server Integration Tests - HumanTask Coordination11 min
Success Integration Test Reporting1 min 4 sec
Success org.wso2.carbon.ei.migration1 min 12 sec
Success EI test Module - Test Connectors2 min 2 sec
Success EI test Module-mediator-128 min
Unstable EI test Module-mediator-216 min
Success EI test Module-Other16 min
Unstable EI test Module - Test Patches21 min
Success EI Test Module - Platform52 sec
Success EI test Module - Platform - RabbitMQ Transport54 sec
Success EI test Module - Platform - with WSO2MB57 sec
Success EI test Module - Sample9 min 39 sec
Success EI test Module-Service19 min
Success EI test Module-Transport28 min
Success EI test Module - UI57 sec
 WSO2 Enterprise Integrator - Core Component (didn’t run)
 WSO2 Enterprise Integrator - Core Server Feature (didn’t run)
 org.wso2.carbon.micro.integrator.admin.api (didn’t run)
 org.wso2.carbon.micro.integrator.admin.apis (didn’t run)
 org.wso2.carbon.micro.integrator.admin.apis.esb (didn’t run)
 WSO2 Enterprise Integrator - Micro Core Component (didn’t run)
 WSO2 Enterprise Integrator - Micro Extensions (didn’t run)
 org.wso2.carbon.micro.integrator.security (didn’t run)
 WSO2 Enterprise Integrator - Micro server Component (didn’t run)
 WSO2 Enterprise Integrator - Micro Core Server Feature (didn’t run)
Success WSO2 Carbon - Server Administration UI53 sec
Success WSO2 Enterprise Integrator - Admin Console feature55 sec
Success WSO2 Enterprise Integrator - Analytics ELK1 min 34 sec
Success WSO2 Enterprise Integrator - Analytics ELK Feature52 sec
Success WSO2 Enterprise Integrator - Analytics Feature53 sec
Success WSO2 Enterprise Integrator - Analytics Styles51 sec
Success WSO2 Enterprise Integrator Analytics - Styles Features51 sec
Success WSO2 Carbon - BPMN Analytics Core Extension57 sec
Success WSO2 ei bpmn Analytics - UDF58 sec
Success WSO2 EI Message Broker - Dashboard UI51 sec
Success WSO2 EI Broker - Tenant Dashboard UI54 sec
Success WSO2 EI Broker Styles51 sec
Success WSO2 EI Broker - Styles Features58 sec
Success WSO2 EI Business-Process - Tenant Dashboard UI1 min 0 sec
Success WSO2 EI Business-Process - Tenant Dashboard UI51 sec
Success WSO2 EI Business-Process - UI styles51 sec
Success WSO2 EI Business Process - Style Features51 sec
Success WSO2 BPS - Integration Test Common Module55 sec
Success WSO2 BPS - Integration Test Utils54 sec
Success WSO2 Business Process Server Integration Tests - BPS Test Reporting Module55 sec
Success WSO2 Business Process Server Integration Tests - BPEL11 min
Success WSO2 Business Process Server Integration Tests - BPMN8 min 21 sec
Success WSO2 Business Process Server Integration Tests - HumanTask7 min 52 sec
Success WSO2 Business Process Server Tests Patches - BPEL1 min 52 sec
Success WSO2 BPS - Integration UI Pages56 sec
Success admin-clents55 sec
Success integration-test-utils59 sec
Success integration-test-ui-pages54 sec
Success DataService Integration test UI module59 sec
Success org.wso2.ei.integration.test25 min
Success MB AMQP based Test Module2 hr 27 min
Success WSO2 MB - Integration Test Common Module57 sec
Success WSO2 MB - Integration Test Common Utils Module55 sec
Success UI Integration Test Module1 min 1 sec
Success MB Patch based Test Module1 min 41 sec
Success WSO2 MB - platform Test Common Utils Module54 sec
Success WSO2 EI - Samples57 sec
Success WSO2 Enterprise Integrator - Samples Features55 sec
Success WSO2 Enterprise Integrator - Styles59 sec
Success WSO2 Enterprise Integrator - Styles Features1 min 1 sec
Success WSO2 Enterprise Integrator - P2 Profile Module52 sec
Success WSO2 BPS - Tools1 min 19 sec
Success WSO2 BPS - Client for Samples53 sec
Success WSO2 BPS - Utilities for Samples56 sec
Success WSO2 BPS - Sample Utilities and Jars to use with BPS Testing51 sec
Success MB Server Test Module1 min 43 sec
Success EI Test Service Module1 min 57 sec
Success EI Integration Test UI Pages1 min 5 sec
 WSO2 Enterprise Integrator - Analytics P2 Profile Generation (didn’t run)
Success >WSO2 Enterprise Integrator - Analytics Profile Generation2 min 10 sec
Success WSO2 BPS - Integration Parent51 sec
Success WSO2 BPS - Integration Parent51 sec
Success WSO2 BPS - Integration Parent51 sec
Success WSO2 BPS - Integration Parent51 sec
Success WSO2 BPS - P2 Profile Generation1 min 27 sec
Success WSO2 BPS - Distribution Parent51 sec
Success WSO2 Broker - P2 Profile Generation1 min 20 sec
Success WSO2 Enterprise Integrator - Distribution2 min 13 sec
Success WSO2 Enterprise Integrator1 min 21 sec
Success WSO2 Enterprise Integrator - Web App Samples14 sec