Started 4 days 20 hr ago
Took 6 hr 29 min on ECS_PRODUCTION-1fab186788d40d

Unstable Build #203 (Jan 13, 2022 7:30:10 PM)

Build Artifacts
update.zip18.36 MB view
wso2ei-6.7.0-SNAPSHOT.zip519.17 MB view
No changes.

Started by timer

Revision: 1247f7dd7837122a1b224dc342f28eab2c282291
  • refs/remotes/origin/master
Test Result (6 failures / -2)Show all failed tests >>>
Jacoco - Overall Coverage Summary
INSTRUCTION0%
BRANCH0%
COMPLEXITY0%
LINE0%
METHOD0%
CLASS0%

Identified problems

testMessagesInMessageProcessor

java.lang.AssertionError: Message Processor : mspAdminTestInMemoryMessageProcessor did not de-activate after failed delivery attempts with OUT_ONLY property. expected: but was: at org.testng.Assert.fail(Assert.java:89) at org.testng.Assert.failNotEquals(Assert.java:489) at org.testng.Assert.assertFalse(Assert.java:58) at org.wso2.carbon.esb.message.processor.test.MessageProcessorAdminTestCase.testMessagesInMessageProcessor(MessageProcessorAdminTestCase.java:191)

xsltTransformationFromUrl

org.apache.axis2.AxisFault: org.apache.synapse.SynapseException: Content-Type:text/xml; charset=UTF-8,Host:localhost:8480,SOAPAction:"urn:getQuote", Unexpected error sending message back at org.apache.axis2.util.Utils.getInboundFaultFromMessageContext(Utils.java:531) at org.apache.axis2.description.OutInAxisOperationClient.handleResponse(OutInAxisOperation.java:382) at org.apache.axis2.description.OutInAxisOperationClient.send(OutInAxisOperation.java:457) at org.apache.axis2.description.OutInAxisOperationClient.executeImpl(OutInAxisOperation.java:228) at org.apache.axis2.client.OperationClient.execute(OperationClient.java:149) at org.apache.axis2.client.ServiceClient.sendReceive(ServiceClient.java:554) at org.apache.axis2.client.ServiceClient.sendReceive(ServiceClient.java:530) at org.wso2.esb.integration.common.utils.clients.stockquoteclient.StockQuoteClient.sendCustomQuoteRequest(StockQuoteClient.java:166) at org.wso2.carbon.esb.mediator.test.xslt.XsltTransformationFromUrlTestCase.xsltTransformationFromUrl(XsltTransformationFromUrlTestCase.java:42)

testPreserveContentTypeHeader

java.lang.AssertionError: Response header modified at org.junit.Assert.fail(Assert.java:88) at org.junit.Assert.assertTrue(Assert.java:41) at org.wso2.carbon.esb.passthru.transport.test.PreseveResponseHeaderTestCase.testPreserveContentTypeHeader(PreseveResponseHeaderTestCase.java:57)

testPollingWithSuspensionLimit

java.lang.AssertionError: JMS Polling suspension is not enabled. expected: but was: at org.testng.Assert.fail(Assert.java:89) at org.testng.Assert.failNotEquals(Assert.java:489) at org.testng.Assert.assertTrue(Assert.java:37) at org.wso2.carbon.esb.jms.transport.test.EI1622JMSInboundMessagePollingConsumerTest.testPollingWithSuspensionLimit(EI1622JMSInboundMessagePollingConsumerTest.java:62)

testPollingWithSuspensionLimitAsZero

java.lang.AssertionError: JMS Polling is not permanently suspended though the suspension limit is 0. expected: but was: at org.testng.Assert.fail(Assert.java:89) at org.testng.Assert.failNotEquals(Assert.java:489) at org.testng.Assert.assertTrue(Assert.java:37) at org.wso2.carbon.esb.jms.transport.test.EI1622JMSInboundMessagePollingConsumerTest.testPollingWithSuspensionLimitAsZero(EI1622JMSInboundMessagePollingConsumerTest.java:74)

testMalformedJSONPayloadInFaultySequence

java.lang.AssertionError: The status code set in the faulty sequence is not received expected:<500> but was:<202> at org.testng.Assert.fail(Assert.java:89) at org.testng.Assert.failNotEquals(Assert.java:489) at org.testng.Assert.assertEquals(Assert.java:118) at org.testng.Assert.assertEquals(Assert.java:365) at org.wso2.carbon.esb.json.EI2757MalformedJSONPayloadFaultyTestCase.testMalformedJSONPayloadInFaultySequence(EI2757MalformedJSONPayloadFaultyTestCase.java:44)

Environment Variables(63)17 different
Slave Information(87)9 different
Project Information(15)0 different

Module Builds

Success EI Integration Test Admin Clients11 sec
Success WSO2 Enterprise Integrator - Automation Extensions31 sec
Success WSO2 BPS Samples11 sec
Success DataServices Clients27 sec
Success WSO2 Enterprise Integrator - Data Service Hosting Integration Tests3 sec
Success WSO2 DataServices Integration Test0.58 sec
Success WSO2 DataServices Integration Test Common0.76 sec
Success WSO2 DataServices Samples Parent8.3 sec
Success WSO2 Enterprise Integrator - Component Parent0.6 sec
Success WSO2 Enterprise Integrator - P2 Profile Generation1 min 19 sec
Success WSO2 Enterprise Integrator - Samples Parent5.3 sec
Success EI Test Common Module11 sec
Success EI Integration Test Common Utils13 sec
Success WSO2 Enterprise Integrator - Integration Tests1 sec
Success WSO2 Enterprise Integrator - Feature Aggregator Module0.52 sec
Success JAX-RS Basic Demo8.5 sec
 WSO2 Enterprise Integrator - Lightweight P2 Profile Generation (didn’t run)
Success Integration Test Module1.6 sec
Success WSO2 MB - Integration Tests4.1 sec
Success WSO2 Enterprise Integrator - Mediation Integration Tests6.7 sec
 WSO2 Enterprise Integrator - micro-integrator P2 Profile Generation (didn’t run)
 WSO2 MSF4J Runtime (didn’t run)
Success WSO2 Business Process Server Integration Tests - HumanTask Coordination10 min
Success Integration Test Reporting19 sec
Success org.wso2.carbon.ei.migration18 sec
Success EI test Module - Test Connectors1 min 17 sec
Success EI test Module-mediator-127 min
Unstable EI test Module-mediator-215 min
Success EI test Module-Other15 min
Unstable EI test Module - Test Patches20 min
Success EI Test Module - Platform0.58 sec
Success EI test Module - Platform - RabbitMQ Transport3.3 sec
Success EI test Module - Platform - with WSO2MB9.2 sec
Success EI test Module - Sample8 min 47 sec
Success EI test Module-Service19 min
Success EI test Module-Transport27 min
Success EI test Module - UI5.6 sec
 WSO2 Enterprise Integrator - Core Component (didn’t run)
 WSO2 Enterprise Integrator - Core Server Feature (didn’t run)
 WSO2 Enterprise Integrator - Micro Core Component (didn’t run)
 org.wso2.carbon.micro.integrator.security (didn’t run)
 WSO2 Enterprise Integrator - Micro server Component (didn’t run)
 WSO2 Enterprise Integrator - Micro Core Server Feature (didn’t run)
Success WSO2 Carbon - Server Administration UI3 sec
Success WSO2 Enterprise Integrator - Admin Console feature5.9 sec
Success WSO2 Enterprise Integrator - Analytics ELK51 sec
Success WSO2 Enterprise Integrator - Analytics ELK Feature8.1 sec
Success WSO2 Enterprise Integrator - Analytics Feature7.6 sec
Success WSO2 Enterprise Integrator - Analytics Styles1 sec
Success WSO2 Enterprise Integrator Analytics - Styles Features4.2 sec
Success WSO2 Carbon - BPMN Analytics Core Extension22 sec
Success WSO2 ei bpmn Analytics - UDF2.9 sec
Success WSO2 EI Message Broker - Dashboard UI6.7 sec
Success WSO2 EI Broker - Tenant Dashboard UI1.3 sec
Success WSO2 EI Broker Styles1.8 sec
Success WSO2 EI Broker - Styles Features9.7 sec
Success WSO2 EI Business-Process - Tenant Dashboard UI9.6 sec
Success WSO2 EI Business-Process - Tenant Dashboard UI1.4 sec
Success WSO2 EI Business-Process - UI styles1.3 sec
Success WSO2 EI Business Process - Style Features0.8 sec
Success WSO2 BPS - Integration Test Common Module8.6 sec
Success WSO2 BPS - Integration Test Utils2.8 sec
Success WSO2 Business Process Server Integration Tests - BPS Test Reporting Module1.1 sec
Success WSO2 Business Process Server Integration Tests - BPEL10 min
Success WSO2 Business Process Server Integration Tests - BPMN7 min 32 sec
Success WSO2 Business Process Server Integration Tests - HumanTask7 min 10 sec
Success WSO2 Business Process Server Tests Patches - BPEL2 min 0 sec
Success WSO2 BPS - Integration UI Pages11 sec
Success admin-clents3.7 sec
Success integration-test-utils6.6 sec
Success integration-test-ui-pages3.8 sec
Success DataService Integration test UI module8.8 sec
Success org.wso2.ei.integration.test25 min
Success MB AMQP based Test Module2 hr 26 min
Success WSO2 MB - Integration Test Common Module5.9 sec
Success WSO2 MB - Integration Test Common Utils Module5.9 sec
Success UI Integration Test Module9.9 sec
Success MB Patch based Test Module57 sec
Success WSO2 MB - platform Test Common Utils Module8.9 sec
Success WSO2 EI - Samples11 sec
Success WSO2 Enterprise Integrator - Samples Features7 sec
Success WSO2 Enterprise Integrator - Styles8.8 sec
Success WSO2 Enterprise Integrator - Styles Features10 sec
Success WSO2 Enterprise Integrator - P2 Profile Module0.64 sec
Success WSO2 BPS - Tools36 sec
Success WSO2 BPS - Client for Samples10 sec
Success WSO2 BPS - Utilities for Samples8.3 sec
Success WSO2 BPS - Sample Utilities and Jars to use with BPS Testing0.46 sec
Success MB Server Test Module35 sec
Success EI Test Service Module8.4 sec
Success EI Integration Test UI Pages12 sec
 WSO2 Enterprise Integrator - Analytics P2 Profile Generation (didn’t run)
Success >WSO2 Enterprise Integrator - Analytics Profile Generation2 min 2 sec
Success WSO2 BPS - Integration Parent2.6 sec
Success WSO2 BPS - Integration Parent1.4 sec
Success WSO2 BPS - Integration Parent3.2 sec
Success WSO2 BPS - Integration Parent0.48 sec
Success WSO2 BPS - P2 Profile Generation33 sec
Success WSO2 BPS - Distribution Parent0.68 sec
Success WSO2 Broker - P2 Profile Generation31 sec
Success WSO2 Enterprise Integrator - Distribution1 min 11 sec
Success WSO2 Enterprise Integrator7.9 sec
Success WSO2 Enterprise Integrator - Web App Samples1.9 sec