Started 23 days ago
Took 6 hr 22 min on ECS_PRODUCTION-1a90d565268280

Unstable Build #871 (Dec 28, 2021 4:32:39 AM)

Build Artifacts
update.zip18.36 MB view
wso2ei-6.7.0-SNAPSHOT.zip519.17 MB view
No changes.

Started by timer

Revision: 92910c1f4b7f6b5be2ea9687d7fa2a8b9d524392
  • refs/remotes/origin/master
Test Result (4 failures / ±0)Show all failed tests >>>
Jacoco - Overall Coverage Summary
INSTRUCTION0%
BRANCH0%
COMPLEXITY0%
LINE0%
METHOD0%
CLASS0%

Identified problems

testMessagesInMessageProcessor

java.lang.AssertionError: Message Processor : mspAdminTestInMemoryMessageProcessor did not de-activate after failed delivery attempts with OUT_ONLY property. expected: but was: at org.testng.Assert.fail(Assert.java:89) at org.testng.Assert.failNotEquals(Assert.java:489) at org.testng.Assert.assertFalse(Assert.java:58) at org.wso2.carbon.esb.message.processor.test.MessageProcessorAdminTestCase.testMessagesInMessageProcessor(MessageProcessorAdminTestCase.java:191)

xsltTransformationFromUrl

org.apache.axis2.AxisFault: org.apache.synapse.SynapseException: Content-Type:text/xml; charset=UTF-8,Host:localhost:8480,SOAPAction:"urn:getQuote", Unexpected error sending message back at org.apache.axis2.util.Utils.getInboundFaultFromMessageContext(Utils.java:531) at org.apache.axis2.description.OutInAxisOperationClient.handleResponse(OutInAxisOperation.java:382) at org.apache.axis2.description.OutInAxisOperationClient.send(OutInAxisOperation.java:457) at org.apache.axis2.description.OutInAxisOperationClient.executeImpl(OutInAxisOperation.java:228) at org.apache.axis2.client.OperationClient.execute(OperationClient.java:149) at org.apache.axis2.client.ServiceClient.sendReceive(ServiceClient.java:554) at org.apache.axis2.client.ServiceClient.sendReceive(ServiceClient.java:530) at org.wso2.esb.integration.common.utils.clients.stockquoteclient.StockQuoteClient.sendCustomQuoteRequest(StockQuoteClient.java:166) at org.wso2.carbon.esb.mediator.test.xslt.XsltTransformationFromUrlTestCase.xsltTransformationFromUrl(XsltTransformationFromUrlTestCase.java:42)

testPreserveContentTypeHeader

java.lang.AssertionError: Response header modified at org.junit.Assert.fail(Assert.java:88) at org.junit.Assert.assertTrue(Assert.java:41) at org.wso2.carbon.esb.passthru.transport.test.PreseveResponseHeaderTestCase.testPreserveContentTypeHeader(PreseveResponseHeaderTestCase.java:57)

testMalformedJSONPayloadInFaultySequence

java.lang.AssertionError: The status code set in the faulty sequence is not received expected:<500> but was:<202> at org.testng.Assert.fail(Assert.java:89) at org.testng.Assert.failNotEquals(Assert.java:489) at org.testng.Assert.assertEquals(Assert.java:118) at org.testng.Assert.assertEquals(Assert.java:365) at org.wso2.carbon.esb.json.EI2757MalformedJSONPayloadFaultyTestCase.testMalformedJSONPayloadInFaultySequence(EI2757MalformedJSONPayloadFaultyTestCase.java:44)

Environment Variables(69)16 different
Slave Information(87)9 different
Project Information(15)0 different

Module Builds

 WSO2 BPS - HumanTaskWebApp (didn’t run)
 AdminApiHelper (didn’t run)
Success EI Integration Test Admin Clients9.5 sec
Success WSO2 Enterprise Integrator - Automation Extensions38 sec
 WSO2 BPS - BPEL Event Listener (didn’t run)
 WSO2 BPS - BPEL Extension (didn’t run)
 WSO2 BPS - BPEL Property Reader Extension (didn’t run)
Success WSO2 BPS Samples11 sec
Success DataServices Clients25 sec
Success WSO2 Enterprise Integrator - Data Service Hosting Integration Tests0.68 sec
Success WSO2 DataServices Integration Test1.4 sec
Success WSO2 DataServices Integration Test Common1.7 sec
Success WSO2 DataServices Samples Parent2.3 sec
Success WSO2 Enterprise Integrator - Component Parent3.1 sec
Success WSO2 Enterprise Integrator - P2 Profile Generation1 min 11 sec
Success WSO2 Enterprise Integrator - Samples Parent0.7 sec
 WSO2 BPS - HumanTask Event Listener (didn’t run)
Success EI Test Common Module15 sec
Success EI Integration Test Common Utils14 sec
Success WSO2 Enterprise Integrator - Integration Tests0.66 sec
Success WSO2 Enterprise Integrator - Feature Aggregator Module0.71 sec
Success JAX-RS Basic Demo7.9 sec
 WSO2 Enterprise Integrator - Lightweight P2 Profile Generation (didn’t run)
Success Integration Test Module1.6 sec
Success WSO2 MB - Integration Tests15 sec
Success WSO2 Enterprise Integrator - Mediation Integration Tests0.79 sec
 WSO2 Enterprise Integrator - micro-integrator P2 Profile Generation (didn’t run)
 WSO2 Enterprise Integrator - microIntegrator P2 Profile Generation (didn’t run)
 WSO2 MSF4J Runtime (didn’t run)
 WSO2 MSF4J Runtime (didn’t run)
 WSO2 BPS - Integration Test Common Module (didn’t run)
 WSO2 BPS - Integration Test Utils (didn’t run)
 WSO2 Business Process Server Integration Tests - BPS Test Reporting Module (didn’t run)
 WSO2 Business Process Server Integration Tests - BPEL (didn’t run)
 WSO2 Business Process Server Integration Tests - BPMN (didn’t run)
 WSO2 Business Process Server Integration Tests - HumanTask (didn’t run)
 WSO2 Business Process Server Tests Patches - BPEL (didn’t run)
Success WSO2 Business Process Server Integration Tests - HumanTask Coordination10 min
 WSO2 BPS - Integration UI Pages (didn’t run)
Success Integration Test Reporting13 sec
Success org.wso2.carbon.ei.migration9.9 sec
Success EI test Module - Test Connectors1 min 17 sec
Success EI test Module-mediator-127 min
Unstable EI test Module-mediator-215 min
Success EI test Module-Other15 min
Unstable EI test Module - Test Patches20 min
Success EI Test Module - Platform0.55 sec
Success EI test Module - Platform - RabbitMQ Transport8.9 sec
Success EI test Module - Platform - with WSO2MB13 sec
Success EI test Module - Sample8 min 53 sec
Success EI test Module-Service18 min
Success EI test Module-Transport27 min
Success EI test Module - UI11 sec
 WSO2 Enterprise Integrator - Core Component (didn’t run)
 WSO2 Enterprise Integrator - Core Server Feature (didn’t run)
 org.wso2.carbon.micro.integrator.admin.api (didn’t run)
 org.wso2.carbon.micro.integrator.admin.apis (didn’t run)
 org.wso2.carbon.micro.integrator.admin.apis.esb (didn’t run)
 WSO2 Enterprise Integrator - Micro Core Component (didn’t run)
 WSO2 Enterprise Integrator - Micro Extensions (didn’t run)
 org.wso2.carbon.micro.integrator.security (didn’t run)
 WSO2 Enterprise Integrator - Micro server Component (didn’t run)
 WSO2 Enterprise Integrator - Micro Core Server Feature (didn’t run)
Success WSO2 Carbon - Server Administration UI3.2 sec
Success WSO2 Enterprise Integrator - Admin Console feature1 sec
Success WSO2 Enterprise Integrator - Analytics ELK53 sec
Success WSO2 Enterprise Integrator - Analytics ELK Feature2.4 sec
Success WSO2 Enterprise Integrator - Analytics Feature3.3 sec
Success WSO2 Enterprise Integrator - Analytics Styles1.3 sec
Success WSO2 Enterprise Integrator Analytics - Styles Features2.6 sec
Success WSO2 Carbon - BPMN Analytics Core Extension7.3 sec
Success WSO2 ei bpmn Analytics - UDF3.8 sec
Success WSO2 EI Message Broker - Dashboard UI3.6 sec
Success WSO2 EI Broker - Tenant Dashboard UI4.2 sec
Success WSO2 EI Broker Styles1.7 sec
Success WSO2 EI Broker - Styles Features1.2 sec
Success WSO2 EI Business-Process - Tenant Dashboard UI14 sec
Success WSO2 EI Business-Process - Tenant Dashboard UI1.3 sec
Success WSO2 EI Business-Process - UI styles1 sec
Success WSO2 EI Business Process - Style Features2.4 sec
Success WSO2 BPS - Integration Test Common Module14 sec
Success WSO2 BPS - Integration Test Utils19 sec
Success WSO2 Business Process Server Integration Tests - BPS Test Reporting Module1.6 sec
Success WSO2 Business Process Server Integration Tests - BPEL10 min
Success WSO2 Business Process Server Integration Tests - BPMN7 min 36 sec
Success WSO2 Business Process Server Integration Tests - HumanTask7 min 3 sec
Success WSO2 Business Process Server Tests Patches - BPEL1 min 8 sec
Success WSO2 BPS - Integration UI Pages10 sec
Success admin-clents9.4 sec
Success integration-test-utils4.5 sec
Success integration-test-ui-pages9.7 sec
Success DataService Integration test UI module3.3 sec
Success org.wso2.ei.integration.test25 min
Success MB AMQP based Test Module2 hr 25 min
Success WSO2 MB - Integration Test Common Module6.9 sec
Success WSO2 MB - Integration Test Common Utils Module10 sec
Success UI Integration Test Module4.3 sec
Success MB Patch based Test Module48 sec
Success WSO2 MB - platform Test Common Utils Module8.6 sec
Success WSO2 EI - Samples7.1 sec
Success WSO2 Enterprise Integrator - Samples Features1.6 sec
Success WSO2 Enterprise Integrator - Styles4.2 sec
Success WSO2 Enterprise Integrator - Styles Features6.4 sec
Success WSO2 Enterprise Integrator - P2 Profile Module0.69 sec
Success WSO2 BPS - Tools41 sec
Success WSO2 BPS - Client for Samples4.5 sec
Success WSO2 BPS - Utilities for Samples4.4 sec
Success WSO2 BPS - Sample Utilities and Jars to use with BPS Testing2.7 sec
Success MB Server Test Module37 sec
Success EI Test Service Module4 sec
Success EI Integration Test UI Pages10 sec
 WSO2 Enterprise Integrator - Analytics P2 Profile Generation (didn’t run)
Success >WSO2 Enterprise Integrator - Analytics Profile Generation2 min 21 sec
Success WSO2 BPS - Integration Parent4.5 sec
Success WSO2 BPS - Integration Parent1.1 sec
Success WSO2 BPS - Integration Parent0.8 sec
Success WSO2 BPS - Integration Parent1.3 sec
Success WSO2 BPS - P2 Profile Generation36 sec
Success WSO2 BPS - Distribution Parent0.66 sec
Success WSO2 Broker - P2 Profile Generation25 sec
Success WSO2 Enterprise Integrator - Distribution1 min 15 sec
Success WSO2 Enterprise Integrator14 sec
Success WSO2 Enterprise Integrator - Web App Samples2.5 sec
 WSO2 MSF4J Runtime (didn’t run)