Started 9 mo 6 days ago
Took 1 hr 58 min on ECS_PRODUCTION-8c91fcf1862b1d

Unstable Build #539 (Apr 16, 2021 5:43:50 PM)

Build Artifacts
wso2mi-4.0.1-SNAPSHOT.zip155.53 MB view
No changes.

Started by user Srivathsan Shanmuganathan

Revision: 1b27b4551c023c033d118cabf768dac7afd87643
  • refs/remotes/origin/master-int-test
Test Result (11 failures / -12)Show all failed tests >>>
Jacoco - Overall Coverage Summary
INSTRUCTION0%
BRANCH0%
COMPLEXITY0%
LINE0%
METHOD0%
CLASS0%

Identified problems

invokeServiceFromXmlRequest

org.apache.axis2.AxisFault: peer not authenticated at org.apache.axis2.AxisFault.makeFault(AxisFault.java:430) at org.apache.axis2.transport.http.HTTPSender.sendViaPost(HTTPSender.java:227) at org.apache.axis2.transport.http.HTTPSender.send(HTTPSender.java:82) at org.apache.axis2.transport.http.CommonsHTTPTransportSender.writeMessageWithCommons(CommonsHTTPTransportSender.java:459) at org.apache.axis2.transport.http.CommonsHTTPTransportSender.invoke(CommonsHTTPTransportSender.java:286) at org.apache.axis2.engine.AxisEngine.send(AxisEngine.java:442) at org.apache.axis2.description.OutInAxisOperationClient.send(OutInAxisOperation.java:449) at org.apache.axis2.description.OutInAxisOperationClient.executeImpl(OutInAxisOperation.java:235) at org.apache.axis2.client.OperationClient.execute(OperationClient.java:149) at org.apache.axis2.client.ServiceClient.sendRobust(ServiceClient.java:474) at org.apache.axis2.client.ServiceClient.sendRobust(ServiceClient.java:455) at org.wso2.carbon.esb.mediator.test.payload.factory.PayloadFormatValueAndExpressionTestCase.invokeServiceFromXmlRequest(PayloadFormatValueAndExpressionTestCase.java:58) Caused by: javax.net.ssl.SSLPeerUnverifiedException: peer not authenticated at java.base/sun.security.ssl.SSLSessionImpl.getPeerCertificates(SSLSessionImpl.java:558) at org.apache.commons.httpclient.protocol.SSLProtocolSocketFactory.verifyHostName(SSLProtocolSocketFactory.java:276) at org.apache.commons.httpclient.protocol.SSLProtocolSocketFactory.createSocket(SSLProtocolSocketFactory.java:186) at org.apache.commons.httpclient.HttpConnection.open(HttpConnection.java:707) at org.apache.commons.httpclient.MultiThreadedHttpConnectionManager$HttpConnectionAdapter.open(MultiThreadedHttpConnectionManager.java:1361) at org.apache.commons.httpclient.HttpMethodDirector.executeWithRetry(HttpMethodDirector.java:387) at org.apache.commons.httpclient.HttpMethodDirector.executeMethod(HttpMethodDirector.java:171) at org.apache.commons.httpclient.HttpClient.executeMethod(HttpClient.java:397) at org.apache.axis2.transport.http.AbstractHTTPSender.executeMethod(AbstractHTTPSender.java:717) at org.apache.axis2.transport.http.HTTPSender.sendViaPost(HTTPSender.java:223) ... 44 more

checkOnCompleteExecutionInClone

org.apache.axis2.AxisFault: peer not authenticated at org.apache.axis2.AxisFault.makeFault(AxisFault.java:430) at org.apache.axis2.transport.http.HTTPSender.sendViaPost(HTTPSender.java:227) at org.apache.axis2.transport.http.HTTPSender.send(HTTPSender.java:82) at org.apache.axis2.transport.http.CommonsHTTPTransportSender.writeMessageWithCommons(CommonsHTTPTransportSender.java:459) at org.apache.axis2.transport.http.CommonsHTTPTransportSender.invoke(CommonsHTTPTransportSender.java:286) at org.apache.axis2.engine.AxisEngine.send(AxisEngine.java:442) at org.apache.axis2.description.OutInAxisOperationClient.send(OutInAxisOperation.java:449) at org.apache.axis2.description.OutInAxisOperationClient.executeImpl(OutInAxisOperation.java:235) at org.apache.axis2.client.OperationClient.execute(OperationClient.java:149) at org.apache.axis2.client.ServiceClient.sendReceive(ServiceClient.java:554) at org.apache.axis2.client.ServiceClient.sendReceive(ServiceClient.java:530) at org.wso2.esb.integration.common.utils.clients.stockquoteclient.StockQuoteClient.send(StockQuoteClient.java:172) at org.wso2.carbon.esb.mediator.test.aggregate.ESBJAVA4792AggregateTimeoutTestCase.checkOnCompleteExecutionInClone(ESBJAVA4792AggregateTimeoutTestCase.java:75) Caused by: javax.net.ssl.SSLPeerUnverifiedException: peer not authenticated at java.base/sun.security.ssl.SSLSessionImpl.getPeerCertificates(SSLSessionImpl.java:558) at org.apache.commons.httpclient.protocol.SSLProtocolSocketFactory.verifyHostName(SSLProtocolSocketFactory.java:276) at org.apache.commons.httpclient.protocol.SSLProtocolSocketFactory.createSocket(SSLProtocolSocketFactory.java:186) at org.apache.commons.httpclient.HttpConnection.open(HttpConnection.java:707) at org.apache.commons.httpclient.MultiThreadedHttpConnectionManager$HttpConnectionAdapter.open(MultiThreadedHttpConnectionManager.java:1361) at org.apache.commons.httpclient.HttpMethodDirector.executeWithRetry(HttpMethodDirector.java:387) at org.apache.commons.httpclient.HttpMethodDirector.executeMethod(HttpMethodDirector.java:171) at org.apache.commons.httpclient.HttpClient.executeMethod(HttpClient.java:397) at org.apache.axis2.transport.http.AbstractHTTPSender.executeMethod(AbstractHTTPSender.java:717) at org.apache.axis2.transport.http.HTTPSender.sendViaPost(HTTPSender.java:223) ... 45 more

testEmptyBodyWithHttpStatusCodeOk

java.lang.AssertionError: expected [200] but found [202] at org.testng.Assert.fail(Assert.java:93) at org.testng.Assert.failNotEquals(Assert.java:512) at org.testng.Assert.assertEqualsImpl(Assert.java:134) at org.testng.Assert.assertEquals(Assert.java:115) at org.testng.Assert.assertEquals(Assert.java:388) at org.testng.Assert.assertEquals(Assert.java:398) at org.wso2.carbon.esb.passthru.transport.test.TestEmptyBodyResponseInBlockingMode.testEmptyBodyWithHttpStatusCodeOk(TestEmptyBodyResponseInBlockingMode.java:56)

stop

java.lang.NullPointerException at org.wso2.carbon.esb.passthru.transport.test.ESBJAVA3336HostHeaderValuePortCheckTestCase.stop(ESBJAVA3336HostHeaderValuePortCheckTestCase.java:71)

setEnvironment

org.apache.synapse.SynapseException: Error updating the log-level of synapse-transport-http-wire logger at org.wso2.esb.integration.common.utils.ESBIntegrationTest.configureHTTPWireLogs(ESBIntegrationTest.java:1129) at org.wso2.carbon.esb.passthru.transport.test.ESBJAVA3336HostHeaderValuePortCheckTestCase.setEnvironment(ESBJAVA3336HostHeaderValuePortCheckTestCase.java:45) Caused by: javax.net.ssl.SSLHandshakeException: Invalid ECDH ServerKeyExchange signature at java.base/sun.security.ssl.Alert.createSSLException(Alert.java:131) at java.base/sun.security.ssl.Alert.createSSLException(Alert.java:117) at java.base/sun.security.ssl.TransportContext.fatal(TransportContext.java:307) at java.base/sun.security.ssl.TransportContext.fatal(TransportContext.java:263) at java.base/sun.security.ssl.TransportContext.fatal(TransportContext.java:254) at java.base/sun.security.ssl.ECDHServerKeyExchange$ECDHServerKeyExchangeMessage.(ECDHServerKeyExchange.java:325) at java.base/sun.security.ssl.ECDHServerKeyExchange$ECDHServerKeyExchangeConsumer.consume(ECDHServerKeyExchange.java:531) at java.base/sun.security.ssl.ServerKeyExchange$ServerKeyExchangeConsumer.consume(ServerKeyExchange.java:111) at java.base/sun.security.ssl.SSLHandshake.consume(SSLHandshake.java:392) at java.base/sun.security.ssl.HandshakeContext.dispatch(HandshakeContext.java:443) at java.base/sun.security.ssl.HandshakeContext.dispatch(HandshakeContext.java:421) at java.base/sun.security.ssl.TransportContext.dispatch(TransportContext.java:177) at java.base/sun.security.ssl.SSLTransport.decode(SSLTransport.java:164) at java.base/sun.security.ssl.SSLSocketImpl.decode(SSLSocketImpl.java:1152) at java.base/sun.security.ssl.SSLSocketImpl.readHandshakeRecord(SSLSocketImpl.java:1063) at java.base/sun.security.ssl.SSLSocketImpl.startHandshake(SSLSocketImpl.java:402) at org.apache.http.conn.ssl.SSLSocketFactory.connectSocket(SSLSocketFactory.java:533) at org.apache.http.conn.ssl.SSLSocketFactory.connectSocket(SSLSocketFactory.java:401) at org.apache.http.impl.conn.DefaultClientConnectionOperator.openConnection(DefaultClientConnectionOperator.java:177) at org.apache.http.impl.conn.AbstractPoolEntry.open(AbstractPoolEntry.java:144) at org.apache.http.impl.conn.AbstractPooledConnAdapter.open(AbstractPooledConnAdapter.java:131) at org.apache.http.impl.client.DefaultRequestDirector.tryConnect(DefaultRequestDirector.java:610) at org.apache.http.impl.client.DefaultRequestDirector.execute(DefaultRequestDirector.java:445) at org.apache.http.impl.client.AbstractHttpClient.doExecute(AbstractHttpClient.java:863) at org.apache.http.impl.client.CloseableHttpClient.execute(CloseableHttpClient.java:82) at org.apache.http.impl.client.CloseableHttpClient.execute(CloseableHttpClient.java:106) at org.wso2.esb.integration.common.utils.clients.SimpleHttpClient.doPatch(SimpleHttpClient.java:196) at org.wso2.esb.integration.common.utils.ESBIntegrationTest.configureHTTPWireLogs(ESBIntegrationTest.java:1127) ... 35 more

testCalloutJMSHeaders

org.apache.axis2.AxisFault: AxisFault while getting response :peer not authenticated at org.wso2.esb.integration.common.utils.clients.axis2client.AxisServiceClient.sendRobust(AxisServiceClient.java:152) at org.wso2.carbon.esb.jms.transport.test.ESBJAVA4692_MP_FaultSequence_HttpsEndpoint_TestCase.testCalloutJMSHeaders(ESBJAVA4692_MP_FaultSequence_HttpsEndpoint_TestCase.java:42) Caused by: org.apache.axis2.AxisFault: peer not authenticated at org.apache.axis2.AxisFault.makeFault(AxisFault.java:430) at org.apache.axis2.transport.http.HTTPSender.sendViaPost(HTTPSender.java:227) at org.apache.axis2.transport.http.HTTPSender.send(HTTPSender.java:82) at org.apache.axis2.transport.http.CommonsHTTPTransportSender.writeMessageWithCommons(CommonsHTTPTransportSender.java:459) at org.apache.axis2.transport.http.CommonsHTTPTransportSender.invoke(CommonsHTTPTransportSender.java:286) at org.apache.axis2.engine.AxisEngine.send(AxisEngine.java:442) at org.apache.axis2.description.OutInAxisOperationClient.send(OutInAxisOperation.java:449) at org.apache.axis2.description.OutInAxisOperationClient.executeImpl(OutInAxisOperation.java:235) at org.apache.axis2.client.OperationClient.execute(OperationClient.java:149) at org.apache.axis2.client.ServiceClient.sendRobust(ServiceClient.java:474) at org.apache.axis2.client.ServiceClient.sendRobust(ServiceClient.java:455) at org.wso2.esb.integration.common.utils.clients.axis2client.AxisServiceClient.sendRobust(AxisServiceClient.java:148) ... 35 more Caused by: javax.net.ssl.SSLPeerUnverifiedException: peer not authenticated at java.base/sun.security.ssl.SSLSessionImpl.getPeerCertificates(SSLSessionImpl.java:558) at org.apache.commons.httpclient.protocol.SSLProtocolSocketFactory.verifyHostName(SSLProtocolSocketFactory.java:276) at org.apache.commons.httpclient.protocol.SSLProtocolSocketFactory.createSocket(SSLProtocolSocketFactory.java:186) at org.apache.commons.httpclient.HttpConnection.open(HttpConnection.java:707) at org.apache.commons.httpclient.MultiThreadedHttpConnectionManager$HttpConnectionAdapter.open(MultiThreadedHttpConnectionManager.java:1361) at org.apache.commons.httpclient.HttpMethodDirector.executeWithRetry(HttpMethodDirector.java:387) at org.apache.commons.httpclient.HttpMethodDirector.executeMethod(HttpMethodDirector.java:171) at org.apache.commons.httpclient.HttpClient.executeMethod(HttpClient.java:397) at org.apache.axis2.transport.http.AbstractHTTPSender.executeMethod(AbstractHTTPSender.java:717) at org.apache.axis2.transport.http.HTTPSender.sendViaPost(HTTPSender.java:223) ... 45 more

testEndpointDeployed

javax.net.ssl.SSLHandshakeException: Invalid ECDH ServerKeyExchange signature at java.base/sun.security.ssl.Alert.createSSLException(Alert.java:131) at java.base/sun.security.ssl.Alert.createSSLException(Alert.java:117) at java.base/sun.security.ssl.TransportContext.fatal(TransportContext.java:307) at java.base/sun.security.ssl.TransportContext.fatal(TransportContext.java:263) at java.base/sun.security.ssl.TransportContext.fatal(TransportContext.java:254) at java.base/sun.security.ssl.ECDHServerKeyExchange$ECDHServerKeyExchangeMessage.(ECDHServerKeyExchange.java:325) at java.base/sun.security.ssl.ECDHServerKeyExchange$ECDHServerKeyExchangeConsumer.consume(ECDHServerKeyExchange.java:531) at java.base/sun.security.ssl.ServerKeyExchange$ServerKeyExchangeConsumer.consume(ServerKeyExchange.java:111) at java.base/sun.security.ssl.SSLHandshake.consume(SSLHandshake.java:392) at java.base/sun.security.ssl.HandshakeContext.dispatch(HandshakeContext.java:443) at java.base/sun.security.ssl.HandshakeContext.dispatch(HandshakeContext.java:421) at java.base/sun.security.ssl.TransportContext.dispatch(TransportContext.java:177) at java.base/sun.security.ssl.SSLTransport.decode(SSLTransport.java:164) at java.base/sun.security.ssl.SSLSocketImpl.decode(SSLSocketImpl.java:1152) at java.base/sun.security.ssl.SSLSocketImpl.readHandshakeRecord(SSLSocketImpl.java:1063) at java.base/sun.security.ssl.SSLSocketImpl.startHandshake(SSLSocketImpl.java:402) at org.apache.http.conn.ssl.SSLSocketFactory.connectSocket(SSLSocketFactory.java:533) at org.apache.http.conn.ssl.SSLSocketFactory.connectSocket(SSLSocketFactory.java:401) at org.apache.http.impl.conn.DefaultClientConnectionOperator.openConnection(DefaultClientConnectionOperator.java:177) at org.apache.http.impl.conn.AbstractPoolEntry.open(AbstractPoolEntry.java:144) at org.apache.http.impl.conn.AbstractPooledConnAdapter.open(AbstractPooledConnAdapter.java:131) at org.apache.http.impl.client.DefaultRequestDirector.tryConnect(DefaultRequestDirector.java:610) at org.apache.http.impl.client.DefaultRequestDirector.execute(DefaultRequestDirector.java:445) at org.apache.http.impl.client.AbstractHttpClient.doExecute(AbstractHttpClient.java:863) at org.apache.http.impl.client.CloseableHttpClient.execute(CloseableHttpClient.java:82) at org.apache.http.impl.client.CloseableHttpClient.execute(CloseableHttpClient.java:106) at org.wso2.esb.integration.common.utils.clients.SimpleHttpClient.doGet(SimpleHttpClient.java:102) at org.wso2.esb.integration.common.utils.ESBIntegrationTest.retrieveArtifactUsingManagementApi(ESBIntegrationTest.java:1005) at org.wso2.esb.integration.common.utils.ESBIntegrationTest.checkEndpointExistence(ESBIntegrationTest.java:912) at org.wso2.carbon.esb.car.deployment.test.ESBJAVA3611EndpointTestCase.testEndpointDeployed(ESBJAVA3611EndpointTestCase.java:36)

testSequenceDeployed

java.lang.AssertionError: ERROR - CappAxis2Deployer Error while deploying carbon application expected [true] but found [false] at org.testng.Assert.fail(Assert.java:93) at org.testng.Assert.failNotEquals(Assert.java:512) at org.testng.Assert.assertTrue(Assert.java:41) at org.wso2.carbon.esb.car.deployment.test.ESBJAVA4116CAppArtifactDeploymentFailureDueToNameTestCase.testSequenceDeployed(ESBJAVA4116CAppArtifactDeploymentFailureDueToNameTestCase.java:36)

faviconTest

javax.net.ssl.SSLHandshakeException: Invalid ECDH ServerKeyExchange signature at java.base/sun.security.ssl.Alert.createSSLException(Alert.java:131) at java.base/sun.security.ssl.Alert.createSSLException(Alert.java:117) at java.base/sun.security.ssl.TransportContext.fatal(TransportContext.java:307) at java.base/sun.security.ssl.TransportContext.fatal(TransportContext.java:263) at java.base/sun.security.ssl.TransportContext.fatal(TransportContext.java:254) at java.base/sun.security.ssl.ECDHServerKeyExchange$ECDHServerKeyExchangeMessage.(ECDHServerKeyExchange.java:325) at java.base/sun.security.ssl.ECDHServerKeyExchange$ECDHServerKeyExchangeConsumer.consume(ECDHServerKeyExchange.java:531) at java.base/sun.security.ssl.ServerKeyExchange$ServerKeyExchangeConsumer.consume(ServerKeyExchange.java:111) at java.base/sun.security.ssl.SSLHandshake.consume(SSLHandshake.java:392) at java.base/sun.security.ssl.HandshakeContext.dispatch(HandshakeContext.java:443) at java.base/sun.security.ssl.HandshakeContext.dispatch(HandshakeContext.java:421) at java.base/sun.security.ssl.TransportContext.dispatch(TransportContext.java:177) at java.base/sun.security.ssl.SSLTransport.decode(SSLTransport.java:164) at java.base/sun.security.ssl.SSLSocketImpl.decode(SSLSocketImpl.java:1152) at java.base/sun.security.ssl.SSLSocketImpl.readHandshakeRecord(SSLSocketImpl.java:1063) at java.base/sun.security.ssl.SSLSocketImpl.startHandshake(SSLSocketImpl.java:402) at java.base/sun.net.www.protocol.https.HttpsClient.afterConnect(HttpsClient.java:567) at java.base/sun.net.www.protocol.https.AbstractDelegateHttpsURLConnection.connect(AbstractDelegateHttpsURLConnection.java:185) at java.base/sun.net.www.protocol.https.HttpsURLConnectionImpl.connect(HttpsURLConnectionImpl.java:168) at org.wso2.carbon.automation.test.utils.http.client.HttpsURLConnectionClient.getRequest(HttpsURLConnectionClient.java:45) at org.wso2.carbon.esb.getprocessor.test.FaviconTest.faviconTest(FaviconTest.java:41)

testSecureProxyEndPointThruUri

org.apache.axis2.AxisFault: peer not authenticated at org.apache.axis2.AxisFault.makeFault(AxisFault.java:430) at org.apache.axis2.transport.http.HTTPSender.sendViaPost(HTTPSender.java:227) at org.apache.axis2.transport.http.HTTPSender.send(HTTPSender.java:82) at org.apache.axis2.transport.http.CommonsHTTPTransportSender.writeMessageWithCommons(CommonsHTTPTransportSender.java:459) at org.apache.axis2.transport.http.CommonsHTTPTransportSender.invoke(CommonsHTTPTransportSender.java:286) at org.apache.axis2.engine.AxisEngine.send(AxisEngine.java:442) at org.apache.axis2.description.OutInAxisOperationClient.send(OutInAxisOperation.java:449) at org.apache.axis2.description.OutInAxisOperationClient.executeImpl(OutInAxisOperation.java:235) at org.apache.axis2.client.OperationClient.execute(OperationClient.java:149) at org.apache.axis2.client.ServiceClient.sendReceive(ServiceClient.java:554) at org.apache.axis2.client.ServiceClient.sendReceive(ServiceClient.java:530) at org.wso2.esb.integration.common.utils.clients.axis2client.SecureAxisServiceClient.sendReceive(SecureAxisServiceClient.java:137) at org.wso2.esb.integration.common.utils.clients.SecureServiceClient.sendSecuredStockQuoteRequest(SecureServiceClient.java:105) at org.wso2.carbon.esb.https.inbound.transport.test.HttpsInboundTransportTestCase.testSecureProxyEndPointThruUri(HttpsInboundTransportTestCase.java:59) Caused by: javax.net.ssl.SSLPeerUnverifiedException: peer not authenticated at java.base/sun.security.ssl.SSLSessionImpl.getPeerCertificates(SSLSessionImpl.java:558) at org.apache.commons.httpclient.protocol.SSLProtocolSocketFactory.verifyHostName(SSLProtocolSocketFactory.java:276) at org.apache.commons.httpclient.protocol.SSLProtocolSocketFactory.createSocket(SSLProtocolSocketFactory.java:175) at org.apache.commons.httpclient.HttpConnection.open(HttpConnection.java:707) at org.apache.commons.httpclient.MultiThreadedHttpConnectionManager$HttpConnectionAdapter.open(MultiThreadedHttpConnectionManager.java:1361) at org.apache.commons.httpclient.HttpMethodDirector.executeWithRetry(HttpMethodDirector.java:387) at org.apache.commons.httpclient.HttpMethodDirector.executeMethod(HttpMethodDirector.java:171) at org.apache.commons.httpclient.HttpClient.executeMethod(HttpClient.java:397) at org.apache.axis2.transport.http.AbstractHTTPSender.executeMethod(AbstractHTTPSender.java:717) at org.apache.axis2.transport.http.HTTPSender.sendViaPost(HTTPSender.java:223) ... 46 more

settingOperationContextWithInboundTest

java.lang.AssertionError: Seq deployment failed. expected [true] but found [false] at org.testng.Assert.fail(Assert.java:93) at org.testng.Assert.failNotEquals(Assert.java:512) at org.testng.Assert.assertTrue(Assert.java:41) at org.wso2.carbon.esb.jms.inbound.transport.test.ESBJAVA5094SetOperationContextWithInboundEndpointTestCase.settingOperationContextWithInboundTest(ESBJAVA5094SetOperationContextWithInboundEndpointTestCase.java:123)

Environment Variables(72)18 different
Slave Information(87)11 different
Project Information(14)0 different

Module Builds

Success MI Integration Test Admin Clients5.4 sec
Success WSO2 Micro Integrator - Automation Extensions16 sec
 builtin-mediators (didn’t run)
 MI Integration Test - CLI Tests (didn’t run)
 crypto-service (didn’t run)
 data (didn’t run)
 data-features (didn’t run)
 data-publisher-features (didn’t run)
 data-publishers (didn’t run)
 data-services (didn’t run)
 data-services-feature (didn’t run)
Success DataServices Clients27 sec
Success MI Data Service Tests0.85 sec
Success WSO2 DataServices Integration Test0.7 sec
Success Mi DSS Integration Test Common1.7 sec
Success DS Samples Parent6.8 sec
 event-sink (didn’t run)
 extensions (didn’t run)
 inbound-endpoint (didn’t run)
 WSO2 Carbon - Inbound Endpoint Module (didn’t run)
Success MI Test Common Module34 sec
Success MI Integration Test Common Utils12 sec
 mediation (didn’t run)
 mediation-features (didn’t run)
Success WSO2 Enterprise Integrator - Mediation Integration Tests1.9 sec
 mediators (didn’t run)
 WSO2 Enterprise Integrator - Component Parent (didn’t run)
Success MI DSS Samples Parent1.3 sec
 WSO2 Micro Integrator - Feature Aggregator Module (didn’t run)
Success WSO2 Micro Integrator - Integration Tests5.4 sec
 WSO2 Enterprise Integrator - micro-integrator P2 Profile Generation (didn’t run)
 MI Monitoring Dashboard - Component Parent (didn’t run)
 MI Monitoring Dashboard - Distribution (didn’t run)
 MI Monitoring Dashboard - Feature Aggregator Module (didn’t run)
 MI Monitoring Dashboard - Parent (didn’t run)
Success MI Integration Test Reporting6.5 sec
Unstable MI test Module-mediator-113 min
Success MI test Module-mediator-216 min
Success MI test Module-Other7 min 22 sec
Unstable Mi test Module - Test Patches19 min
Success MI Test Module - Platform1.4 sec
Success MI test Module - Platform - RabbitMQ Transport3.5 sec
 MI test Module - Platform - with WSO2MB (didn’t run)
Success MI test Module - Sample2 min 39 sec
Success MI test Module-Service7 min 24 sec
Unstable MI test Module-Transport39 min
 WSO2 Carbon - Cache mediator (didn’t run)
 WSO2 Micro Integrator - Core Component (didn’t run)
 WSO2 Micro Integrator - Extensions (didn’t run)
 org.wso2.carbon.micro.integrator.management.apis (didn’t run)
 org.wso2.carbon.micro.integrator.security (didn’t run)
 WSO2 Micro Integrator - Server Component (didn’t run)
 WSO2 Micro Integrator - Core Server Feature (didn’t run)
Success MI DSS Admin Clients3 sec
Success MI DSS Test Utils1.9 sec
Success MI DSS Tests1 min 13 sec
Success WSO2 MI - Samples28 sec
 WSO2 Micro Integrator - Analytics Data Publisher Util (didn’t run)
 WSO2 Micro Integrator Analytics - Message Flow Data Publisher (didn’t run)
 org.wso2.micro.integrator.analytics.messageflow.data.publisher.feature (didn’t run)
 org.wso2.micro.integrator.bootstrap (didn’t run)
Success MI test Module-Coordination13 sec
 org.wso2.micro.integrator.coordination (didn’t run)
 WSO2 Micro Integrator - Core Component (didn’t run)
 org.wso2.micro.integrator.crypto.feature (didn’t run)
 org.wso2.micro.integrator.crypto.impl (didn’t run)
 org.wso2.micro.integrator.crypto.provider (didn’t run)
 MI Monitoring Dashboard - Web Component (didn’t run)
 MI Monitoring Dashboard - Feature (didn’t run)
 WSO2 Carbon - Data service C-app Deployer implementation (didn’t run)
 WSO2 Carbon - Data Services Common (didn’t run)
 WSO2 Carbon - Data Services Core (didn’t run)
 WSO2 Carbon - Data Services OData (didn’t run)
 WSO2 Carbon - OData Services Endpoint (didn’t run)
 WSO2 Carbon - All Mediators Server Feature (didn’t run)
 WSO2 Carbon - Data Services SQL Driver (didn’t run)
 org.wso2.micro.integrator.event.sink (didn’t run)
 WSO2 Micro Integrator - Extensions (didn’t run)
 WSO2 Micro Integrator - Identity Entitlement Mediator (didn’t run)
 WSO2 Micro Integrator - XACML Mediation Feature (didn’t run)
 org.wso2.micro.integrator.inbound.endpoint (didn’t run)
 org.wso2.micro.integrator.inbound.endpoint.osgi (didn’t run)
 org.wso2.micro.integrator.inbound.endpoint.persistence (didn’t run)
 WSO2 Carbon - Inbound Endpoint Server Feature (didn’t run)
 WSO2 Micro Integrator - Mediation Initializer (didn’t run)
 WSO2 Micro Integrator - Initializer Server Feature (didn’t run)
 org.wso2.micro.integrator.management.apis (didn’t run)
 WSO2 Carbon - ntask Integration core (didn’t run)
 WSO2 Micro Integrator - Mediation NTask Feature (didn’t run)
 WSO2 Carbon - Synapse Security (didn’t run)
 WSO2 Micro Integrator Mediation StartUp (didn’t run)
 WSO2 Carbon - Identity OAuth Mediator (didn’t run)
 WSO2 MI - Publish Event mediator (didn’t run)
 WSO2 MI - Event-Sink Management Server Feature (didn’t run)
 WSO2 Carbon - All Mediators Server Feature (didn’t run)
 WSO2 Carbon - Data source C-app Deployer implementation (didn’t run)
 WSO2 Carbon - New Data Sources Common (didn’t run)
 WSO2 Carbon - New Data Sources Core (didn’t run)
 WSO2 Carbon - New Data Sources RDBMS (didn’t run)
 WSO2 Carbon - Tasks Core (didn’t run)
 WSO2 Carbon - Tasks Core Feature (didn’t run)
 org.wso2.micro.integrator.probes (didn’t run)
 WSO2 Micro Integrator - Prometheus data publisher (didn’t run)
 WSO2 Micro Integrator - Prometheus Publisher Feature (didn’t run)
 WSO2 Micro Integrator - Registry (didn’t run)
 org.wso2.micro.integrator.security (didn’t run)
 org.wso2.micro.integrator.security.handlers (didn’t run)
 WSO2 Micro Integrator Security Feature (didn’t run)
 WSO2 Micro Integrator - Server Component (didn’t run)
 WSO2 Micro Integrator - Core Server Feature (didn’t run)
 WSO2 Carbon - Task BE (didn’t run)
 WSO2 Carbon - Scheduled Tasks Core Feature (didn’t run)
Success MI test Module-Transaction4.5 sec
 WSO2 Micro Integrator - Transport Handlers (didn’t run)
Success MI test Module - UserStore10 sec
 org.wso2.micro.integrator.websocket.feature (didn’t run)
 WSO2 Micro Integrator - WebsocketTransport (didn’t run)
 publishEvent-feature (didn’t run)
 registry (didn’t run)
 scheduled-tasks (didn’t run)
 security (didn’t run)
 security-features (didn’t run)
Success MI Test Service Module1.9 sec
 startup (didn’t run)
 tasks (didn’t run)
 transport-features (didn’t run)
 transports (didn’t run)
 utsecurity (didn’t run)
 WSO2 Micro Integrator (didn’t run)
 WSO2 Micro Integrator - Distribution (didn’t run)