Started 3 yr 9 mo ago
Took 19 min on ECS_PRODUCTION-20382d83925293

Unstable Build #112 (Apr 19, 2018 10:14:15 AM)

No changes.

Started by timer

Revision: d559a052b3e6049a46e086383254823f5b5cb80f
  • refs/remotes/origin/master
Test Result (3 failures / -4)Show all failed tests >>>

Identified problems

There are test failures

[INFO] [ERROR] Failed to execute goal org.apache.maven.plugins:maven-surefire-plugin:2.18.1:test (default-test) on project
Indication 1

setup

java.lang.RuntimeException: Port 9090 is not open at org.ballerinalang.test.service.http.sample.HTTPVerbsPassthruTestCases.setup(HTTPVerbsPassthruTestCases.java:45)

setup

java.lang.RuntimeException: Port 9090 is not open at org.ballerinalang.test.service.http.sample.HTTPOptionsTestCase.setup(HTTPOptionsTestCase.java:27)

setup

java.lang.RuntimeException: Port 9090 is not open at org.ballerinalang.test.service.websocket.sample.WebSocketPassThroughTestCase.setup(WebSocketPassThroughTestCase.java:61)

Environment Variables(58)15 different
Slave Information(83)9 different
Project Information(15)0 different

Module Builds

Success ballerina3 min 34 sec
Success ballerina-tools34 sec
Unstable Ballerina - Test Integration6 min 38 sec
Success Ballerina - Tools3 min 15 sec