Up
collapse
94%
WDescription%
Test Result: 3 tests failing out of a total of 58 tests.94
Build stability: No recent builds failed.100
Build History
x
 Identified problems84 MB[sonarqube]
 Identified problems84 MB[sonarqube]
 Identified problems84 MB[sonarqube]
 84 MB[sonarqube]

Maven project sonar-tools-distribution

Project disk usage information + trend graph
Disk Usage: Workspace 0, Builds {all=352714211, locked=0}, Job directory 352734966
Test Result Trend
[Test result trend chart]
(just show failures) enlarge

More graphs
SonarQube
Recent Changes
Latest Test Result (3 failures / -4)

Identified problems

There are test failures

[INFO] [ERROR] Failed to execute goal org.apache.maven.plugins:maven-surefire-plugin:2.18.1:test (default-test) on project
Indication 1

setup

java.lang.RuntimeException: Port 9090 is not open at org.ballerinalang.test.service.http.sample.HTTPVerbsPassthruTestCases.setup(HTTPVerbsPassthruTestCases.java:45)

setup

java.lang.RuntimeException: Port 9090 is not open at org.ballerinalang.test.service.http.sample.HTTPOptionsTestCase.setup(HTTPOptionsTestCase.java:27)

setup

java.lang.RuntimeException: Port 9090 is not open at org.ballerinalang.test.service.websocket.sample.WebSocketPassThroughTestCase.setup(WebSocketPassThroughTestCase.java:61)

Latest Test Result (3 failures / -4)