SuccessConsole Output

Skipping 1,138 KB.. Full Log
apperGroupedEventsWithoutEnable(TextDefaultSourceMapperTestCase.java:588) [test-classes/:?]
	at sun.reflect.NativeMethodAccessorImpl.invoke0(Native Method) ~[?:1.8.0_171]
	at sun.reflect.NativeMethodAccessorImpl.invoke(NativeMethodAccessorImpl.java:62) ~[?:1.8.0_171]
	at sun.reflect.DelegatingMethodAccessorImpl.invoke(DelegatingMethodAccessorImpl.java:43) ~[?:1.8.0_171]
	at java.lang.reflect.Method.invoke(Method.java:498) ~[?:1.8.0_171]
	at org.testng.internal.MethodInvocationHelper.invokeMethod(MethodInvocationHelper.java:108) [testng-6.11.jar:?]
	at org.testng.internal.Invoker.invokeMethod(Invoker.java:661) [testng-6.11.jar:?]
	at org.testng.internal.Invoker.invokeTestMethod(Invoker.java:869) [testng-6.11.jar:?]
	at org.testng.internal.Invoker.invokeTestMethods(Invoker.java:1193) [testng-6.11.jar:?]
	at org.testng.internal.TestMethodWorker.invokeTestMethods(TestMethodWorker.java:126) [testng-6.11.jar:?]
	at org.testng.internal.TestMethodWorker.run(TestMethodWorker.java:109) [testng-6.11.jar:?]
	at org.testng.TestRunner.privateRun(TestRunner.java:744) [testng-6.11.jar:?]
	at org.testng.TestRunner.run(TestRunner.java:602) [testng-6.11.jar:?]
	at org.testng.SuiteRunner.runTest(SuiteRunner.java:380) [testng-6.11.jar:?]
	at org.testng.SuiteRunner.runSequentially(SuiteRunner.java:375) [testng-6.11.jar:?]
	at org.testng.SuiteRunner.privateRun(SuiteRunner.java:340) [testng-6.11.jar:?]
	at org.testng.SuiteRunner.run(SuiteRunner.java:289) [testng-6.11.jar:?]
	at org.testng.SuiteRunnerWorker.runSuite(SuiteRunnerWorker.java:52) [testng-6.11.jar:?]
	at org.testng.SuiteRunnerWorker.run(SuiteRunnerWorker.java:86) [testng-6.11.jar:?]
	at org.testng.TestNG.runSuitesSequentially(TestNG.java:1301) [testng-6.11.jar:?]
	at org.testng.TestNG.runSuitesLocally(TestNG.java:1226) [testng-6.11.jar:?]
	at org.testng.TestNG.runSuites(TestNG.java:1144) [testng-6.11.jar:?]
	at org.testng.TestNG.run(TestNG.java:1115) [testng-6.11.jar:?]
	at org.apache.maven.surefire.testng.TestNGExecutor.run(TestNGExecutor.java:281) [surefire-testng-2.19.1.jar:2.19.1]
	at org.apache.maven.surefire.testng.TestNGXmlTestSuite.execute(TestNGXmlTestSuite.java:75) [surefire-testng-2.19.1.jar:2.19.1]
	at org.apache.maven.surefire.testng.TestNGProvider.invoke(TestNGProvider.java:121) [surefire-testng-2.19.1.jar:2.19.1]
	at org.apache.maven.surefire.booter.ForkedBooter.invokeProviderInSameClassLoader(ForkedBooter.java:290) [surefire-booter-2.19.1.jar:2.19.1]
	at org.apache.maven.surefire.booter.ForkedBooter.runSuitesInProcess(ForkedBooter.java:242) [surefire-booter-2.19.1.jar:2.19.1]
	at org.apache.maven.surefire.booter.ForkedBooter.main(ForkedBooter.java:121) [surefire-booter-2.19.1.jar:2.19.1]
[main] ERROR io.siddhi.extension.map.text.sourcemapper.TextSourceMapper [] - Incompatible data format. Because value is 200
~~~~~~~~~~
symbol:"IBM" and attribute type is LONG in the stream FooStream of siddhi text input mapper.
[main] ERROR io.siddhi.extension.map.text.sourcemapper.TextSourceMapper [] - Exception occurred when converting Text message:symbol:"wso2",
price:55.6,
volume:200
~~~~~~~~~~
symbol:"IBM",
price:75.6,
volume:100 to Siddhi Event in the stream FooStream of siddhi text input mapper.
io.siddhi.core.exception.MappingFailedException: Incompatible data format. Because value is 200
~~~~~~~~~~
symbol:"IBM" and attribute type is LONG in the stream FooStream of siddhi text input mapper.
	at io.siddhi.extension.map.text.sourcemapper.TextSourceMapper.convertToDefaultEvents(TextSourceMapper.java:453) ~[classes/:?]
	at io.siddhi.extension.map.text.sourcemapper.TextSourceMapper.onEventHandler(TextSourceMapper.java:305) [classes/:?]
	at io.siddhi.extension.map.text.sourcemapper.TextSourceMapper.mapAndProcess(TextSourceMapper.java:255) [classes/:?]
	at io.siddhi.core.stream.input.source.SourceMapper.onEvent(SourceMapper.java:201) [siddhi-core-5.1.21.jar:?]
	at io.siddhi.core.stream.input.source.SourceMapper.onEvent(SourceMapper.java:145) [siddhi-core-5.1.21.jar:?]
	at io.siddhi.core.stream.input.source.InMemorySource$1.onMessage(InMemorySource.java:99) [siddhi-core-5.1.21.jar:?]
	at io.siddhi.core.util.transport.InMemoryBroker$MessageBroker.broadcast(InMemoryBroker.java:110) [siddhi-core-5.1.21.jar:?]
	at io.siddhi.core.util.transport.InMemoryBroker$MessageBroker.publish(InMemoryBroker.java:118) [siddhi-core-5.1.21.jar:?]
	at io.siddhi.core.util.transport.InMemoryBroker.publish(InMemoryBroker.java:41) [siddhi-core-5.1.21.jar:?]
	at io.siddhi.extension.map.text.sourcemapper.TextDefaultSourceMapperTestCase.testTextSourceMapperGroupedEventsWithoutEnable(TextDefaultSourceMapperTestCase.java:588) [test-classes/:?]
	at sun.reflect.NativeMethodAccessorImpl.invoke0(Native Method) ~[?:1.8.0_171]
	at sun.reflect.NativeMethodAccessorImpl.invoke(NativeMethodAccessorImpl.java:62) ~[?:1.8.0_171]
	at sun.reflect.DelegatingMethodAccessorImpl.invoke(DelegatingMethodAccessorImpl.java:43) ~[?:1.8.0_171]
	at java.lang.reflect.Method.invoke(Method.java:498) ~[?:1.8.0_171]
	at org.testng.internal.MethodInvocationHelper.invokeMethod(MethodInvocationHelper.java:108) [testng-6.11.jar:?]
	at org.testng.internal.Invoker.invokeMethod(Invoker.java:661) [testng-6.11.jar:?]
	at org.testng.internal.Invoker.invokeTestMethod(Invoker.java:869) [testng-6.11.jar:?]
	at org.testng.internal.Invoker.invokeTestMethods(Invoker.java:1193) [testng-6.11.jar:?]
	at org.testng.internal.TestMethodWorker.invokeTestMethods(TestMethodWorker.java:126) [testng-6.11.jar:?]
	at org.testng.internal.TestMethodWorker.run(TestMethodWorker.java:109) [testng-6.11.jar:?]
	at org.testng.TestRunner.privateRun(TestRunner.java:744) [testng-6.11.jar:?]
	at org.testng.TestRunner.run(TestRunner.java:602) [testng-6.11.jar:?]
	at org.testng.SuiteRunner.runTest(SuiteRunner.java:380) [testng-6.11.jar:?]
	at org.testng.SuiteRunner.runSequentially(SuiteRunner.java:375) [testng-6.11.jar:?]
	at org.testng.SuiteRunner.privateRun(SuiteRunner.java:340) [testng-6.11.jar:?]
	at org.testng.SuiteRunner.run(SuiteRunner.java:289) [testng-6.11.jar:?]
	at org.testng.SuiteRunnerWorker.runSuite(SuiteRunnerWorker.java:52) [testng-6.11.jar:?]
	at org.testng.SuiteRunnerWorker.run(SuiteRunnerWorker.java:86) [testng-6.11.jar:?]
	at org.testng.TestNG.runSuitesSequentially(TestNG.java:1301) [testng-6.11.jar:?]
	at org.testng.TestNG.runSuitesLocally(TestNG.java:1226) [testng-6.11.jar:?]
	at org.testng.TestNG.runSuites(TestNG.java:1144) [testng-6.11.jar:?]
	at org.testng.TestNG.run(TestNG.java:1115) [testng-6.11.jar:?]
	at org.apache.maven.surefire.testng.TestNGExecutor.run(TestNGExecutor.java:281) [surefire-testng-2.19.1.jar:2.19.1]
	at org.apache.maven.surefire.testng.TestNGXmlTestSuite.execute(TestNGXmlTestSuite.java:75) [surefire-testng-2.19.1.jar:2.19.1]
	at org.apache.maven.surefire.testng.TestNGProvider.invoke(TestNGProvider.java:121) [surefire-testng-2.19.1.jar:2.19.1]
	at org.apache.maven.surefire.booter.ForkedBooter.invokeProviderInSameClassLoader(ForkedBooter.java:290) [surefire-booter-2.19.1.jar:2.19.1]
	at org.apache.maven.surefire.booter.ForkedBooter.runSuitesInProcess(ForkedBooter.java:242) [surefire-booter-2.19.1.jar:2.19.1]
	at org.apache.maven.surefire.booter.ForkedBooter.main(ForkedBooter.java:121) [surefire-booter-2.19.1.jar:2.19.1]
[main] ERROR io.siddhi.core.stream.input.source.SourceMapper [] - Error while processing 'symbol:"wso2",
price:55.6,
volume:200
~~~~~~~~~~
symbol:"IBM",
price:75.6,
volume:100', for the input Mapping 'text' for the stream 'FooStream'.
io.siddhi.core.exception.MappingFailedException: null
	at io.siddhi.extension.map.text.sourcemapper.TextSourceMapper.mapAndProcess(TextSourceMapper.java:278) ~[classes/:?]
	at io.siddhi.core.stream.input.source.SourceMapper.onEvent(SourceMapper.java:201) [siddhi-core-5.1.21.jar:?]
	at io.siddhi.core.stream.input.source.SourceMapper.onEvent(SourceMapper.java:145) [siddhi-core-5.1.21.jar:?]
	at io.siddhi.core.stream.input.source.InMemorySource$1.onMessage(InMemorySource.java:99) [siddhi-core-5.1.21.jar:?]
	at io.siddhi.core.util.transport.InMemoryBroker$MessageBroker.broadcast(InMemoryBroker.java:110) [siddhi-core-5.1.21.jar:?]
	at io.siddhi.core.util.transport.InMemoryBroker$MessageBroker.publish(InMemoryBroker.java:118) [siddhi-core-5.1.21.jar:?]
	at io.siddhi.core.util.transport.InMemoryBroker.publish(InMemoryBroker.java:41) [siddhi-core-5.1.21.jar:?]
	at io.siddhi.extension.map.text.sourcemapper.TextDefaultSourceMapperTestCase.testTextSourceMapperGroupedEventsWithoutEnable(TextDefaultSourceMapperTestCase.java:588) [test-classes/:?]
	at sun.reflect.NativeMethodAccessorImpl.invoke0(Native Method) ~[?:1.8.0_171]
	at sun.reflect.NativeMethodAccessorImpl.invoke(NativeMethodAccessorImpl.java:62) ~[?:1.8.0_171]
	at sun.reflect.DelegatingMethodAccessorImpl.invoke(DelegatingMethodAccessorImpl.java:43) ~[?:1.8.0_171]
	at java.lang.reflect.Method.invoke(Method.java:498) ~[?:1.8.0_171]
	at org.testng.internal.MethodInvocationHelper.invokeMethod(MethodInvocationHelper.java:108) [testng-6.11.jar:?]
	at org.testng.internal.Invoker.invokeMethod(Invoker.java:661) [testng-6.11.jar:?]
	at org.testng.internal.Invoker.invokeTestMethod(Invoker.java:869) [testng-6.11.jar:?]
	at org.testng.internal.Invoker.invokeTestMethods(Invoker.java:1193) [testng-6.11.jar:?]
	at org.testng.internal.TestMethodWorker.invokeTestMethods(TestMethodWorker.java:126) [testng-6.11.jar:?]
	at org.testng.internal.TestMethodWorker.run(TestMethodWorker.java:109) [testng-6.11.jar:?]
	at org.testng.TestRunner.privateRun(TestRunner.java:744) [testng-6.11.jar:?]
	at org.testng.TestRunner.run(TestRunner.java:602) [testng-6.11.jar:?]
	at org.testng.SuiteRunner.runTest(SuiteRunner.java:380) [testng-6.11.jar:?]
	at org.testng.SuiteRunner.runSequentially(SuiteRunner.java:375) [testng-6.11.jar:?]
	at org.testng.SuiteRunner.privateRun(SuiteRunner.java:340) [testng-6.11.jar:?]
	at org.testng.SuiteRunner.run(SuiteRunner.java:289) [testng-6.11.jar:?]
	at org.testng.SuiteRunnerWorker.runSuite(SuiteRunnerWorker.java:52) [testng-6.11.jar:?]
	at org.testng.SuiteRunnerWorker.run(SuiteRunnerWorker.java:86) [testng-6.11.jar:?]
	at org.testng.TestNG.runSuitesSequentially(TestNG.java:1301) [testng-6.11.jar:?]
	at org.testng.TestNG.runSuitesLocally(TestNG.java:1226) [testng-6.11.jar:?]
	at org.testng.TestNG.runSuites(TestNG.java:1144) [testng-6.11.jar:?]
	at org.testng.TestNG.run(TestNG.java:1115) [testng-6.11.jar:?]
	at org.apache.maven.surefire.testng.TestNGExecutor.run(TestNGExecutor.java:281) [surefire-testng-2.19.1.jar:2.19.1]
	at org.apache.maven.surefire.testng.TestNGXmlTestSuite.execute(TestNGXmlTestSuite.java:75) [surefire-testng-2.19.1.jar:2.19.1]
	at org.apache.maven.surefire.testng.TestNGProvider.invoke(TestNGProvider.java:121) [surefire-testng-2.19.1.jar:2.19.1]
	at org.apache.maven.surefire.booter.ForkedBooter.invokeProviderInSameClassLoader(ForkedBooter.java:290) [surefire-booter-2.19.1.jar:2.19.1]
	at org.apache.maven.surefire.booter.ForkedBooter.runSuitesInProcess(ForkedBooter.java:242) [surefire-booter-2.19.1.jar:2.19.1]
	at org.apache.maven.surefire.booter.ForkedBooter.main(ForkedBooter.java:121) [surefire-booter-2.19.1.jar:2.19.1]
[main] ERROR io.siddhi.extension.map.text.sourcemapper.TextSourceMapper [] - Invalid format of event symbol:"IFS",
price:50.6,
volume:200
~~~~~~~~~~
symbol:"Virtusa",
price:70.6,
volume:100 for attribute price could not find proper value while fail on missing attribute is 'true' in the stream FooStream of siddhi text input mapper.
[main] ERROR io.siddhi.extension.map.text.sourcemapper.TextSourceMapper [] - Exception occurred when converting Text message:symbol:"IFS",
price:50.6,
volume:200
~~~~~~~~~~
symbol:"Virtusa",
price:70.6,
volume:100 to Siddhi Event in the stream FooStream of siddhi text input mapper.
io.siddhi.core.exception.MappingFailedException: Invalid format of event symbol:"IFS",
price:50.6,
volume:200
~~~~~~~~~~
symbol:"Virtusa",
price:70.6,
volume:100 for attribute price could not find proper value while fail on missing attribute is 'true' in the stream FooStream of siddhi text input mapper.
	at io.siddhi.extension.map.text.sourcemapper.TextSourceMapper.convertToCustomEvents(TextSourceMapper.java:400) ~[classes/:?]
	at io.siddhi.extension.map.text.sourcemapper.TextSourceMapper.onEventHandler(TextSourceMapper.java:303) [classes/:?]
	at io.siddhi.extension.map.text.sourcemapper.TextSourceMapper.mapAndProcess(TextSourceMapper.java:255) [classes/:?]
	at io.siddhi.core.stream.input.source.SourceMapper.onEvent(SourceMapper.java:201) [siddhi-core-5.1.21.jar:?]
	at io.siddhi.core.stream.input.source.SourceMapper.onEvent(SourceMapper.java:145) [siddhi-core-5.1.21.jar:?]
	at io.siddhi.extension.map.text.sourcemapper.util.TestTrpInMemorySource$1.onMessage(TestTrpInMemorySource.java:79) [test-classes/:?]
	at io.siddhi.core.util.transport.InMemoryBroker$MessageBroker.broadcast(InMemoryBroker.java:110) [siddhi-core-5.1.21.jar:?]
	at io.siddhi.core.util.transport.InMemoryBroker$MessageBroker.publish(InMemoryBroker.java:118) [siddhi-core-5.1.21.jar:?]
	at io.siddhi.core.util.transport.InMemoryBroker.publish(InMemoryBroker.java:41) [siddhi-core-5.1.21.jar:?]
	at io.siddhi.extension.map.text.sourcemapper.TextDefaultSourceMapperTestCase.testTextSourceMapperGroupedEventsWithoutEnable(TextDefaultSourceMapperTestCase.java:589) [test-classes/:?]
	at sun.reflect.NativeMethodAccessorImpl.invoke0(Native Method) ~[?:1.8.0_171]
	at sun.reflect.NativeMethodAccessorImpl.invoke(NativeMethodAccessorImpl.java:62) ~[?:1.8.0_171]
	at sun.reflect.DelegatingMethodAccessorImpl.invoke(DelegatingMethodAccessorImpl.java:43) ~[?:1.8.0_171]
	at java.lang.reflect.Method.invoke(Method.java:498) ~[?:1.8.0_171]
	at org.testng.internal.MethodInvocationHelper.invokeMethod(MethodInvocationHelper.java:108) [testng-6.11.jar:?]
	at org.testng.internal.Invoker.invokeMethod(Invoker.java:661) [testng-6.11.jar:?]
	at org.testng.internal.Invoker.invokeTestMethod(Invoker.java:869) [testng-6.11.jar:?]
	at org.testng.internal.Invoker.invokeTestMethods(Invoker.java:1193) [testng-6.11.jar:?]
	at org.testng.internal.TestMethodWorker.invokeTestMethods(TestMethodWorker.java:126) [testng-6.11.jar:?]
	at org.testng.internal.TestMethodWorker.run(TestMethodWorker.java:109) [testng-6.11.jar:?]
	at org.testng.TestRunner.privateRun(TestRunner.java:744) [testng-6.11.jar:?]
	at org.testng.TestRunner.run(TestRunner.java:602) [testng-6.11.jar:?]
	at org.testng.SuiteRunner.runTest(SuiteRunner.java:380) [testng-6.11.jar:?]
	at org.testng.SuiteRunner.runSequentially(SuiteRunner.java:375) [testng-6.11.jar:?]
	at org.testng.SuiteRunner.privateRun(SuiteRunner.java:340) [testng-6.11.jar:?]
	at org.testng.SuiteRunner.run(SuiteRunner.java:289) [testng-6.11.jar:?]
	at org.testng.SuiteRunnerWorker.runSuite(SuiteRunnerWorker.java:52) [testng-6.11.jar:?]
	at org.testng.SuiteRunnerWorker.run(SuiteRunnerWorker.java:86) [testng-6.11.jar:?]
	at org.testng.TestNG.runSuitesSequentially(TestNG.java:1301) [testng-6.11.jar:?]
	at org.testng.TestNG.runSuitesLocally(TestNG.java:1226) [testng-6.11.jar:?]
	at org.testng.TestNG.runSuites(TestNG.java:1144) [testng-6.11.jar:?]
	at org.testng.TestNG.run(TestNG.java:1115) [testng-6.11.jar:?]
	at org.apache.maven.surefire.testng.TestNGExecutor.run(TestNGExecutor.java:281) [surefire-testng-2.19.1.jar:2.19.1]
	at org.apache.maven.surefire.testng.TestNGXmlTestSuite.execute(TestNGXmlTestSuite.java:75) [surefire-testng-2.19.1.jar:2.19.1]
	at org.apache.maven.surefire.testng.TestNGProvider.invoke(TestNGProvider.java:121) [surefire-testng-2.19.1.jar:2.19.1]
	at org.apache.maven.surefire.booter.ForkedBooter.invokeProviderInSameClassLoader(ForkedBooter.java:290) [surefire-booter-2.19.1.jar:2.19.1]
	at org.apache.maven.surefire.booter.ForkedBooter.runSuitesInProcess(ForkedBooter.java:242) [surefire-booter-2.19.1.jar:2.19.1]
	at org.apache.maven.surefire.booter.ForkedBooter.main(ForkedBooter.java:121) [surefire-booter-2.19.1.jar:2.19.1]
[main] ERROR io.siddhi.core.stream.input.source.SourceMapper [] - Error while processing 'symbol:"IFS",
price:50.6,
volume:200
~~~~~~~~~~
symbol:"Virtusa",
price:70.6,
volume:100', for the input Mapping 'text' for the stream 'FooStream'.
io.siddhi.core.exception.MappingFailedException: null
	at io.siddhi.extension.map.text.sourcemapper.TextSourceMapper.mapAndProcess(TextSourceMapper.java:278) ~[classes/:?]
	at io.siddhi.core.stream.input.source.SourceMapper.onEvent(SourceMapper.java:201) [siddhi-core-5.1.21.jar:?]
	at io.siddhi.core.stream.input.source.SourceMapper.onEvent(SourceMapper.java:145) [siddhi-core-5.1.21.jar:?]
	at io.siddhi.extension.map.text.sourcemapper.util.TestTrpInMemorySource$1.onMessage(TestTrpInMemorySource.java:79) [test-classes/:?]
	at io.siddhi.core.util.transport.InMemoryBroker$MessageBroker.broadcast(InMemoryBroker.java:110) [siddhi-core-5.1.21.jar:?]
	at io.siddhi.core.util.transport.InMemoryBroker$MessageBroker.publish(InMemoryBroker.java:118) [siddhi-core-5.1.21.jar:?]
	at io.siddhi.core.util.transport.InMemoryBroker.publish(InMemoryBroker.java:41) [siddhi-core-5.1.21.jar:?]
	at io.siddhi.extension.map.text.sourcemapper.TextDefaultSourceMapperTestCase.testTextSourceMapperGroupedEventsWithoutEnable(TextDefaultSourceMapperTestCase.java:589) [test-classes/:?]
	at sun.reflect.NativeMethodAccessorImpl.invoke0(Native Method) ~[?:1.8.0_171]
	at sun.reflect.NativeMethodAccessorImpl.invoke(NativeMethodAccessorImpl.java:62) ~[?:1.8.0_171]
	at sun.reflect.DelegatingMethodAccessorImpl.invoke(DelegatingMethodAccessorImpl.java:43) ~[?:1.8.0_171]
	at java.lang.reflect.Method.invoke(Method.java:498) ~[?:1.8.0_171]
	at org.testng.internal.MethodInvocationHelper.invokeMethod(MethodInvocationHelper.java:108) [testng-6.11.jar:?]
	at org.testng.internal.Invoker.invokeMethod(Invoker.java:661) [testng-6.11.jar:?]
	at org.testng.internal.Invoker.invokeTestMethod(Invoker.java:869) [testng-6.11.jar:?]
	at org.testng.internal.Invoker.invokeTestMethods(Invoker.java:1193) [testng-6.11.jar:?]
	at org.testng.internal.TestMethodWorker.invokeTestMethods(TestMethodWorker.java:126) [testng-6.11.jar:?]
	at org.testng.internal.TestMethodWorker.run(TestMethodWorker.java:109) [testng-6.11.jar:?]
	at org.testng.TestRunner.privateRun(TestRunner.java:744) [testng-6.11.jar:?]
	at org.testng.TestRunner.run(TestRunner.java:602) [testng-6.11.jar:?]
	at org.testng.SuiteRunner.runTest(SuiteRunner.java:380) [testng-6.11.jar:?]
	at org.testng.SuiteRunner.runSequentially(SuiteRunner.java:375) [testng-6.11.jar:?]
	at org.testng.SuiteRunner.privateRun(SuiteRunner.java:340) [testng-6.11.jar:?]
	at org.testng.SuiteRunner.run(SuiteRunner.java:289) [testng-6.11.jar:?]
	at org.testng.SuiteRunnerWorker.runSuite(SuiteRunnerWorker.java:52) [testng-6.11.jar:?]
	at org.testng.SuiteRunnerWorker.run(SuiteRunnerWorker.java:86) [testng-6.11.jar:?]
	at org.testng.TestNG.runSuitesSequentially(TestNG.java:1301) [testng-6.11.jar:?]
	at org.testng.TestNG.runSuitesLocally(TestNG.java:1226) [testng-6.11.jar:?]
	at org.testng.TestNG.runSuites(TestNG.java:1144) [testng-6.11.jar:?]
	at org.testng.TestNG.run(TestNG.java:1115) [testng-6.11.jar:?]
	at org.apache.maven.surefire.testng.TestNGExecutor.run(TestNGExecutor.java:281) [surefire-testng-2.19.1.jar:2.19.1]
	at org.apache.maven.surefire.testng.TestNGXmlTestSuite.execute(TestNGXmlTestSuite.java:75) [surefire-testng-2.19.1.jar:2.19.1]
	at org.apache.maven.surefire.testng.TestNGProvider.invoke(TestNGProvider.java:121) [surefire-testng-2.19.1.jar:2.19.1]
	at org.apache.maven.surefire.booter.ForkedBooter.invokeProviderInSameClassLoader(ForkedBooter.java:290) [surefire-booter-2.19.1.jar:2.19.1]
	at org.apache.maven.surefire.booter.ForkedBooter.runSuitesInProcess(ForkedBooter.java:242) [surefire-booter-2.19.1.jar:2.19.1]
	at org.apache.maven.surefire.booter.ForkedBooter.main(ForkedBooter.java:121) [surefire-booter-2.19.1.jar:2.19.1]
[main] ERROR io.siddhi.extension.map.text.sourcemapper.TextSourceMapper [] - Invalid format of event symbol:"IFS",
price:50.6,
volume:200
~~~~~~~~~~
symbol:"Virtusa",
price:70.6,
volume:100 for attribute price could not find proper value while fail on missing attribute is 'true' in the stream FooStream of siddhi text input mapper.
[main] ERROR io.siddhi.extension.map.text.sourcemapper.TextSourceMapper [] - Exception occurred when converting Text message:symbol:"IFS",
price:50.6,
volume:200
~~~~~~~~~~
symbol:"Virtusa",
price:70.6,
volume:100 to Siddhi Event in the stream FooStream of siddhi text input mapper.
io.siddhi.core.exception.MappingFailedException: Invalid format of event symbol:"IFS",
price:50.6,
volume:200
~~~~~~~~~~
symbol:"Virtusa",
price:70.6,
volume:100 for attribute price could not find proper value while fail on missing attribute is 'true' in the stream FooStream of siddhi text input mapper.
	at io.siddhi.extension.map.text.sourcemapper.TextSourceMapper.convertToCustomEvents(TextSourceMapper.java:400) ~[classes/:?]
	at io.siddhi.extension.map.text.sourcemapper.TextSourceMapper.onEventHandler(TextSourceMapper.java:303) [classes/:?]
	at io.siddhi.extension.map.text.sourcemapper.TextSourceMapper.mapAndProcess(TextSourceMapper.java:255) [classes/:?]
	at io.siddhi.core.stream.input.source.SourceMapper.onEvent(SourceMapper.java:201) [siddhi-core-5.1.21.jar:?]
	at io.siddhi.core.stream.input.source.SourceMapper.onEvent(SourceMapper.java:145) [siddhi-core-5.1.21.jar:?]
	at io.siddhi.extension.map.text.sourcemapper.util.TestTrpInMemorySource$1.onMessage(TestTrpInMemorySource.java:79) [test-classes/:?]
	at io.siddhi.core.util.transport.InMemoryBroker$MessageBroker.broadcast(InMemoryBroker.java:110) [siddhi-core-5.1.21.jar:?]
	at io.siddhi.core.util.transport.InMemoryBroker$MessageBroker.publish(InMemoryBroker.java:118) [siddhi-core-5.1.21.jar:?]
	at io.siddhi.core.util.transport.InMemoryBroker.publish(InMemoryBroker.java:41) [siddhi-core-5.1.21.jar:?]
	at io.siddhi.extension.map.text.sourcemapper.TextDefaultSourceMapperTestCase.testTextSourceMapperGroupedEventsWithoutEnable(TextDefaultSourceMapperTestCase.java:589) [test-classes/:?]
	at sun.reflect.NativeMethodAccessorImpl.invoke0(Native Method) ~[?:1.8.0_171]
	at sun.reflect.NativeMethodAccessorImpl.invoke(NativeMethodAccessorImpl.java:62) ~[?:1.8.0_171]
	at sun.reflect.DelegatingMethodAccessorImpl.invoke(DelegatingMethodAccessorImpl.java:43) ~[?:1.8.0_171]
	at java.lang.reflect.Method.invoke(Method.java:498) ~[?:1.8.0_171]
	at org.testng.internal.MethodInvocationHelper.invokeMethod(MethodInvocationHelper.java:108) [testng-6.11.jar:?]
	at org.testng.internal.Invoker.invokeMethod(Invoker.java:661) [testng-6.11.jar:?]
	at org.testng.internal.Invoker.invokeTestMethod(Invoker.java:869) [testng-6.11.jar:?]
	at org.testng.internal.Invoker.invokeTestMethods(Invoker.java:1193) [testng-6.11.jar:?]
	at org.testng.internal.TestMethodWorker.invokeTestMethods(TestMethodWorker.java:126) [testng-6.11.jar:?]
	at org.testng.internal.TestMethodWorker.run(TestMethodWorker.java:109) [testng-6.11.jar:?]
	at org.testng.TestRunner.privateRun(TestRunner.java:744) [testng-6.11.jar:?]
	at org.testng.TestRunner.run(TestRunner.java:602) [testng-6.11.jar:?]
	at org.testng.SuiteRunner.runTest(SuiteRunner.java:380) [testng-6.11.jar:?]
	at org.testng.SuiteRunner.runSequentially(SuiteRunner.java:375) [testng-6.11.jar:?]
	at org.testng.SuiteRunner.privateRun(SuiteRunner.java:340) [testng-6.11.jar:?]
	at org.testng.SuiteRunner.run(SuiteRunner.java:289) [testng-6.11.jar:?]
	at org.testng.SuiteRunnerWorker.runSuite(SuiteRunnerWorker.java:52) [testng-6.11.jar:?]
	at org.testng.SuiteRunnerWorker.run(SuiteRunnerWorker.java:86) [testng-6.11.jar:?]
	at org.testng.TestNG.runSuitesSequentially(TestNG.java:1301) [testng-6.11.jar:?]
	at org.testng.TestNG.runSuitesLocally(TestNG.java:1226) [testng-6.11.jar:?]
	at org.testng.TestNG.runSuites(TestNG.java:1144) [testng-6.11.jar:?]
	at org.testng.TestNG.run(TestNG.java:1115) [testng-6.11.jar:?]
	at org.apache.maven.surefire.testng.TestNGExecutor.run(TestNGExecutor.java:281) [surefire-testng-2.19.1.jar:2.19.1]
	at org.apache.maven.surefire.testng.TestNGXmlTestSuite.execute(TestNGXmlTestSuite.java:75) [surefire-testng-2.19.1.jar:2.19.1]
	at org.apache.maven.surefire.testng.TestNGProvider.invoke(TestNGProvider.java:121) [surefire-testng-2.19.1.jar:2.19.1]
	at org.apache.maven.surefire.booter.ForkedBooter.invokeProviderInSameClassLoader(ForkedBooter.java:290) [surefire-booter-2.19.1.jar:2.19.1]
	at org.apache.maven.surefire.booter.ForkedBooter.runSuitesInProcess(ForkedBooter.java:242) [surefire-booter-2.19.1.jar:2.19.1]
	at org.apache.maven.surefire.booter.ForkedBooter.main(ForkedBooter.java:121) [surefire-booter-2.19.1.jar:2.19.1]
[main] ERROR io.siddhi.core.stream.input.source.SourceMapper [] - Error while processing 'symbol:"IFS",
price:50.6,
volume:200
~~~~~~~~~~
symbol:"Virtusa",
price:70.6,
volume:100', for the input Mapping 'text' for the stream 'FooStream'.
io.siddhi.core.exception.MappingFailedException: null
	at io.siddhi.extension.map.text.sourcemapper.TextSourceMapper.mapAndProcess(TextSourceMapper.java:278) ~[classes/:?]
	at io.siddhi.core.stream.input.source.SourceMapper.onEvent(SourceMapper.java:201) [siddhi-core-5.1.21.jar:?]
	at io.siddhi.core.stream.input.source.SourceMapper.onEvent(SourceMapper.java:145) [siddhi-core-5.1.21.jar:?]
	at io.siddhi.extension.map.text.sourcemapper.util.TestTrpInMemorySource$1.onMessage(TestTrpInMemorySource.java:79) [test-classes/:?]
	at io.siddhi.core.util.transport.InMemoryBroker$MessageBroker.broadcast(InMemoryBroker.java:110) [siddhi-core-5.1.21.jar:?]
	at io.siddhi.core.util.transport.InMemoryBroker$MessageBroker.publish(InMemoryBroker.java:118) [siddhi-core-5.1.21.jar:?]
	at io.siddhi.core.util.transport.InMemoryBroker.publish(InMemoryBroker.java:41) [siddhi-core-5.1.21.jar:?]
	at io.siddhi.extension.map.text.sourcemapper.TextDefaultSourceMapperTestCase.testTextSourceMapperGroupedEventsWithoutEnable(TextDefaultSourceMapperTestCase.java:589) [test-classes/:?]
	at sun.reflect.NativeMethodAccessorImpl.invoke0(Native Method) ~[?:1.8.0_171]
	at sun.reflect.NativeMethodAccessorImpl.invoke(NativeMethodAccessorImpl.java:62) ~[?:1.8.0_171]
	at sun.reflect.DelegatingMethodAccessorImpl.invoke(DelegatingMethodAccessorImpl.java:43) ~[?:1.8.0_171]
	at java.lang.reflect.Method.invoke(Method.java:498) ~[?:1.8.0_171]
	at org.testng.internal.MethodInvocationHelper.invokeMethod(MethodInvocationHelper.java:108) [testng-6.11.jar:?]
	at org.testng.internal.Invoker.invokeMethod(Invoker.java:661) [testng-6.11.jar:?]
	at org.testng.internal.Invoker.invokeTestMethod(Invoker.java:869) [testng-6.11.jar:?]
	at org.testng.internal.Invoker.invokeTestMethods(Invoker.java:1193) [testng-6.11.jar:?]
	at org.testng.internal.TestMethodWorker.invokeTestMethods(TestMethodWorker.java:126) [testng-6.11.jar:?]
	at org.testng.internal.TestMethodWorker.run(TestMethodWorker.java:109) [testng-6.11.jar:?]
	at org.testng.TestRunner.privateRun(TestRunner.java:744) [testng-6.11.jar:?]
	at org.testng.TestRunner.run(TestRunner.java:602) [testng-6.11.jar:?]
	at org.testng.SuiteRunner.runTest(SuiteRunner.java:380) [testng-6.11.jar:?]
	at org.testng.SuiteRunner.runSequentially(SuiteRunner.java:375) [testng-6.11.jar:?]
	at org.testng.SuiteRunner.privateRun(SuiteRunner.java:340) [testng-6.11.jar:?]
	at org.testng.SuiteRunner.run(SuiteRunner.java:289) [testng-6.11.jar:?]
	at org.testng.SuiteRunnerWorker.runSuite(SuiteRunnerWorker.java:52) [testng-6.11.jar:?]
	at org.testng.SuiteRunnerWorker.run(SuiteRunnerWorker.java:86) [testng-6.11.jar:?]
	at org.testng.TestNG.runSuitesSequentially(TestNG.java:1301) [testng-6.11.jar:?]
	at org.testng.TestNG.runSuitesLocally(TestNG.java:1226) [testng-6.11.jar:?]
	at org.testng.TestNG.runSuites(TestNG.java:1144) [testng-6.11.jar:?]
	at org.testng.TestNG.run(TestNG.java:1115) [testng-6.11.jar:?]
	at org.apache.maven.surefire.testng.TestNGExecutor.run(TestNGExecutor.java:281) [surefire-testng-2.19.1.jar:2.19.1]
	at org.apache.maven.surefire.testng.TestNGXmlTestSuite.execute(TestNGXmlTestSuite.java:75) [surefire-testng-2.19.1.jar:2.19.1]
	at org.apache.maven.surefire.testng.TestNGProvider.invoke(TestNGProvider.java:121) [surefire-testng-2.19.1.jar:2.19.1]
	at org.apache.maven.surefire.booter.ForkedBooter.invokeProviderInSameClassLoader(ForkedBooter.java:290) [surefire-booter-2.19.1.jar:2.19.1]
	at org.apache.maven.surefire.booter.ForkedBooter.runSuitesInProcess(ForkedBooter.java:242) [surefire-booter-2.19.1.jar:2.19.1]
	at org.apache.maven.surefire.booter.ForkedBooter.main(ForkedBooter.java:121) [surefire-booter-2.19.1.jar:2.19.1]
[main] ERROR io.siddhi.extension.map.text.sourcemapper.TextSourceMapper [] - Incompatible data format. Because value is 200
~~~~~~~~~~
symbol:"Virtusa" and attribute type is LONG in the stream FooStream of siddhi text input mapper.
[main] ERROR io.siddhi.extension.map.text.sourcemapper.TextSourceMapper [] - Exception occurred when converting Text message:symbol:"IFS",
price:50.6,
volume:200
~~~~~~~~~~
symbol:"Virtusa",
price:70.6,
volume:100 to Siddhi Event in the stream FooStream of siddhi text input mapper.
io.siddhi.core.exception.MappingFailedException: Incompatible data format. Because value is 200
~~~~~~~~~~
symbol:"Virtusa" and attribute type is LONG in the stream FooStream of siddhi text input mapper.
	at io.siddhi.extension.map.text.sourcemapper.TextSourceMapper.convertToDefaultEvents(TextSourceMapper.java:453) ~[classes/:?]
	at io.siddhi.extension.map.text.sourcemapper.TextSourceMapper.onEventHandler(TextSourceMapper.java:305) [classes/:?]
	at io.siddhi.extension.map.text.sourcemapper.TextSourceMapper.mapAndProcess(TextSourceMapper.java:255) [classes/:?]
	at io.siddhi.core.stream.input.source.SourceMapper.onEvent(SourceMapper.java:201) [siddhi-core-5.1.21.jar:?]
	at io.siddhi.core.stream.input.source.SourceMapper.onEvent(SourceMapper.java:145) [siddhi-core-5.1.21.jar:?]
	at io.siddhi.core.stream.input.source.InMemorySource$1.onMessage(InMemorySource.java:99) [siddhi-core-5.1.21.jar:?]
	at io.siddhi.core.util.transport.InMemoryBroker$MessageBroker.broadcast(InMemoryBroker.java:110) [siddhi-core-5.1.21.jar:?]
	at io.siddhi.core.util.transport.InMemoryBroker$MessageBroker.publish(InMemoryBroker.java:118) [siddhi-core-5.1.21.jar:?]
	at io.siddhi.core.util.transport.InMemoryBroker.publish(InMemoryBroker.java:41) [siddhi-core-5.1.21.jar:?]
	at io.siddhi.extension.map.text.sourcemapper.TextDefaultSourceMapperTestCase.testTextSourceMapperGroupedEventsWithoutEnable(TextDefaultSourceMapperTestCase.java:589) [test-classes/:?]
	at sun.reflect.NativeMethodAccessorImpl.invoke0(Native Method) ~[?:1.8.0_171]
	at sun.reflect.NativeMethodAccessorImpl.invoke(NativeMethodAccessorImpl.java:62) ~[?:1.8.0_171]
	at sun.reflect.DelegatingMethodAccessorImpl.invoke(DelegatingMethodAccessorImpl.java:43) ~[?:1.8.0_171]
	at java.lang.reflect.Method.invoke(Method.java:498) ~[?:1.8.0_171]
	at org.testng.internal.MethodInvocationHelper.invokeMethod(MethodInvocationHelper.java:108) [testng-6.11.jar:?]
	at org.testng.internal.Invoker.invokeMethod(Invoker.java:661) [testng-6.11.jar:?]
	at org.testng.internal.Invoker.invokeTestMethod(Invoker.java:869) [testng-6.11.jar:?]
	at org.testng.internal.Invoker.invokeTestMethods(Invoker.java:1193) [testng-6.11.jar:?]
	at org.testng.internal.TestMethodWorker.invokeTestMethods(TestMethodWorker.java:126) [testng-6.11.jar:?]
	at org.testng.internal.TestMethodWorker.run(TestMethodWorker.java:109) [testng-6.11.jar:?]
	at org.testng.TestRunner.privateRun(TestRunner.java:744) [testng-6.11.jar:?]
	at org.testng.TestRunner.run(TestRunner.java:602) [testng-6.11.jar:?]
	at org.testng.SuiteRunner.runTest(SuiteRunner.java:380) [testng-6.11.jar:?]
	at org.testng.SuiteRunner.runSequentially(SuiteRunner.java:375) [testng-6.11.jar:?]
	at org.testng.SuiteRunner.privateRun(SuiteRunner.java:340) [testng-6.11.jar:?]
	at org.testng.SuiteRunner.run(SuiteRunner.java:289) [testng-6.11.jar:?]
	at org.testng.SuiteRunnerWorker.runSuite(SuiteRunnerWorker.java:52) [testng-6.11.jar:?]
	at org.testng.SuiteRunnerWorker.run(SuiteRunnerWorker.java:86) [testng-6.11.jar:?]
	at org.testng.TestNG.runSuitesSequentially(TestNG.java:1301) [testng-6.11.jar:?]
	at org.testng.TestNG.runSuitesLocally(TestNG.java:1226) [testng-6.11.jar:?]
	at org.testng.TestNG.runSuites(TestNG.java:1144) [testng-6.11.jar:?]
	at org.testng.TestNG.run(TestNG.java:1115) [testng-6.11.jar:?]
	at org.apache.maven.surefire.testng.TestNGExecutor.run(TestNGExecutor.java:281) [surefire-testng-2.19.1.jar:2.19.1]
	at org.apache.maven.surefire.testng.TestNGXmlTestSuite.execute(TestNGXmlTestSuite.java:75) [surefire-testng-2.19.1.jar:2.19.1]
	at org.apache.maven.surefire.testng.TestNGProvider.invoke(TestNGProvider.java:121) [surefire-testng-2.19.1.jar:2.19.1]
	at org.apache.maven.surefire.booter.ForkedBooter.invokeProviderInSameClassLoader(ForkedBooter.java:290) [surefire-booter-2.19.1.jar:2.19.1]
	at org.apache.maven.surefire.booter.ForkedBooter.runSuitesInProcess(ForkedBooter.java:242) [surefire-booter-2.19.1.jar:2.19.1]
	at org.apache.maven.surefire.booter.ForkedBooter.main(ForkedBooter.java:121) [surefire-booter-2.19.1.jar:2.19.1]
[main] ERROR io.siddhi.core.stream.input.source.SourceMapper [] - Error while processing 'symbol:"IFS",
price:50.6,
volume:200
~~~~~~~~~~
symbol:"Virtusa",
price:70.6,
volume:100', for the input Mapping 'text' for the stream 'FooStream'.
io.siddhi.core.exception.MappingFailedException: null
	at io.siddhi.extension.map.text.sourcemapper.TextSourceMapper.mapAndProcess(TextSourceMapper.java:278) ~[classes/:?]
	at io.siddhi.core.stream.input.source.SourceMapper.onEvent(SourceMapper.java:201) [siddhi-core-5.1.21.jar:?]
	at io.siddhi.core.stream.input.source.SourceMapper.onEvent(SourceMapper.java:145) [siddhi-core-5.1.21.jar:?]
	at io.siddhi.core.stream.input.source.InMemorySource$1.onMessage(InMemorySource.java:99) [siddhi-core-5.1.21.jar:?]
	at io.siddhi.core.util.transport.InMemoryBroker$MessageBroker.broadcast(InMemoryBroker.java:110) [siddhi-core-5.1.21.jar:?]
	at io.siddhi.core.util.transport.InMemoryBroker$MessageBroker.publish(InMemoryBroker.java:118) [siddhi-core-5.1.21.jar:?]
	at io.siddhi.core.util.transport.InMemoryBroker.publish(InMemoryBroker.java:41) [siddhi-core-5.1.21.jar:?]
	at io.siddhi.extension.map.text.sourcemapper.TextDefaultSourceMapperTestCase.testTextSourceMapperGroupedEventsWithoutEnable(TextDefaultSourceMapperTestCase.java:589) [test-classes/:?]
	at sun.reflect.NativeMethodAccessorImpl.invoke0(Native Method) ~[?:1.8.0_171]
	at sun.reflect.NativeMethodAccessorImpl.invoke(NativeMethodAccessorImpl.java:62) ~[?:1.8.0_171]
	at sun.reflect.DelegatingMethodAccessorImpl.invoke(DelegatingMethodAccessorImpl.java:43) ~[?:1.8.0_171]
	at java.lang.reflect.Method.invoke(Method.java:498) ~[?:1.8.0_171]
	at org.testng.internal.MethodInvocationHelper.invokeMethod(MethodInvocationHelper.java:108) [testng-6.11.jar:?]
	at org.testng.internal.Invoker.invokeMethod(Invoker.java:661) [testng-6.11.jar:?]
	at org.testng.internal.Invoker.invokeTestMethod(Invoker.java:869) [testng-6.11.jar:?]
	at org.testng.internal.Invoker.invokeTestMethods(Invoker.java:1193) [testng-6.11.jar:?]
	at org.testng.internal.TestMethodWorker.invokeTestMethods(TestMethodWorker.java:126) [testng-6.11.jar:?]
	at org.testng.internal.TestMethodWorker.run(TestMethodWorker.java:109) [testng-6.11.jar:?]
	at org.testng.TestRunner.privateRun(TestRunner.java:744) [testng-6.11.jar:?]
	at org.testng.TestRunner.run(TestRunner.java:602) [testng-6.11.jar:?]
	at org.testng.SuiteRunner.runTest(SuiteRunner.java:380) [testng-6.11.jar:?]
	at org.testng.SuiteRunner.runSequentially(SuiteRunner.java:375) [testng-6.11.jar:?]
	at org.testng.SuiteRunner.privateRun(SuiteRunner.java:340) [testng-6.11.jar:?]
	at org.testng.SuiteRunner.run(SuiteRunner.java:289) [testng-6.11.jar:?]
	at org.testng.SuiteRunnerWorker.runSuite(SuiteRunnerWorker.java:52) [testng-6.11.jar:?]
	at org.testng.SuiteRunnerWorker.run(SuiteRunnerWorker.java:86) [testng-6.11.jar:?]
	at org.testng.TestNG.runSuitesSequentially(TestNG.java:1301) [testng-6.11.jar:?]
	at org.testng.TestNG.runSuitesLocally(TestNG.java:1226) [testng-6.11.jar:?]
	at org.testng.TestNG.runSuites(TestNG.java:1144) [testng-6.11.jar:?]
	at org.testng.TestNG.run(TestNG.java:1115) [testng-6.11.jar:?]
	at org.apache.maven.surefire.testng.TestNGExecutor.run(TestNGExecutor.java:281) [surefire-testng-2.19.1.jar:2.19.1]
	at org.apache.maven.surefire.testng.TestNGXmlTestSuite.execute(TestNGXmlTestSuite.java:75) [surefire-testng-2.19.1.jar:2.19.1]
	at org.apache.maven.surefire.testng.TestNGProvider.invoke(TestNGProvider.java:121) [surefire-testng-2.19.1.jar:2.19.1]
	at org.apache.maven.surefire.booter.ForkedBooter.invokeProviderInSameClassLoader(ForkedBooter.java:290) [surefire-booter-2.19.1.jar:2.19.1]
	at org.apache.maven.surefire.booter.ForkedBooter.runSuitesInProcess(ForkedBooter.java:242) [surefire-booter-2.19.1.jar:2.19.1]
	at org.apache.maven.surefire.booter.ForkedBooter.main(ForkedBooter.java:121) [surefire-booter-2.19.1.jar:2.19.1]
[main] INFO  io.siddhi.extension.map.text.sourcemapper.TextDefaultSourceMapperTestCase [] - test for present group of events when event.grouping is false.
[main] ERROR io.siddhi.extension.map.text.sourcemapper.TextSourceMapper [] - Invalid format of event symbol:"wso2",
price:55.6,
price:58.6,
volume:200 for attribute price could not find proper value while fail on missing attribute is 'true' in the stream FooStream of siddhi text input mapper.
[main] ERROR io.siddhi.extension.map.text.sourcemapper.TextSourceMapper [] - Exception occurred when converting Text message:symbol:"wso2",
price:55.6,
price:58.6,
volume:200 to Siddhi Event in the stream FooStream of siddhi text input mapper.
io.siddhi.core.exception.MappingFailedException: Invalid format of event symbol:"wso2",
price:55.6,
price:58.6,
volume:200 for attribute price could not find proper value while fail on missing attribute is 'true' in the stream FooStream of siddhi text input mapper.
	at io.siddhi.extension.map.text.sourcemapper.TextSourceMapper.convertToCustomEvents(TextSourceMapper.java:400) ~[classes/:?]
	at io.siddhi.extension.map.text.sourcemapper.TextSourceMapper.onEventHandler(TextSourceMapper.java:303) [classes/:?]
	at io.siddhi.extension.map.text.sourcemapper.TextSourceMapper.mapAndProcess(TextSourceMapper.java:255) [classes/:?]
	at io.siddhi.core.stream.input.source.SourceMapper.onEvent(SourceMapper.java:201) [siddhi-core-5.1.21.jar:?]
	at io.siddhi.core.stream.input.source.SourceMapper.onEvent(SourceMapper.java:145) [siddhi-core-5.1.21.jar:?]
	at io.siddhi.extension.map.text.sourcemapper.util.TestTrpInMemorySource$1.onMessage(TestTrpInMemorySource.java:79) [test-classes/:?]
	at io.siddhi.core.util.transport.InMemoryBroker$MessageBroker.broadcast(InMemoryBroker.java:110) [siddhi-core-5.1.21.jar:?]
	at io.siddhi.core.util.transport.InMemoryBroker$MessageBroker.publish(InMemoryBroker.java:118) [siddhi-core-5.1.21.jar:?]
	at io.siddhi.core.util.transport.InMemoryBroker.publish(InMemoryBroker.java:41) [siddhi-core-5.1.21.jar:?]
	at io.siddhi.extension.map.text.sourcemapper.TextDefaultSourceMapperTestCase.testTextSourceMapperGroupedEventsWithoutEnable2(TextDefaultSourceMapperTestCase.java:643) [test-classes/:?]
	at sun.reflect.NativeMethodAccessorImpl.invoke0(Native Method) ~[?:1.8.0_171]
	at sun.reflect.NativeMethodAccessorImpl.invoke(NativeMethodAccessorImpl.java:62) ~[?:1.8.0_171]
	at sun.reflect.DelegatingMethodAccessorImpl.invoke(DelegatingMethodAccessorImpl.java:43) ~[?:1.8.0_171]
	at java.lang.reflect.Method.invoke(Method.java:498) ~[?:1.8.0_171]
	at org.testng.internal.MethodInvocationHelper.invokeMethod(MethodInvocationHelper.java:108) [testng-6.11.jar:?]
	at org.testng.internal.Invoker.invokeMethod(Invoker.java:661) [testng-6.11.jar:?]
	at org.testng.internal.Invoker.invokeTestMethod(Invoker.java:869) [testng-6.11.jar:?]
	at org.testng.internal.Invoker.invokeTestMethods(Invoker.java:1193) [testng-6.11.jar:?]
	at org.testng.internal.TestMethodWorker.invokeTestMethods(TestMethodWorker.java:126) [testng-6.11.jar:?]
	at org.testng.internal.TestMethodWorker.run(TestMethodWorker.java:109) [testng-6.11.jar:?]
	at org.testng.TestRunner.privateRun(TestRunner.java:744) [testng-6.11.jar:?]
	at org.testng.TestRunner.run(TestRunner.java:602) [testng-6.11.jar:?]
	at org.testng.SuiteRunner.runTest(SuiteRunner.java:380) [testng-6.11.jar:?]
	at org.testng.SuiteRunner.runSequentially(SuiteRunner.java:375) [testng-6.11.jar:?]
	at org.testng.SuiteRunner.privateRun(SuiteRunner.java:340) [testng-6.11.jar:?]
	at org.testng.SuiteRunner.run(SuiteRunner.java:289) [testng-6.11.jar:?]
	at org.testng.SuiteRunnerWorker.runSuite(SuiteRunnerWorker.java:52) [testng-6.11.jar:?]
	at org.testng.SuiteRunnerWorker.run(SuiteRunnerWorker.java:86) [testng-6.11.jar:?]
	at org.testng.TestNG.runSuitesSequentially(TestNG.java:1301) [testng-6.11.jar:?]
	at org.testng.TestNG.runSuitesLocally(TestNG.java:1226) [testng-6.11.jar:?]
	at org.testng.TestNG.runSuites(TestNG.java:1144) [testng-6.11.jar:?]
	at org.testng.TestNG.run(TestNG.java:1115) [testng-6.11.jar:?]
	at org.apache.maven.surefire.testng.TestNGExecutor.run(TestNGExecutor.java:281) [surefire-testng-2.19.1.jar:2.19.1]
	at org.apache.maven.surefire.testng.TestNGXmlTestSuite.execute(TestNGXmlTestSuite.java:75) [surefire-testng-2.19.1.jar:2.19.1]
	at org.apache.maven.surefire.testng.TestNGProvider.invoke(TestNGProvider.java:121) [surefire-testng-2.19.1.jar:2.19.1]
	at org.apache.maven.surefire.booter.ForkedBooter.invokeProviderInSameClassLoader(ForkedBooter.java:290) [surefire-booter-2.19.1.jar:2.19.1]
	at org.apache.maven.surefire.booter.ForkedBooter.runSuitesInProcess(ForkedBooter.java:242) [surefire-booter-2.19.1.jar:2.19.1]
	at org.apache.maven.surefire.booter.ForkedBooter.main(ForkedBooter.java:121) [surefire-booter-2.19.1.jar:2.19.1]
[main] ERROR io.siddhi.core.stream.input.source.SourceMapper [] - Error while processing 'symbol:"wso2",
price:55.6,
price:58.6,
volume:200', for the input Mapping 'text' for the stream 'FooStream'.
io.siddhi.core.exception.MappingFailedException: null
	at io.siddhi.extension.map.text.sourcemapper.TextSourceMapper.mapAndProcess(TextSourceMapper.java:278) ~[classes/:?]
	at io.siddhi.core.stream.input.source.SourceMapper.onEvent(SourceMapper.java:201) [siddhi-core-5.1.21.jar:?]
	at io.siddhi.core.stream.input.source.SourceMapper.onEvent(SourceMapper.java:145) [siddhi-core-5.1.21.jar:?]
	at io.siddhi.extension.map.text.sourcemapper.util.TestTrpInMemorySource$1.onMessage(TestTrpInMemorySource.java:79) [test-classes/:?]
	at io.siddhi.core.util.transport.InMemoryBroker$MessageBroker.broadcast(InMemoryBroker.java:110) [siddhi-core-5.1.21.jar:?]
	at io.siddhi.core.util.transport.InMemoryBroker$MessageBroker.publish(InMemoryBroker.java:118) [siddhi-core-5.1.21.jar:?]
	at io.siddhi.core.util.transport.InMemoryBroker.publish(InMemoryBroker.java:41) [siddhi-core-5.1.21.jar:?]
	at io.siddhi.extension.map.text.sourcemapper.TextDefaultSourceMapperTestCase.testTextSourceMapperGroupedEventsWithoutEnable2(TextDefaultSourceMapperTestCase.java:643) [test-classes/:?]
	at sun.reflect.NativeMethodAccessorImpl.invoke0(Native Method) ~[?:1.8.0_171]
	at sun.reflect.NativeMethodAccessorImpl.invoke(NativeMethodAccessorImpl.java:62) ~[?:1.8.0_171]
	at sun.reflect.DelegatingMethodAccessorImpl.invoke(DelegatingMethodAccessorImpl.java:43) ~[?:1.8.0_171]
	at java.lang.reflect.Method.invoke(Method.java:498) ~[?:1.8.0_171]
	at org.testng.internal.MethodInvocationHelper.invokeMethod(MethodInvocationHelper.java:108) [testng-6.11.jar:?]
	at org.testng.internal.Invoker.invokeMethod(Invoker.java:661) [testng-6.11.jar:?]
	at org.testng.internal.Invoker.invokeTestMethod(Invoker.java:869) [testng-6.11.jar:?]
	at org.testng.internal.Invoker.invokeTestMethods(Invoker.java:1193) [testng-6.11.jar:?]
	at org.testng.internal.TestMethodWorker.invokeTestMethods(TestMethodWorker.java:126) [testng-6.11.jar:?]
	at org.testng.internal.TestMethodWorker.run(TestMethodWorker.java:109) [testng-6.11.jar:?]
	at org.testng.TestRunner.privateRun(TestRunner.java:744) [testng-6.11.jar:?]
	at org.testng.TestRunner.run(TestRunner.java:602) [testng-6.11.jar:?]
	at org.testng.SuiteRunner.runTest(SuiteRunner.java:380) [testng-6.11.jar:?]
	at org.testng.SuiteRunner.runSequentially(SuiteRunner.java:375) [testng-6.11.jar:?]
	at org.testng.SuiteRunner.privateRun(SuiteRunner.java:340) [testng-6.11.jar:?]
	at org.testng.SuiteRunner.run(SuiteRunner.java:289) [testng-6.11.jar:?]
	at org.testng.SuiteRunnerWorker.runSuite(SuiteRunnerWorker.java:52) [testng-6.11.jar:?]
	at org.testng.SuiteRunnerWorker.run(SuiteRunnerWorker.java:86) [testng-6.11.jar:?]
	at org.testng.TestNG.runSuitesSequentially(TestNG.java:1301) [testng-6.11.jar:?]
	at org.testng.TestNG.runSuitesLocally(TestNG.java:1226) [testng-6.11.jar:?]
	at org.testng.TestNG.runSuites(TestNG.java:1144) [testng-6.11.jar:?]
	at org.testng.TestNG.run(TestNG.java:1115) [testng-6.11.jar:?]
	at org.apache.maven.surefire.testng.TestNGExecutor.run(TestNGExecutor.java:281) [surefire-testng-2.19.1.jar:2.19.1]
	at org.apache.maven.surefire.testng.TestNGXmlTestSuite.execute(TestNGXmlTestSuite.java:75) [surefire-testng-2.19.1.jar:2.19.1]
	at org.apache.maven.surefire.testng.TestNGProvider.invoke(TestNGProvider.java:121) [surefire-testng-2.19.1.jar:2.19.1]
	at org.apache.maven.surefire.booter.ForkedBooter.invokeProviderInSameClassLoader(ForkedBooter.java:290) [surefire-booter-2.19.1.jar:2.19.1]
	at org.apache.maven.surefire.booter.ForkedBooter.runSuitesInProcess(ForkedBooter.java:242) [surefire-booter-2.19.1.jar:2.19.1]
	at org.apache.maven.surefire.booter.ForkedBooter.main(ForkedBooter.java:121) [surefire-booter-2.19.1.jar:2.19.1]
[main] ERROR io.siddhi.extension.map.text.sourcemapper.TextSourceMapper [] - Invalid format of event symbol:"wso2",
price:55.6,
price:58.6,
volume:200 for attribute price could not find proper value while fail on missing attribute is 'true' in the stream FooStream of siddhi text input mapper.
[main] ERROR io.siddhi.extension.map.text.sourcemapper.TextSourceMapper [] - Exception occurred when converting Text message:symbol:"wso2",
price:55.6,
price:58.6,
volume:200 to Siddhi Event in the stream FooStream of siddhi text input mapper.
io.siddhi.core.exception.MappingFailedException: Invalid format of event symbol:"wso2",
price:55.6,
price:58.6,
volume:200 for attribute price could not find proper value while fail on missing attribute is 'true' in the stream FooStream of siddhi text input mapper.
	at io.siddhi.extension.map.text.sourcemapper.TextSourceMapper.convertToCustomEvents(TextSourceMapper.java:400) ~[classes/:?]
	at io.siddhi.extension.map.text.sourcemapper.TextSourceMapper.onEventHandler(TextSourceMapper.java:303) [classes/:?]
	at io.siddhi.extension.map.text.sourcemapper.TextSourceMapper.mapAndProcess(TextSourceMapper.java:255) [classes/:?]
	at io.siddhi.core.stream.input.source.SourceMapper.onEvent(SourceMapper.java:201) [siddhi-core-5.1.21.jar:?]
	at io.siddhi.core.stream.input.source.SourceMapper.onEvent(SourceMapper.java:145) [siddhi-core-5.1.21.jar:?]
	at io.siddhi.extension.map.text.sourcemapper.util.TestTrpInMemorySource$1.onMessage(TestTrpInMemorySource.java:79) [test-classes/:?]
	at io.siddhi.core.util.transport.InMemoryBroker$MessageBroker.broadcast(InMemoryBroker.java:110) [siddhi-core-5.1.21.jar:?]
	at io.siddhi.core.util.transport.InMemoryBroker$MessageBroker.publish(InMemoryBroker.java:118) [siddhi-core-5.1.21.jar:?]
	at io.siddhi.core.util.transport.InMemoryBroker.publish(InMemoryBroker.java:41) [siddhi-core-5.1.21.jar:?]
	at io.siddhi.extension.map.text.sourcemapper.TextDefaultSourceMapperTestCase.testTextSourceMapperGroupedEventsWithoutEnable2(TextDefaultSourceMapperTestCase.java:643) [test-classes/:?]
	at sun.reflect.NativeMethodAccessorImpl.invoke0(Native Method) ~[?:1.8.0_171]
	at sun.reflect.NativeMethodAccessorImpl.invoke(NativeMethodAccessorImpl.java:62) ~[?:1.8.0_171]
	at sun.reflect.DelegatingMethodAccessorImpl.invoke(DelegatingMethodAccessorImpl.java:43) ~[?:1.8.0_171]
	at java.lang.reflect.Method.invoke(Method.java:498) ~[?:1.8.0_171]
	at org.testng.internal.MethodInvocationHelper.invokeMethod(MethodInvocationHelper.java:108) [testng-6.11.jar:?]
	at org.testng.internal.Invoker.invokeMethod(Invoker.java:661) [testng-6.11.jar:?]
	at org.testng.internal.Invoker.invokeTestMethod(Invoker.java:869) [testng-6.11.jar:?]
	at org.testng.internal.Invoker.invokeTestMethods(Invoker.java:1193) [testng-6.11.jar:?]
	at org.testng.internal.TestMethodWorker.invokeTestMethods(TestMethodWorker.java:126) [testng-6.11.jar:?]
	at org.testng.internal.TestMethodWorker.run(TestMethodWorker.java:109) [testng-6.11.jar:?]
	at org.testng.TestRunner.privateRun(TestRunner.java:744) [testng-6.11.jar:?]
	at org.testng.TestRunner.run(TestRunner.java:602) [testng-6.11.jar:?]
	at org.testng.SuiteRunner.runTest(SuiteRunner.java:380) [testng-6.11.jar:?]
	at org.testng.SuiteRunner.runSequentially(SuiteRunner.java:375) [testng-6.11.jar:?]
	at org.testng.SuiteRunner.privateRun(SuiteRunner.java:340) [testng-6.11.jar:?]
	at org.testng.SuiteRunner.run(SuiteRunner.java:289) [testng-6.11.jar:?]
	at org.testng.SuiteRunnerWorker.runSuite(SuiteRunnerWorker.java:52) [testng-6.11.jar:?]
	at org.testng.SuiteRunnerWorker.run(SuiteRunnerWorker.java:86) [testng-6.11.jar:?]
	at org.testng.TestNG.runSuitesSequentially(TestNG.java:1301) [testng-6.11.jar:?]
	at org.testng.TestNG.runSuitesLocally(TestNG.java:1226) [testng-6.11.jar:?]
	at org.testng.TestNG.runSuites(TestNG.java:1144) [testng-6.11.jar:?]
	at org.testng.TestNG.run(TestNG.java:1115) [testng-6.11.jar:?]
	at org.apache.maven.surefire.testng.TestNGExecutor.run(TestNGExecutor.java:281) [surefire-testng-2.19.1.jar:2.19.1]
	at org.apache.maven.surefire.testng.TestNGXmlTestSuite.execute(TestNGXmlTestSuite.java:75) [surefire-testng-2.19.1.jar:2.19.1]
	at org.apache.maven.surefire.testng.TestNGProvider.invoke(TestNGProvider.java:121) [surefire-testng-2.19.1.jar:2.19.1]
	at org.apache.maven.surefire.booter.ForkedBooter.invokeProviderInSameClassLoader(ForkedBooter.java:290) [surefire-booter-2.19.1.jar:2.19.1]
	at org.apache.maven.surefire.booter.ForkedBooter.runSuitesInProcess(ForkedBooter.java:242) [surefire-booter-2.19.1.jar:2.19.1]
	at org.apache.maven.surefire.booter.ForkedBooter.main(ForkedBooter.java:121) [surefire-booter-2.19.1.jar:2.19.1]
[main] ERROR io.siddhi.core.stream.input.source.SourceMapper [] - Error while processing 'symbol:"wso2",
price:55.6,
price:58.6,
volume:200', for the input Mapping 'text' for the stream 'FooStream'.
io.siddhi.core.exception.MappingFailedException: null
	at io.siddhi.extension.map.text.sourcemapper.TextSourceMapper.mapAndProcess(TextSourceMapper.java:278) ~[classes/:?]
	at io.siddhi.core.stream.input.source.SourceMapper.onEvent(SourceMapper.java:201) [siddhi-core-5.1.21.jar:?]
	at io.siddhi.core.stream.input.source.SourceMapper.onEvent(SourceMapper.java:145) [siddhi-core-5.1.21.jar:?]
	at io.siddhi.extension.map.text.sourcemapper.util.TestTrpInMemorySource$1.onMessage(TestTrpInMemorySource.java:79) [test-classes/:?]
	at io.siddhi.core.util.transport.InMemoryBroker$MessageBroker.broadcast(InMemoryBroker.java:110) [siddhi-core-5.1.21.jar:?]
	at io.siddhi.core.util.transport.InMemoryBroker$MessageBroker.publish(InMemoryBroker.java:118) [siddhi-core-5.1.21.jar:?]
	at io.siddhi.core.util.transport.InMemoryBroker.publish(InMemoryBroker.java:41) [siddhi-core-5.1.21.jar:?]
	at io.siddhi.extension.map.text.sourcemapper.TextDefaultSourceMapperTestCase.testTextSourceMapperGroupedEventsWithoutEnable2(TextDefaultSourceMapperTestCase.java:643) [test-classes/:?]
	at sun.reflect.NativeMethodAccessorImpl.invoke0(Native Method) ~[?:1.8.0_171]
	at sun.reflect.NativeMethodAccessorImpl.invoke(NativeMethodAccessorImpl.java:62) ~[?:1.8.0_171]
	at sun.reflect.DelegatingMethodAccessorImpl.invoke(DelegatingMethodAccessorImpl.java:43) ~[?:1.8.0_171]
	at java.lang.reflect.Method.invoke(Method.java:498) ~[?:1.8.0_171]
	at org.testng.internal.MethodInvocationHelper.invokeMethod(MethodInvocationHelper.java:108) [testng-6.11.jar:?]
	at org.testng.internal.Invoker.invokeMethod(Invoker.java:661) [testng-6.11.jar:?]
	at org.testng.internal.Invoker.invokeTestMethod(Invoker.java:869) [testng-6.11.jar:?]
	at org.testng.internal.Invoker.invokeTestMethods(Invoker.java:1193) [testng-6.11.jar:?]
	at org.testng.internal.TestMethodWorker.invokeTestMethods(TestMethodWorker.java:126) [testng-6.11.jar:?]
	at org.testng.internal.TestMethodWorker.run(TestMethodWorker.java:109) [testng-6.11.jar:?]
	at org.testng.TestRunner.privateRun(TestRunner.java:744) [testng-6.11.jar:?]
	at org.testng.TestRunner.run(TestRunner.java:602) [testng-6.11.jar:?]
	at org.testng.SuiteRunner.runTest(SuiteRunner.java:380) [testng-6.11.jar:?]
	at org.testng.SuiteRunner.runSequentially(SuiteRunner.java:375) [testng-6.11.jar:?]
	at org.testng.SuiteRunner.privateRun(SuiteRunner.java:340) [testng-6.11.jar:?]
	at org.testng.SuiteRunner.run(SuiteRunner.java:289) [testng-6.11.jar:?]
	at org.testng.SuiteRunnerWorker.runSuite(SuiteRunnerWorker.java:52) [testng-6.11.jar:?]
	at org.testng.SuiteRunnerWorker.run(SuiteRunnerWorker.java:86) [testng-6.11.jar:?]
	at org.testng.TestNG.runSuitesSequentially(TestNG.java:1301) [testng-6.11.jar:?]
	at org.testng.TestNG.runSuitesLocally(TestNG.java:1226) [testng-6.11.jar:?]
	at org.testng.TestNG.runSuites(TestNG.java:1144) [testng-6.11.jar:?]
	at org.testng.TestNG.run(TestNG.java:1115) [testng-6.11.jar:?]
	at org.apache.maven.surefire.testng.TestNGExecutor.run(TestNGExecutor.java:281) [surefire-testng-2.19.1.jar:2.19.1]
	at org.apache.maven.surefire.testng.TestNGXmlTestSuite.execute(TestNGXmlTestSuite.java:75) [surefire-testng-2.19.1.jar:2.19.1]
	at org.apache.maven.surefire.testng.TestNGProvider.invoke(TestNGProvider.java:121) [surefire-testng-2.19.1.jar:2.19.1]
	at org.apache.maven.surefire.booter.ForkedBooter.invokeProviderInSameClassLoader(ForkedBooter.java:290) [surefire-booter-2.19.1.jar:2.19.1]
	at org.apache.maven.surefire.booter.ForkedBooter.runSuitesInProcess(ForkedBooter.java:242) [surefire-booter-2.19.1.jar:2.19.1]
	at org.apache.maven.surefire.booter.ForkedBooter.main(ForkedBooter.java:121) [surefire-booter-2.19.1.jar:2.19.1]
[main] INFO  io.siddhi.core.util.EventPrinter [] - [Event{timestamp=1645063637581, data=[wso2, 55.6, 200], isExpired=false}]
[main] ERROR io.siddhi.extension.map.text.sourcemapper.TextSourceMapper [] - Invalid format of event symbol:"IFS",
price:50.6,
volume:200,
symbol:"IBM" for attribute price could not find proper value while fail on missing attribute is 'true' in the stream FooStream of siddhi text input mapper.
[main] ERROR io.siddhi.extension.map.text.sourcemapper.TextSourceMapper [] - Exception occurred when converting Text message:symbol:"IFS",
price:50.6,
volume:200,
symbol:"IBM" to Siddhi Event in the stream FooStream of siddhi text input mapper.
io.siddhi.core.exception.MappingFailedException: Invalid format of event symbol:"IFS",
price:50.6,
volume:200,
symbol:"IBM" for attribute price could not find proper value while fail on missing attribute is 'true' in the stream FooStream of siddhi text input mapper.
	at io.siddhi.extension.map.text.sourcemapper.TextSourceMapper.convertToCustomEvents(TextSourceMapper.java:400) ~[classes/:?]
	at io.siddhi.extension.map.text.sourcemapper.TextSourceMapper.onEventHandler(TextSourceMapper.java:303) [classes/:?]
	at io.siddhi.extension.map.text.sourcemapper.TextSourceMapper.mapAndProcess(TextSourceMapper.java:255) [classes/:?]
	at io.siddhi.core.stream.input.source.SourceMapper.onEvent(SourceMapper.java:201) [siddhi-core-5.1.21.jar:?]
	at io.siddhi.core.stream.input.source.SourceMapper.onEvent(SourceMapper.java:145) [siddhi-core-5.1.21.jar:?]
	at io.siddhi.extension.map.text.sourcemapper.util.TestTrpInMemorySource$1.onMessage(TestTrpInMemorySource.java:79) [test-classes/:?]
	at io.siddhi.core.util.transport.InMemoryBroker$MessageBroker.broadcast(InMemoryBroker.java:110) [siddhi-core-5.1.21.jar:?]
	at io.siddhi.core.util.transport.InMemoryBroker$MessageBroker.publish(InMemoryBroker.java:118) [siddhi-core-5.1.21.jar:?]
	at io.siddhi.core.util.transport.InMemoryBroker.publish(InMemoryBroker.java:41) [siddhi-core-5.1.21.jar:?]
	at io.siddhi.extension.map.text.sourcemapper.TextDefaultSourceMapperTestCase.testTextSourceMapperGroupedEventsWithoutEnable2(TextDefaultSourceMapperTestCase.java:644) [test-classes/:?]
	at sun.reflect.NativeMethodAccessorImpl.invoke0(Native Method) ~[?:1.8.0_171]
	at sun.reflect.NativeMethodAccessorImpl.invoke(NativeMethodAccessorImpl.java:62) ~[?:1.8.0_171]
	at sun.reflect.DelegatingMethodAccessorImpl.invoke(DelegatingMethodAccessorImpl.java:43) ~[?:1.8.0_171]
	at java.lang.reflect.Method.invoke(Method.java:498) ~[?:1.8.0_171]
	at org.testng.internal.MethodInvocationHelper.invokeMethod(MethodInvocationHelper.java:108) [testng-6.11.jar:?]
	at org.testng.internal.Invoker.invokeMethod(Invoker.java:661) [testng-6.11.jar:?]
	at org.testng.internal.Invoker.invokeTestMethod(Invoker.java:869) [testng-6.11.jar:?]
	at org.testng.internal.Invoker.invokeTestMethods(Invoker.java:1193) [testng-6.11.jar:?]
	at org.testng.internal.TestMethodWorker.invokeTestMethods(TestMethodWorker.java:126) [testng-6.11.jar:?]
	at org.testng.internal.TestMethodWorker.run(TestMethodWorker.java:109) [testng-6.11.jar:?]
	at org.testng.TestRunner.privateRun(TestRunner.java:744) [testng-6.11.jar:?]
	at org.testng.TestRunner.run(TestRunner.java:602) [testng-6.11.jar:?]
	at org.testng.SuiteRunner.runTest(SuiteRunner.java:380) [testng-6.11.jar:?]
	at org.testng.SuiteRunner.runSequentially(SuiteRunner.java:375) [testng-6.11.jar:?]
	at org.testng.SuiteRunner.privateRun(SuiteRunner.java:340) [testng-6.11.jar:?]
	at org.testng.SuiteRunner.run(SuiteRunner.java:289) [testng-6.11.jar:?]
	at org.testng.SuiteRunnerWorker.runSuite(SuiteRunnerWorker.java:52) [testng-6.11.jar:?]
	at org.testng.SuiteRunnerWorker.run(SuiteRunnerWorker.java:86) [testng-6.11.jar:?]
	at org.testng.TestNG.runSuitesSequentially(TestNG.java:1301) [testng-6.11.jar:?]
	at org.testng.TestNG.runSuitesLocally(TestNG.java:1226) [testng-6.11.jar:?]
	at org.testng.TestNG.runSuites(TestNG.java:1144) [testng-6.11.jar:?]
	at org.testng.TestNG.run(TestNG.java:1115) [testng-6.11.jar:?]
	at org.apache.maven.surefire.testng.TestNGExecutor.run(TestNGExecutor.java:281) [surefire-testng-2.19.1.jar:2.19.1]
	at org.apache.maven.surefire.testng.TestNGXmlTestSuite.execute(TestNGXmlTestSuite.java:75) [surefire-testng-2.19.1.jar:2.19.1]
	at org.apache.maven.surefire.testng.TestNGProvider.invoke(TestNGProvider.java:121) [surefire-testng-2.19.1.jar:2.19.1]
	at org.apache.maven.surefire.booter.ForkedBooter.invokeProviderInSameClassLoader(ForkedBooter.java:290) [surefire-booter-2.19.1.jar:2.19.1]
	at org.apache.maven.surefire.booter.ForkedBooter.runSuitesInProcess(ForkedBooter.java:242) [surefire-booter-2.19.1.jar:2.19.1]
	at org.apache.maven.surefire.booter.ForkedBooter.main(ForkedBooter.java:121) [surefire-booter-2.19.1.jar:2.19.1]
[main] ERROR io.siddhi.core.stream.input.source.SourceMapper [] - Error while processing 'symbol:"IFS",
price:50.6,
volume:200,
symbol:"IBM"', for the input Mapping 'text' for the stream 'FooStream'.
io.siddhi.core.exception.MappingFailedException: null
	at io.siddhi.extension.map.text.sourcemapper.TextSourceMapper.mapAndProcess(TextSourceMapper.java:278) ~[classes/:?]
	at io.siddhi.core.stream.input.source.SourceMapper.onEvent(SourceMapper.java:201) [siddhi-core-5.1.21.jar:?]
	at io.siddhi.core.stream.input.source.SourceMapper.onEvent(SourceMapper.java:145) [siddhi-core-5.1.21.jar:?]
	at io.siddhi.extension.map.text.sourcemapper.util.TestTrpInMemorySource$1.onMessage(TestTrpInMemorySource.java:79) [test-classes/:?]
	at io.siddhi.core.util.transport.InMemoryBroker$MessageBroker.broadcast(InMemoryBroker.java:110) [siddhi-core-5.1.21.jar:?]
	at io.siddhi.core.util.transport.InMemoryBroker$MessageBroker.publish(InMemoryBroker.java:118) [siddhi-core-5.1.21.jar:?]
	at io.siddhi.core.util.transport.InMemoryBroker.publish(InMemoryBroker.java:41) [siddhi-core-5.1.21.jar:?]
	at io.siddhi.extension.map.text.sourcemapper.TextDefaultSourceMapperTestCase.testTextSourceMapperGroupedEventsWithoutEnable2(TextDefaultSourceMapperTestCase.java:644) [test-classes/:?]
	at sun.reflect.NativeMethodAccessorImpl.invoke0(Native Method) ~[?:1.8.0_171]
	at sun.reflect.NativeMethodAccessorImpl.invoke(NativeMethodAccessorImpl.java:62) ~[?:1.8.0_171]
	at sun.reflect.DelegatingMethodAccessorImpl.invoke(DelegatingMethodAccessorImpl.java:43) ~[?:1.8.0_171]
	at java.lang.reflect.Method.invoke(Method.java:498) ~[?:1.8.0_171]
	at org.testng.internal.MethodInvocationHelper.invokeMethod(MethodInvocationHelper.java:108) [testng-6.11.jar:?]
	at org.testng.internal.Invoker.invokeMethod(Invoker.java:661) [testng-6.11.jar:?]
	at org.testng.internal.Invoker.invokeTestMethod(Invoker.java:869) [testng-6.11.jar:?]
	at org.testng.internal.Invoker.invokeTestMethods(Invoker.java:1193) [testng-6.11.jar:?]
	at org.testng.internal.TestMethodWorker.invokeTestMethods(TestMethodWorker.java:126) [testng-6.11.jar:?]
	at org.testng.internal.TestMethodWorker.run(TestMethodWorker.java:109) [testng-6.11.jar:?]
	at org.testng.TestRunner.privateRun(TestRunner.java:744) [testng-6.11.jar:?]
	at org.testng.TestRunner.run(TestRunner.java:602) [testng-6.11.jar:?]
	at org.testng.SuiteRunner.runTest(SuiteRunner.java:380) [testng-6.11.jar:?]
	at org.testng.SuiteRunner.runSequentially(SuiteRunner.java:375) [testng-6.11.jar:?]
	at org.testng.SuiteRunner.privateRun(SuiteRunner.java:340) [testng-6.11.jar:?]
	at org.testng.SuiteRunner.run(SuiteRunner.java:289) [testng-6.11.jar:?]
	at org.testng.SuiteRunnerWorker.runSuite(SuiteRunnerWorker.java:52) [testng-6.11.jar:?]
	at org.testng.SuiteRunnerWorker.run(SuiteRunnerWorker.java:86) [testng-6.11.jar:?]
	at org.testng.TestNG.runSuitesSequentially(TestNG.java:1301) [testng-6.11.jar:?]
	at org.testng.TestNG.runSuitesLocally(TestNG.java:1226) [testng-6.11.jar:?]
	at org.testng.TestNG.runSuites(TestNG.java:1144) [testng-6.11.jar:?]
	at org.testng.TestNG.run(TestNG.java:1115) [testng-6.11.jar:?]
	at org.apache.maven.surefire.testng.TestNGExecutor.run(TestNGExecutor.java:281) [surefire-testng-2.19.1.jar:2.19.1]
	at org.apache.maven.surefire.testng.TestNGXmlTestSuite.execute(TestNGXmlTestSuite.java:75) [surefire-testng-2.19.1.jar:2.19.1]
	at org.apache.maven.surefire.testng.TestNGProvider.invoke(TestNGProvider.java:121) [surefire-testng-2.19.1.jar:2.19.1]
	at org.apache.maven.surefire.booter.ForkedBooter.invokeProviderInSameClassLoader(ForkedBooter.java:290) [surefire-booter-2.19.1.jar:2.19.1]
	at org.apache.maven.surefire.booter.ForkedBooter.runSuitesInProcess(ForkedBooter.java:242) [surefire-booter-2.19.1.jar:2.19.1]
	at org.apache.maven.surefire.booter.ForkedBooter.main(ForkedBooter.java:121) [surefire-booter-2.19.1.jar:2.19.1]
[main] ERROR io.siddhi.extension.map.text.sourcemapper.TextSourceMapper [] - Invalid format of event symbol:"IFS",
price:50.6,
volume:200,
symbol:"IBM" for attribute price could not find proper value while fail on missing attribute is 'true' in the stream FooStream of siddhi text input mapper.
[main] ERROR io.siddhi.extension.map.text.sourcemapper.TextSourceMapper [] - Exception occurred when converting Text message:symbol:"IFS",
price:50.6,
volume:200,
symbol:"IBM" to Siddhi Event in the stream FooStream of siddhi text input mapper.
io.siddhi.core.exception.MappingFailedException: Invalid format of event symbol:"IFS",
price:50.6,
volume:200,
symbol:"IBM" for attribute price could not find proper value while fail on missing attribute is 'true' in the stream FooStream of siddhi text input mapper.
	at io.siddhi.extension.map.text.sourcemapper.TextSourceMapper.convertToCustomEvents(TextSourceMapper.java:400) ~[classes/:?]
	at io.siddhi.extension.map.text.sourcemapper.TextSourceMapper.onEventHandler(TextSourceMapper.java:303) [classes/:?]
	at io.siddhi.extension.map.text.sourcemapper.TextSourceMapper.mapAndProcess(TextSourceMapper.java:255) [classes/:?]
	at io.siddhi.core.stream.input.source.SourceMapper.onEvent(SourceMapper.java:201) [siddhi-core-5.1.21.jar:?]
	at io.siddhi.core.stream.input.source.SourceMapper.onEvent(SourceMapper.java:145) [siddhi-core-5.1.21.jar:?]
	at io.siddhi.extension.map.text.sourcemapper.util.TestTrpInMemorySource$1.onMessage(TestTrpInMemorySource.java:79) [test-classes/:?]
	at io.siddhi.core.util.transport.InMemoryBroker$MessageBroker.broadcast(InMemoryBroker.java:110) [siddhi-core-5.1.21.jar:?]
	at io.siddhi.core.util.transport.InMemoryBroker$MessageBroker.publish(InMemoryBroker.java:118) [siddhi-core-5.1.21.jar:?]
	at io.siddhi.core.util.transport.InMemoryBroker.publish(InMemoryBroker.java:41) [siddhi-core-5.1.21.jar:?]
	at io.siddhi.extension.map.text.sourcemapper.TextDefaultSourceMapperTestCase.testTextSourceMapperGroupedEventsWithoutEnable2(TextDefaultSourceMapperTestCase.java:644) [test-classes/:?]
	at sun.reflect.NativeMethodAccessorImpl.invoke0(Native Method) ~[?:1.8.0_171]
	at sun.reflect.NativeMethodAccessorImpl.invoke(NativeMethodAccessorImpl.java:62) ~[?:1.8.0_171]
	at sun.reflect.DelegatingMethodAccessorImpl.invoke(DelegatingMethodAccessorImpl.java:43) ~[?:1.8.0_171]
	at java.lang.reflect.Method.invoke(Method.java:498) ~[?:1.8.0_171]
	at org.testng.internal.MethodInvocationHelper.invokeMethod(MethodInvocationHelper.java:108) [testng-6.11.jar:?]
	at org.testng.internal.Invoker.invokeMethod(Invoker.java:661) [testng-6.11.jar:?]
	at org.testng.internal.Invoker.invokeTestMethod(Invoker.java:869) [testng-6.11.jar:?]
	at org.testng.internal.Invoker.invokeTestMethods(Invoker.java:1193) [testng-6.11.jar:?]
	at org.testng.internal.TestMethodWorker.invokeTestMethods(TestMethodWorker.java:126) [testng-6.11.jar:?]
	at org.testng.internal.TestMethodWorker.run(TestMethodWorker.java:109) [testng-6.11.jar:?]
	at org.testng.TestRunner.privateRun(TestRunner.java:744) [testng-6.11.jar:?]
	at org.testng.TestRunner.run(TestRunner.java:602) [testng-6.11.jar:?]
	at org.testng.SuiteRunner.runTest(SuiteRunner.java:380) [testng-6.11.jar:?]
	at org.testng.SuiteRunner.runSequentially(SuiteRunner.java:375) [testng-6.11.jar:?]
	at org.testng.SuiteRunner.privateRun(SuiteRunner.java:340) [testng-6.11.jar:?]
	at org.testng.SuiteRunner.run(SuiteRunner.java:289) [testng-6.11.jar:?]
	at org.testng.SuiteRunnerWorker.runSuite(SuiteRunnerWorker.java:52) [testng-6.11.jar:?]
	at org.testng.SuiteRunnerWorker.run(SuiteRunnerWorker.java:86) [testng-6.11.jar:?]
	at org.testng.TestNG.runSuitesSequentially(TestNG.java:1301) [testng-6.11.jar:?]
	at org.testng.TestNG.runSuitesLocally(TestNG.java:1226) [testng-6.11.jar:?]
	at org.testng.TestNG.runSuites(TestNG.java:1144) [testng-6.11.jar:?]
	at org.testng.TestNG.run(TestNG.java:1115) [testng-6.11.jar:?]
	at org.apache.maven.surefire.testng.TestNGExecutor.run(TestNGExecutor.java:281) [surefire-testng-2.19.1.jar:2.19.1]
	at org.apache.maven.surefire.testng.TestNGXmlTestSuite.execute(TestNGXmlTestSuite.java:75) [surefire-testng-2.19.1.jar:2.19.1]
	at org.apache.maven.surefire.testng.TestNGProvider.invoke(TestNGProvider.java:121) [surefire-testng-2.19.1.jar:2.19.1]
	at org.apache.maven.surefire.booter.ForkedBooter.invokeProviderInSameClassLoader(ForkedBooter.java:290) [surefire-booter-2.19.1.jar:2.19.1]
	at org.apache.maven.surefire.booter.ForkedBooter.runSuitesInProcess(ForkedBooter.java:242) [surefire-booter-2.19.1.jar:2.19.1]
	at org.apache.maven.surefire.booter.ForkedBooter.main(ForkedBooter.java:121) [surefire-booter-2.19.1.jar:2.19.1]
[main] ERROR io.siddhi.core.stream.input.source.SourceMapper [] - Error while processing 'symbol:"IFS",
price:50.6,
volume:200,
symbol:"IBM"', for the input Mapping 'text' for the stream 'FooStream'.
io.siddhi.core.exception.MappingFailedException: null
	at io.siddhi.extension.map.text.sourcemapper.TextSourceMapper.mapAndProcess(TextSourceMapper.java:278) ~[classes/:?]
	at io.siddhi.core.stream.input.source.SourceMapper.onEvent(SourceMapper.java:201) [siddhi-core-5.1.21.jar:?]
	at io.siddhi.core.stream.input.source.SourceMapper.onEvent(SourceMapper.java:145) [siddhi-core-5.1.21.jar:?]
	at io.siddhi.extension.map.text.sourcemapper.util.TestTrpInMemorySource$1.onMessage(TestTrpInMemorySource.java:79) [test-classes/:?]
	at io.siddhi.core.util.transport.InMemoryBroker$MessageBroker.broadcast(InMemoryBroker.java:110) [siddhi-core-5.1.21.jar:?]
	at io.siddhi.core.util.transport.InMemoryBroker$MessageBroker.publish(InMemoryBroker.java:118) [siddhi-core-5.1.21.jar:?]
	at io.siddhi.core.util.transport.InMemoryBroker.publish(InMemoryBroker.java:41) [siddhi-core-5.1.21.jar:?]
	at io.siddhi.extension.map.text.sourcemapper.TextDefaultSourceMapperTestCase.testTextSourceMapperGroupedEventsWithoutEnable2(TextDefaultSourceMapperTestCase.java:644) [test-classes/:?]
	at sun.reflect.NativeMethodAccessorImpl.invoke0(Native Method) ~[?:1.8.0_171]
	at sun.reflect.NativeMethodAccessorImpl.invoke(NativeMethodAccessorImpl.java:62) ~[?:1.8.0_171]
	at sun.reflect.DelegatingMethodAccessorImpl.invoke(DelegatingMethodAccessorImpl.java:43) ~[?:1.8.0_171]
	at java.lang.reflect.Method.invoke(Method.java:498) ~[?:1.8.0_171]
	at org.testng.internal.MethodInvocationHelper.invokeMethod(MethodInvocationHelper.java:108) [testng-6.11.jar:?]
	at org.testng.internal.Invoker.invokeMethod(Invoker.java:661) [testng-6.11.jar:?]
	at org.testng.internal.Invoker.invokeTestMethod(Invoker.java:869) [testng-6.11.jar:?]
	at org.testng.internal.Invoker.invokeTestMethods(Invoker.java:1193) [testng-6.11.jar:?]
	at org.testng.internal.TestMethodWorker.invokeTestMethods(TestMethodWorker.java:126) [testng-6.11.jar:?]
	at org.testng.internal.TestMethodWorker.run(TestMethodWorker.java:109) [testng-6.11.jar:?]
	at org.testng.TestRunner.privateRun(TestRunner.java:744) [testng-6.11.jar:?]
	at org.testng.TestRunner.run(TestRunner.java:602) [testng-6.11.jar:?]
	at org.testng.SuiteRunner.runTest(SuiteRunner.java:380) [testng-6.11.jar:?]
	at org.testng.SuiteRunner.runSequentially(SuiteRunner.java:375) [testng-6.11.jar:?]
	at org.testng.SuiteRunner.privateRun(SuiteRunner.java:340) [testng-6.11.jar:?]
	at org.testng.SuiteRunner.run(SuiteRunner.java:289) [testng-6.11.jar:?]
	at org.testng.SuiteRunnerWorker.runSuite(SuiteRunnerWorker.java:52) [testng-6.11.jar:?]
	at org.testng.SuiteRunnerWorker.run(SuiteRunnerWorker.java:86) [testng-6.11.jar:?]
	at org.testng.TestNG.runSuitesSequentially(TestNG.java:1301) [testng-6.11.jar:?]
	at org.testng.TestNG.runSuitesLocally(TestNG.java:1226) [testng-6.11.jar:?]
	at org.testng.TestNG.runSuites(TestNG.java:1144) [testng-6.11.jar:?]
	at org.testng.TestNG.run(TestNG.java:1115) [testng-6.11.jar:?]
	at org.apache.maven.surefire.testng.TestNGExecutor.run(TestNGExecutor.java:281) [surefire-testng-2.19.1.jar:2.19.1]
	at org.apache.maven.surefire.testng.TestNGXmlTestSuite.execute(TestNGXmlTestSuite.java:75) [surefire-testng-2.19.1.jar:2.19.1]
	at org.apache.maven.surefire.testng.TestNGProvider.invoke(TestNGProvider.java:121) [surefire-testng-2.19.1.jar:2.19.1]
	at org.apache.maven.surefire.booter.ForkedBooter.invokeProviderInSameClassLoader(ForkedBooter.java:290) [surefire-booter-2.19.1.jar:2.19.1]
	at org.apache.maven.surefire.booter.ForkedBooter.runSuitesInProcess(ForkedBooter.java:242) [surefire-booter-2.19.1.jar:2.19.1]
	at org.apache.maven.surefire.booter.ForkedBooter.main(ForkedBooter.java:121) [surefire-booter-2.19.1.jar:2.19.1]
[main] INFO  io.siddhi.core.util.EventPrinter [] - [Event{timestamp=1645063637582, data=[IFS, 50.6, 200], isExpired=false}]
[main] INFO  io.siddhi.extension.map.text.sourcemapper.TextDefaultSourceMapperTestCase [] - Test for missing attributes.
[main] ERROR io.siddhi.extension.map.text.sourcemapper.TextSourceMapper [] - Invalid format of event symbol:"wso2",
price:55.6
####
symbol:"IBM",
price:75.6 for attribute price could not find proper value while fail on missing attribute is 'true' in the stream FooStream of siddhi text input mapper.
[main] ERROR io.siddhi.extension.map.text.sourcemapper.TextSourceMapper [] - Exception occurred when converting Text message:symbol:"wso2",
price:55.6
####
symbol:"IBM",
price:75.6 to Siddhi Event in the stream FooStream of siddhi text input mapper.
io.siddhi.core.exception.MappingFailedException: Invalid format of event symbol:"wso2",
price:55.6
####
symbol:"IBM",
price:75.6 for attribute price could not find proper value while fail on missing attribute is 'true' in the stream FooStream of siddhi text input mapper.
	at io.siddhi.extension.map.text.sourcemapper.TextSourceMapper.convertToCustomEvents(TextSourceMapper.java:400) ~[classes/:?]
	at io.siddhi.extension.map.text.sourcemapper.TextSourceMapper.onEventHandler(TextSourceMapper.java:303) [classes/:?]
	at io.siddhi.extension.map.text.sourcemapper.TextSourceMapper.mapAndProcess(TextSourceMapper.java:255) [classes/:?]
	at io.siddhi.core.stream.input.source.SourceMapper.onEvent(SourceMapper.java:201) [siddhi-core-5.1.21.jar:?]
	at io.siddhi.core.stream.input.source.SourceMapper.onEvent(SourceMapper.java:145) [siddhi-core-5.1.21.jar:?]
	at io.siddhi.extension.map.text.sourcemapper.util.TestTrpInMemorySource$1.onMessage(TestTrpInMemorySource.java:79) [test-classes/:?]
	at io.siddhi.core.util.transport.InMemoryBroker$MessageBroker.broadcast(InMemoryBroker.java:110) [siddhi-core-5.1.21.jar:?]
	at io.siddhi.core.util.transport.InMemoryBroker$MessageBroker.publish(InMemoryBroker.java:118) [siddhi-core-5.1.21.jar:?]
	at io.siddhi.core.util.transport.InMemoryBroker.publish(InMemoryBroker.java:41) [siddhi-core-5.1.21.jar:?]
	at io.siddhi.extension.map.text.sourcemapper.TextDefaultSourceMapperTestCase.testTextSourceMapperMissingAttribute(TextDefaultSourceMapperTestCase.java:466) [test-classes/:?]
	at sun.reflect.NativeMethodAccessorImpl.invoke0(Native Method) ~[?:1.8.0_171]
	at sun.reflect.NativeMethodAccessorImpl.invoke(NativeMethodAccessorImpl.java:62) ~[?:1.8.0_171]
	at sun.reflect.DelegatingMethodAccessorImpl.invoke(DelegatingMethodAccessorImpl.java:43) ~[?:1.8.0_171]
	at java.lang.reflect.Method.invoke(Method.java:498) ~[?:1.8.0_171]
	at org.testng.internal.MethodInvocationHelper.invokeMethod(MethodInvocationHelper.java:108) [testng-6.11.jar:?]
	at org.testng.internal.Invoker.invokeMethod(Invoker.java:661) [testng-6.11.jar:?]
	at org.testng.internal.Invoker.invokeTestMethod(Invoker.java:869) [testng-6.11.jar:?]
	at org.testng.internal.Invoker.invokeTestMethods(Invoker.java:1193) [testng-6.11.jar:?]
	at org.testng.internal.TestMethodWorker.invokeTestMethods(TestMethodWorker.java:126) [testng-6.11.jar:?]
	at org.testng.internal.TestMethodWorker.run(TestMethodWorker.java:109) [testng-6.11.jar:?]
	at org.testng.TestRunner.privateRun(TestRunner.java:744) [testng-6.11.jar:?]
	at org.testng.TestRunner.run(TestRunner.java:602) [testng-6.11.jar:?]
	at org.testng.SuiteRunner.runTest(SuiteRunner.java:380) [testng-6.11.jar:?]
	at org.testng.SuiteRunner.runSequentially(SuiteRunner.java:375) [testng-6.11.jar:?]
	at org.testng.SuiteRunner.privateRun(SuiteRunner.java:340) [testng-6.11.jar:?]
	at org.testng.SuiteRunner.run(SuiteRunner.java:289) [testng-6.11.jar:?]
	at org.testng.SuiteRunnerWorker.runSuite(SuiteRunnerWorker.java:52) [testng-6.11.jar:?]
	at org.testng.SuiteRunnerWorker.run(SuiteRunnerWorker.java:86) [testng-6.11.jar:?]
	at org.testng.TestNG.runSuitesSequentially(TestNG.java:1301) [testng-6.11.jar:?]
	at org.testng.TestNG.runSuitesLocally(TestNG.java:1226) [testng-6.11.jar:?]
	at org.testng.TestNG.runSuites(TestNG.java:1144) [testng-6.11.jar:?]
	at org.testng.TestNG.run(TestNG.java:1115) [testng-6.11.jar:?]
	at org.apache.maven.surefire.testng.TestNGExecutor.run(TestNGExecutor.java:281) [surefire-testng-2.19.1.jar:2.19.1]
	at org.apache.maven.surefire.testng.TestNGXmlTestSuite.execute(TestNGXmlTestSuite.java:75) [surefire-testng-2.19.1.jar:2.19.1]
	at org.apache.maven.surefire.testng.TestNGProvider.invoke(TestNGProvider.java:121) [surefire-testng-2.19.1.jar:2.19.1]
	at org.apache.maven.surefire.booter.ForkedBooter.invokeProviderInSameClassLoader(ForkedBooter.java:290) [surefire-booter-2.19.1.jar:2.19.1]
	at org.apache.maven.surefire.booter.ForkedBooter.runSuitesInProcess(ForkedBooter.java:242) [surefire-booter-2.19.1.jar:2.19.1]
	at org.apache.maven.surefire.booter.ForkedBooter.main(ForkedBooter.java:121) [surefire-booter-2.19.1.jar:2.19.1]
[main] ERROR io.siddhi.core.stream.input.source.SourceMapper [] - Error while processing 'symbol:"wso2",
price:55.6
####
symbol:"IBM",
price:75.6', for the input Mapping 'text' for the stream 'FooStream'.
io.siddhi.core.exception.MappingFailedException: null
	at io.siddhi.extension.map.text.sourcemapper.TextSourceMapper.mapAndProcess(TextSourceMapper.java:278) ~[classes/:?]
	at io.siddhi.core.stream.input.source.SourceMapper.onEvent(SourceMapper.java:201) [siddhi-core-5.1.21.jar:?]
	at io.siddhi.core.stream.input.source.SourceMapper.onEvent(SourceMapper.java:145) [siddhi-core-5.1.21.jar:?]
	at io.siddhi.extension.map.text.sourcemapper.util.TestTrpInMemorySource$1.onMessage(TestTrpInMemorySource.java:79) [test-classes/:?]
	at io.siddhi.core.util.transport.InMemoryBroker$MessageBroker.broadcast(InMemoryBroker.java:110) [siddhi-core-5.1.21.jar:?]
	at io.siddhi.core.util.transport.InMemoryBroker$MessageBroker.publish(InMemoryBroker.java:118) [siddhi-core-5.1.21.jar:?]
	at io.siddhi.core.util.transport.InMemoryBroker.publish(InMemoryBroker.java:41) [siddhi-core-5.1.21.jar:?]
	at io.siddhi.extension.map.text.sourcemapper.TextDefaultSourceMapperTestCase.testTextSourceMapperMissingAttribute(TextDefaultSourceMapperTestCase.java:466) [test-classes/:?]
	at sun.reflect.NativeMethodAccessorImpl.invoke0(Native Method) ~[?:1.8.0_171]
	at sun.reflect.NativeMethodAccessorImpl.invoke(NativeMethodAccessorImpl.java:62) ~[?:1.8.0_171]
	at sun.reflect.DelegatingMethodAccessorImpl.invoke(DelegatingMethodAccessorImpl.java:43) ~[?:1.8.0_171]
	at java.lang.reflect.Method.invoke(Method.java:498) ~[?:1.8.0_171]
	at org.testng.internal.MethodInvocationHelper.invokeMethod(MethodInvocationHelper.java:108) [testng-6.11.jar:?]
	at org.testng.internal.Invoker.invokeMethod(Invoker.java:661) [testng-6.11.jar:?]
	at org.testng.internal.Invoker.invokeTestMethod(Invoker.java:869) [testng-6.11.jar:?]
	at org.testng.internal.Invoker.invokeTestMethods(Invoker.java:1193) [testng-6.11.jar:?]
	at org.testng.internal.TestMethodWorker.invokeTestMethods(TestMethodWorker.java:126) [testng-6.11.jar:?]
	at org.testng.internal.TestMethodWorker.run(TestMethodWorker.java:109) [testng-6.11.jar:?]
	at org.testng.TestRunner.privateRun(TestRunner.java:744) [testng-6.11.jar:?]
	at org.testng.TestRunner.run(TestRunner.java:602) [testng-6.11.jar:?]
	at org.testng.SuiteRunner.runTest(SuiteRunner.java:380) [testng-6.11.jar:?]
	at org.testng.SuiteRunner.runSequentially(SuiteRunner.java:375) [testng-6.11.jar:?]
	at org.testng.SuiteRunner.privateRun(SuiteRunner.java:340) [testng-6.11.jar:?]
	at org.testng.SuiteRunner.run(SuiteRunner.java:289) [testng-6.11.jar:?]
	at org.testng.SuiteRunnerWorker.runSuite(SuiteRunnerWorker.java:52) [testng-6.11.jar:?]
	at org.testng.SuiteRunnerWorker.run(SuiteRunnerWorker.java:86) [testng-6.11.jar:?]
	at org.testng.TestNG.runSuitesSequentially(TestNG.java:1301) [testng-6.11.jar:?]
	at org.testng.TestNG.runSuitesLocally(TestNG.java:1226) [testng-6.11.jar:?]
	at org.testng.TestNG.runSuites(TestNG.java:1144) [testng-6.11.jar:?]
	at org.testng.TestNG.run(TestNG.java:1115) [testng-6.11.jar:?]
	at org.apache.maven.surefire.testng.TestNGExecutor.run(TestNGExecutor.java:281) [surefire-testng-2.19.1.jar:2.19.1]
	at org.apache.maven.surefire.testng.TestNGXmlTestSuite.execute(TestNGXmlTestSuite.java:75) [surefire-testng-2.19.1.jar:2.19.1]
	at org.apache.maven.surefire.testng.TestNGProvider.invoke(TestNGProvider.java:121) [surefire-testng-2.19.1.jar:2.19.1]
	at org.apache.maven.surefire.booter.ForkedBooter.invokeProviderInSameClassLoader(ForkedBooter.java:290) [surefire-booter-2.19.1.jar:2.19.1]
	at org.apache.maven.surefire.booter.ForkedBooter.runSuitesInProcess(ForkedBooter.java:242) [surefire-booter-2.19.1.jar:2.19.1]
	at org.apache.maven.surefire.booter.ForkedBooter.main(ForkedBooter.java:121) [surefire-booter-2.19.1.jar:2.19.1]
[main] ERROR io.siddhi.extension.map.text.sourcemapper.TextSourceMapper [] - Invalid format of event symbol:"wso2",
price:55.6
####
symbol:"IBM",
price:75.6 for attribute price could not find proper value while fail on missing attribute is 'true' in the stream FooStream of siddhi text input mapper.
[main] ERROR io.siddhi.extension.map.text.sourcemapper.TextSourceMapper [] - Exception occurred when converting Text message:symbol:"wso2",
price:55.6
####
symbol:"IBM",
price:75.6 to Siddhi Event in the stream FooStream of siddhi text input mapper.
io.siddhi.core.exception.MappingFailedException: Invalid format of event symbol:"wso2",
price:55.6
####
symbol:"IBM",
price:75.6 for attribute price could not find proper value while fail on missing attribute is 'true' in the stream FooStream of siddhi text input mapper.
	at io.siddhi.extension.map.text.sourcemapper.TextSourceMapper.convertToCustomEvents(TextSourceMapper.java:400) ~[classes/:?]
	at io.siddhi.extension.map.text.sourcemapper.TextSourceMapper.onEventHandler(TextSourceMapper.java:303) [classes/:?]
	at io.siddhi.extension.map.text.sourcemapper.TextSourceMapper.mapAndProcess(TextSourceMapper.java:255) [classes/:?]
	at io.siddhi.core.stream.input.source.SourceMapper.onEvent(SourceMapper.java:201) [siddhi-core-5.1.21.jar:?]
	at io.siddhi.core.stream.input.source.SourceMapper.onEvent(SourceMapper.java:145) [siddhi-core-5.1.21.jar:?]
	at io.siddhi.extension.map.text.sourcemapper.util.TestTrpInMemorySource$1.onMessage(TestTrpInMemorySource.java:79) [test-classes/:?]
	at io.siddhi.core.util.transport.InMemoryBroker$MessageBroker.broadcast(InMemoryBroker.java:110) [siddhi-core-5.1.21.jar:?]
	at io.siddhi.core.util.transport.InMemoryBroker$MessageBroker.publish(InMemoryBroker.java:118) [siddhi-core-5.1.21.jar:?]
	at io.siddhi.core.util.transport.InMemoryBroker.publish(InMemoryBroker.java:41) [siddhi-core-5.1.21.jar:?]
	at io.siddhi.extension.map.text.sourcemapper.TextDefaultSourceMapperTestCase.testTextSourceMapperMissingAttribute(TextDefaultSourceMapperTestCase.java:466) [test-classes/:?]
	at sun.reflect.NativeMethodAccessorImpl.invoke0(Native Method) ~[?:1.8.0_171]
	at sun.reflect.NativeMethodAccessorImpl.invoke(NativeMethodAccessorImpl.java:62) ~[?:1.8.0_171]
	at sun.reflect.DelegatingMethodAccessorImpl.invoke(DelegatingMethodAccessorImpl.java:43) ~[?:1.8.0_171]
	at java.lang.reflect.Method.invoke(Method.java:498) ~[?:1.8.0_171]
	at org.testng.internal.MethodInvocationHelper.invokeMethod(MethodInvocationHelper.java:108) [testng-6.11.jar:?]
	at org.testng.internal.Invoker.invokeMethod(Invoker.java:661) [testng-6.11.jar:?]
	at org.testng.internal.Invoker.invokeTestMethod(Invoker.java:869) [testng-6.11.jar:?]
	at org.testng.internal.Invoker.invokeTestMethods(Invoker.java:1193) [testng-6.11.jar:?]
	at org.testng.internal.TestMethodWorker.invokeTestMethods(TestMethodWorker.java:126) [testng-6.11.jar:?]
	at org.testng.internal.TestMethodWorker.run(TestMethodWorker.java:109) [testng-6.11.jar:?]
	at org.testng.TestRunner.privateRun(TestRunner.java:744) [testng-6.11.jar:?]
	at org.testng.TestRunner.run(TestRunner.java:602) [testng-6.11.jar:?]
	at org.testng.SuiteRunner.runTest(SuiteRunner.java:380) [testng-6.11.jar:?]
	at org.testng.SuiteRunner.runSequentially(SuiteRunner.java:375) [testng-6.11.jar:?]
	at org.testng.SuiteRunner.privateRun(SuiteRunner.java:340) [testng-6.11.jar:?]
	at org.testng.SuiteRunner.run(SuiteRunner.java:289) [testng-6.11.jar:?]
	at org.testng.SuiteRunnerWorker.runSuite(SuiteRunnerWorker.java:52) [testng-6.11.jar:?]
	at org.testng.SuiteRunnerWorker.run(SuiteRunnerWorker.java:86) [testng-6.11.jar:?]
	at org.testng.TestNG.runSuitesSequentially(TestNG.java:1301) [testng-6.11.jar:?]
	at org.testng.TestNG.runSuitesLocally(TestNG.java:1226) [testng-6.11.jar:?]
	at org.testng.TestNG.runSuites(TestNG.java:1144) [testng-6.11.jar:?]
	at org.testng.TestNG.run(TestNG.java:1115) [testng-6.11.jar:?]
	at org.apache.maven.surefire.testng.TestNGExecutor.run(TestNGExecutor.java:281) [surefire-testng-2.19.1.jar:2.19.1]
	at org.apache.maven.surefire.testng.TestNGXmlTestSuite.execute(TestNGXmlTestSuite.java:75) [surefire-testng-2.19.1.jar:2.19.1]
	at org.apache.maven.surefire.testng.TestNGProvider.invoke(TestNGProvider.java:121) [surefire-testng-2.19.1.jar:2.19.1]
	at org.apache.maven.surefire.booter.ForkedBooter.invokeProviderInSameClassLoader(ForkedBooter.java:290) [surefire-booter-2.19.1.jar:2.19.1]
	at org.apache.maven.surefire.booter.ForkedBooter.runSuitesInProcess(ForkedBooter.java:242) [surefire-booter-2.19.1.jar:2.19.1]
	at org.apache.maven.surefire.booter.ForkedBooter.main(ForkedBooter.java:121) [surefire-booter-2.19.1.jar:2.19.1]
[main] ERROR io.siddhi.core.stream.input.source.SourceMapper [] - Error while processing 'symbol:"wso2",
price:55.6
####
symbol:"IBM",
price:75.6', for the input Mapping 'text' for the stream 'FooStream'.
io.siddhi.core.exception.MappingFailedException: null
	at io.siddhi.extension.map.text.sourcemapper.TextSourceMapper.mapAndProcess(TextSourceMapper.java:278) ~[classes/:?]
	at io.siddhi.core.stream.input.source.SourceMapper.onEvent(SourceMapper.java:201) [siddhi-core-5.1.21.jar:?]
	at io.siddhi.core.stream.input.source.SourceMapper.onEvent(SourceMapper.java:145) [siddhi-core-5.1.21.jar:?]
	at io.siddhi.extension.map.text.sourcemapper.util.TestTrpInMemorySource$1.onMessage(TestTrpInMemorySource.java:79) [test-classes/:?]
	at io.siddhi.core.util.transport.InMemoryBroker$MessageBroker.broadcast(InMemoryBroker.java:110) [siddhi-core-5.1.21.jar:?]
	at io.siddhi.core.util.transport.InMemoryBroker$MessageBroker.publish(InMemoryBroker.java:118) [siddhi-core-5.1.21.jar:?]
	at io.siddhi.core.util.transport.InMemoryBroker.publish(InMemoryBroker.java:41) [siddhi-core-5.1.21.jar:?]
	at io.siddhi.extension.map.text.sourcemapper.TextDefaultSourceMapperTestCase.testTextSourceMapperMissingAttribute(TextDefaultSourceMapperTestCase.java:466) [test-classes/:?]
	at sun.reflect.NativeMethodAccessorImpl.invoke0(Native Method) ~[?:1.8.0_171]
	at sun.reflect.NativeMethodAccessorImpl.invoke(NativeMethodAccessorImpl.java:62) ~[?:1.8.0_171]
	at sun.reflect.DelegatingMethodAccessorImpl.invoke(DelegatingMethodAccessorImpl.java:43) ~[?:1.8.0_171]
	at java.lang.reflect.Method.invoke(Method.java:498) ~[?:1.8.0_171]
	at org.testng.internal.MethodInvocationHelper.invokeMethod(MethodInvocationHelper.java:108) [testng-6.11.jar:?]
	at org.testng.internal.Invoker.invokeMethod(Invoker.java:661) [testng-6.11.jar:?]
	at org.testng.internal.Invoker.invokeTestMethod(Invoker.java:869) [testng-6.11.jar:?]
	at org.testng.internal.Invoker.invokeTestMethods(Invoker.java:1193) [testng-6.11.jar:?]
	at org.testng.internal.TestMethodWorker.invokeTestMethods(TestMethodWorker.java:126) [testng-6.11.jar:?]
	at org.testng.internal.TestMethodWorker.run(TestMethodWorker.java:109) [testng-6.11.jar:?]
	at org.testng.TestRunner.privateRun(TestRunner.java:744) [testng-6.11.jar:?]
	at org.testng.TestRunner.run(TestRunner.java:602) [testng-6.11.jar:?]
	at org.testng.SuiteRunner.runTest(SuiteRunner.java:380) [testng-6.11.jar:?]
	at org.testng.SuiteRunner.runSequentially(SuiteRunner.java:375) [testng-6.11.jar:?]
	at org.testng.SuiteRunner.privateRun(SuiteRunner.java:340) [testng-6.11.jar:?]
	at org.testng.SuiteRunner.run(SuiteRunner.java:289) [testng-6.11.jar:?]
	at org.testng.SuiteRunnerWorker.runSuite(SuiteRunnerWorker.java:52) [testng-6.11.jar:?]
	at org.testng.SuiteRunnerWorker.run(SuiteRunnerWorker.java:86) [testng-6.11.jar:?]
	at org.testng.TestNG.runSuitesSequentially(TestNG.java:1301) [testng-6.11.jar:?]
	at org.testng.TestNG.runSuitesLocally(TestNG.java:1226) [testng-6.11.jar:?]
	at org.testng.TestNG.runSuites(TestNG.java:1144) [testng-6.11.jar:?]
	at org.testng.TestNG.run(TestNG.java:1115) [testng-6.11.jar:?]
	at org.apache.maven.surefire.testng.TestNGExecutor.run(TestNGExecutor.java:281) [surefire-testng-2.19.1.jar:2.19.1]
	at org.apache.maven.surefire.testng.TestNGXmlTestSuite.execute(TestNGXmlTestSuite.java:75) [surefire-testng-2.19.1.jar:2.19.1]
	at org.apache.maven.surefire.testng.TestNGProvider.invoke(TestNGProvider.java:121) [surefire-testng-2.19.1.jar:2.19.1]
	at org.apache.maven.surefire.booter.ForkedBooter.invokeProviderInSameClassLoader(ForkedBooter.java:290) [surefire-booter-2.19.1.jar:2.19.1]
	at org.apache.maven.surefire.booter.ForkedBooter.runSuitesInProcess(ForkedBooter.java:242) [surefire-booter-2.19.1.jar:2.19.1]
	at org.apache.maven.surefire.booter.ForkedBooter.main(ForkedBooter.java:121) [surefire-booter-2.19.1.jar:2.19.1]
[main] ERROR io.siddhi.extension.map.text.sourcemapper.TextSourceMapper [] - Invalid format of event because some required attributes are missing in event symbol:"wso2",
price:55.6 while needed attributes are [Attribute{id='symbol', type=STRING}, Attribute{id='price', type=FLOAT}, Attribute{id='volume', type=LONG}] in the stream FooStream of siddhi text input mapper.
[main] ERROR io.siddhi.extension.map.text.sourcemapper.TextSourceMapper [] - Exception occurred when converting Text message:symbol:"wso2",
price:55.6 to Siddhi Event in the stream FooStream of siddhi text input mapper.
io.siddhi.core.exception.MappingFailedException: Invalid format of event because some required attributes are missing in event symbol:"wso2",
price:55.6 while needed attributes are [Attribute{id='symbol', type=STRING}, Attribute{id='price', type=FLOAT}, Attribute{id='volume', type=LONG}] in the stream FooStream of siddhi text input mapper.
	at io.siddhi.extension.map.text.sourcemapper.TextSourceMapper.convertToDefaultEvents(TextSourceMapper.java:427) ~[classes/:?]
	at io.siddhi.extension.map.text.sourcemapper.TextSourceMapper.onEventHandler(TextSourceMapper.java:305) [classes/:?]
	at io.siddhi.extension.map.text.sourcemapper.TextSourceMapper.mapAndProcess(TextSourceMapper.java:264) [classes/:?]
	at io.siddhi.core.stream.input.source.SourceMapper.onEvent(SourceMapper.java:201) [siddhi-core-5.1.21.jar:?]
	at io.siddhi.core.stream.input.source.SourceMapper.onEvent(SourceMapper.java:145) [siddhi-core-5.1.21.jar:?]
	at io.siddhi.core.stream.input.source.InMemorySource$1.onMessage(InMemorySource.java:99) [siddhi-core-5.1.21.jar:?]
	at io.siddhi.core.util.transport.InMemoryBroker$MessageBroker.broadcast(InMemoryBroker.java:110) [siddhi-core-5.1.21.jar:?]
	at io.siddhi.core.util.transport.InMemoryBroker$MessageBroker.publish(InMemoryBroker.java:118) [siddhi-core-5.1.21.jar:?]
	at io.siddhi.core.util.transport.InMemoryBroker.publish(InMemoryBroker.java:41) [siddhi-core-5.1.21.jar:?]
	at io.siddhi.extension.map.text.sourcemapper.TextDefaultSourceMapperTestCase.testTextSourceMapperMissingAttribute(TextDefaultSourceMapperTestCase.java:466) [test-classes/:?]
	at sun.reflect.NativeMethodAccessorImpl.invoke0(Native Method) ~[?:1.8.0_171]
	at sun.reflect.NativeMethodAccessorImpl.invoke(NativeMethodAccessorImpl.java:62) ~[?:1.8.0_171]
	at sun.reflect.DelegatingMethodAccessorImpl.invoke(DelegatingMethodAccessorImpl.java:43) ~[?:1.8.0_171]
	at java.lang.reflect.Method.invoke(Method.java:498) ~[?:1.8.0_171]
	at org.testng.internal.MethodInvocationHelper.invokeMethod(MethodInvocationHelper.java:108) [testng-6.11.jar:?]
	at org.testng.internal.Invoker.invokeMethod(Invoker.java:661) [testng-6.11.jar:?]
	at org.testng.internal.Invoker.invokeTestMethod(Invoker.java:869) [testng-6.11.jar:?]
	at org.testng.internal.Invoker.invokeTestMethods(Invoker.java:1193) [testng-6.11.jar:?]
	at org.testng.internal.TestMethodWorker.invokeTestMethods(TestMethodWorker.java:126) [testng-6.11.jar:?]
	at org.testng.internal.TestMethodWorker.run(TestMethodWorker.java:109) [testng-6.11.jar:?]
	at org.testng.TestRunner.privateRun(TestRunner.java:744) [testng-6.11.jar:?]
	at org.testng.TestRunner.run(TestRunner.java:602) [testng-6.11.jar:?]
	at org.testng.SuiteRunner.runTest(SuiteRunner.java:380) [testng-6.11.jar:?]
	at org.testng.SuiteRunner.runSequentially(SuiteRunner.java:375) [testng-6.11.jar:?]
	at org.testng.SuiteRunner.privateRun(SuiteRunner.java:340) [testng-6.11.jar:?]
	at org.testng.SuiteRunner.run(SuiteRunner.java:289) [testng-6.11.jar:?]
	at org.testng.SuiteRunnerWorker.runSuite(SuiteRunnerWorker.java:52) [testng-6.11.jar:?]
	at org.testng.SuiteRunnerWorker.run(SuiteRunnerWorker.java:86) [testng-6.11.jar:?]
	at org.testng.TestNG.runSuitesSequentially(TestNG.java:1301) [testng-6.11.jar:?]
	at org.testng.TestNG.runSuitesLocally(TestNG.java:1226) [testng-6.11.jar:?]
	at org.testng.TestNG.runSuites(TestNG.java:1144) [testng-6.11.jar:?]
	at org.testng.TestNG.run(TestNG.java:1115) [testng-6.11.jar:?]
	at org.apache.maven.surefire.testng.TestNGExecutor.run(TestNGExecutor.java:281) [surefire-testng-2.19.1.jar:2.19.1]
	at org.apache.maven.surefire.testng.TestNGXmlTestSuite.execute(TestNGXmlTestSuite.java:75) [surefire-testng-2.19.1.jar:2.19.1]
	at org.apache.maven.surefire.testng.TestNGProvider.invoke(TestNGProvider.java:121) [surefire-testng-2.19.1.jar:2.19.1]
	at org.apache.maven.surefire.booter.ForkedBooter.invokeProviderInSameClassLoader(ForkedBooter.java:290) [surefire-booter-2.19.1.jar:2.19.1]
	at org.apache.maven.surefire.booter.ForkedBooter.runSuitesInProcess(ForkedBooter.java:242) [surefire-booter-2.19.1.jar:2.19.1]
	at org.apache.maven.surefire.booter.ForkedBooter.main(ForkedBooter.java:121) [surefire-booter-2.19.1.jar:2.19.1]
[main] ERROR io.siddhi.extension.map.text.sourcemapper.TextSourceMapper [] - Invalid format of event because some required attributes are missing in event symbol:"IBM",
price:75.6 while needed attributes are [Attribute{id='symbol', type=STRING}, Attribute{id='price', type=FLOAT}, Attribute{id='volume', type=LONG}] in the stream FooStream of siddhi text input mapper.
[main] ERROR io.siddhi.extension.map.text.sourcemapper.TextSourceMapper [] - Exception occurred when converting Text message:symbol:"IBM",
price:75.6 to Siddhi Event in the stream FooStream of siddhi text input mapper.
io.siddhi.core.exception.MappingFailedException: Invalid format of event because some required attributes are missing in event symbol:"IBM",
price:75.6 while needed attributes are [Attribute{id='symbol', type=STRING}, Attribute{id='price', type=FLOAT}, Attribute{id='volume', type=LONG}] in the stream FooStream of siddhi text input mapper.
	at io.siddhi.extension.map.text.sourcemapper.TextSourceMapper.convertToDefaultEvents(TextSourceMapper.java:427) ~[classes/:?]
	at io.siddhi.extension.map.text.sourcemapper.TextSourceMapper.onEventHandler(TextSourceMapper.java:305) [classes/:?]
	at io.siddhi.extension.map.text.sourcemapper.TextSourceMapper.mapAndProcess(TextSourceMapper.java:271) [classes/:?]
	at io.siddhi.core.stream.input.source.SourceMapper.onEvent(SourceMapper.java:201) [siddhi-core-5.1.21.jar:?]
	at io.siddhi.core.stream.input.source.SourceMapper.onEvent(SourceMapper.java:145) [siddhi-core-5.1.21.jar:?]
	at io.siddhi.core.stream.input.source.InMemorySource$1.onMessage(InMemorySource.java:99) [siddhi-core-5.1.21.jar:?]
	at io.siddhi.core.util.transport.InMemoryBroker$MessageBroker.broadcast(InMemoryBroker.java:110) [siddhi-core-5.1.21.jar:?]
	at io.siddhi.core.util.transport.InMemoryBroker$MessageBroker.publish(InMemoryBroker.java:118) [siddhi-core-5.1.21.jar:?]
	at io.siddhi.core.util.transport.InMemoryBroker.publish(InMemoryBroker.java:41) [siddhi-core-5.1.21.jar:?]
	at io.siddhi.extension.map.text.sourcemapper.TextDefaultSourceMapperTestCase.testTextSourceMapperMissingAttribute(TextDefaultSourceMapperTestCase.java:466) [test-classes/:?]
	at sun.reflect.NativeMethodAccessorImpl.invoke0(Native Method) ~[?:1.8.0_171]
	at sun.reflect.NativeMethodAccessorImpl.invoke(NativeMethodAccessorImpl.java:62) ~[?:1.8.0_171]
	at sun.reflect.DelegatingMethodAccessorImpl.invoke(DelegatingMethodAccessorImpl.java:43) ~[?:1.8.0_171]
	at java.lang.reflect.Method.invoke(Method.java:498) ~[?:1.8.0_171]
	at org.testng.internal.MethodInvocationHelper.invokeMethod(MethodInvocationHelper.java:108) [testng-6.11.jar:?]
	at org.testng.internal.Invoker.invokeMethod(Invoker.java:661) [testng-6.11.jar:?]
	at org.testng.internal.Invoker.invokeTestMethod(Invoker.java:869) [testng-6.11.jar:?]
	at org.testng.internal.Invoker.invokeTestMethods(Invoker.java:1193) [testng-6.11.jar:?]
	at org.testng.internal.TestMethodWorker.invokeTestMethods(TestMethodWorker.java:126) [testng-6.11.jar:?]
	at org.testng.internal.TestMethodWorker.run(TestMethodWorker.java:109) [testng-6.11.jar:?]
	at org.testng.TestRunner.privateRun(TestRunner.java:744) [testng-6.11.jar:?]
	at org.testng.TestRunner.run(TestRunner.java:602) [testng-6.11.jar:?]
	at org.testng.SuiteRunner.runTest(SuiteRunner.java:380) [testng-6.11.jar:?]
	at org.testng.SuiteRunner.runSequentially(SuiteRunner.java:375) [testng-6.11.jar:?]
	at org.testng.SuiteRunner.privateRun(SuiteRunner.java:340) [testng-6.11.jar:?]
	at org.testng.SuiteRunner.run(SuiteRunner.java:289) [testng-6.11.jar:?]
	at org.testng.SuiteRunnerWorker.runSuite(SuiteRunnerWorker.java:52) [testng-6.11.jar:?]
	at org.testng.SuiteRunnerWorker.run(SuiteRunnerWorker.java:86) [testng-6.11.jar:?]
	at org.testng.TestNG.runSuitesSequentially(TestNG.java:1301) [testng-6.11.jar:?]
	at org.testng.TestNG.runSuitesLocally(TestNG.java:1226) [testng-6.11.jar:?]
	at org.testng.TestNG.runSuites(TestNG.java:1144) [testng-6.11.jar:?]
	at org.testng.TestNG.run(TestNG.java:1115) [testng-6.11.jar:?]
	at org.apache.maven.surefire.testng.TestNGExecutor.run(TestNGExecutor.java:281) [surefire-testng-2.19.1.jar:2.19.1]
	at org.apache.maven.surefire.testng.TestNGXmlTestSuite.execute(TestNGXmlTestSuite.java:75) [surefire-testng-2.19.1.jar:2.19.1]
	at org.apache.maven.surefire.testng.TestNGProvider.invoke(TestNGProvider.java:121) [surefire-testng-2.19.1.jar:2.19.1]
	at org.apache.maven.surefire.booter.ForkedBooter.invokeProviderInSameClassLoader(ForkedBooter.java:290) [surefire-booter-2.19.1.jar:2.19.1]
	at org.apache.maven.surefire.booter.ForkedBooter.runSuitesInProcess(ForkedBooter.java:242) [surefire-booter-2.19.1.jar:2.19.1]
	at org.apache.maven.surefire.booter.ForkedBooter.main(ForkedBooter.java:121) [surefire-booter-2.19.1.jar:2.19.1]
[main] ERROR io.siddhi.core.stream.input.source.SourceMapper [] - Error while processing 'symbol:"wso2",
price:55.6
####
symbol:"IBM",
price:75.6', for the input Mapping 'text' for the stream 'FooStream'.
io.siddhi.core.exception.MappingFailedException: null
	at io.siddhi.extension.map.text.sourcemapper.TextSourceMapper.mapAndProcess(TextSourceMapper.java:278) ~[classes/:?]
	at io.siddhi.core.stream.input.source.SourceMapper.onEvent(SourceMapper.java:201) [siddhi-core-5.1.21.jar:?]
	at io.siddhi.core.stream.input.source.SourceMapper.onEvent(SourceMapper.java:145) [siddhi-core-5.1.21.jar:?]
	at io.siddhi.core.stream.input.source.InMemorySource$1.onMessage(InMemorySource.java:99) [siddhi-core-5.1.21.jar:?]
	at io.siddhi.core.util.transport.InMemoryBroker$MessageBroker.broadcast(InMemoryBroker.java:110) [siddhi-core-5.1.21.jar:?]
	at io.siddhi.core.util.transport.InMemoryBroker$MessageBroker.publish(InMemoryBroker.java:118) [siddhi-core-5.1.21.jar:?]
	at io.siddhi.core.util.transport.InMemoryBroker.publish(InMemoryBroker.java:41) [siddhi-core-5.1.21.jar:?]
	at io.siddhi.extension.map.text.sourcemapper.TextDefaultSourceMapperTestCase.testTextSourceMapperMissingAttribute(TextDefaultSourceMapperTestCase.java:466) [test-classes/:?]
	at sun.reflect.NativeMethodAccessorImpl.invoke0(Native Method) ~[?:1.8.0_171]
	at sun.reflect.NativeMethodAccessorImpl.invoke(NativeMethodAccessorImpl.java:62) ~[?:1.8.0_171]
	at sun.reflect.DelegatingMethodAccessorImpl.invoke(DelegatingMethodAccessorImpl.java:43) ~[?:1.8.0_171]
	at java.lang.reflect.Method.invoke(Method.java:498) ~[?:1.8.0_171]
	at org.testng.internal.MethodInvocationHelper.invokeMethod(MethodInvocationHelper.java:108) [testng-6.11.jar:?]
	at org.testng.internal.Invoker.invokeMethod(Invoker.java:661) [testng-6.11.jar:?]
	at org.testng.internal.Invoker.invokeTestMethod(Invoker.java:869) [testng-6.11.jar:?]
	at org.testng.internal.Invoker.invokeTestMethods(Invoker.java:1193) [testng-6.11.jar:?]
	at org.testng.internal.TestMethodWorker.invokeTestMethods(TestMethodWorker.java:126) [testng-6.11.jar:?]
	at org.testng.internal.TestMethodWorker.run(TestMethodWorker.java:109) [testng-6.11.jar:?]
	at org.testng.TestRunner.privateRun(TestRunner.java:744) [testng-6.11.jar:?]
	at org.testng.TestRunner.run(TestRunner.java:602) [testng-6.11.jar:?]
	at org.testng.SuiteRunner.runTest(SuiteRunner.java:380) [testng-6.11.jar:?]
	at org.testng.SuiteRunner.runSequentially(SuiteRunner.java:375) [testng-6.11.jar:?]
	at org.testng.SuiteRunner.privateRun(SuiteRunner.java:340) [testng-6.11.jar:?]
	at org.testng.SuiteRunner.run(SuiteRunner.java:289) [testng-6.11.jar:?]
	at org.testng.SuiteRunnerWorker.runSuite(SuiteRunnerWorker.java:52) [testng-6.11.jar:?]
	at org.testng.SuiteRunnerWorker.run(SuiteRunnerWorker.java:86) [testng-6.11.jar:?]
	at org.testng.TestNG.runSuitesSequentially(TestNG.java:1301) [testng-6.11.jar:?]
	at org.testng.TestNG.runSuitesLocally(TestNG.java:1226) [testng-6.11.jar:?]
	at org.testng.TestNG.runSuites(TestNG.java:1144) [testng-6.11.jar:?]
	at org.testng.TestNG.run(TestNG.java:1115) [testng-6.11.jar:?]
	at org.apache.maven.surefire.testng.TestNGExecutor.run(TestNGExecutor.java:281) [surefire-testng-2.19.1.jar:2.19.1]
	at org.apache.maven.surefire.testng.TestNGXmlTestSuite.execute(TestNGXmlTestSuite.java:75) [surefire-testng-2.19.1.jar:2.19.1]
	at org.apache.maven.surefire.testng.TestNGProvider.invoke(TestNGProvider.java:121) [surefire-testng-2.19.1.jar:2.19.1]
	at org.apache.maven.surefire.booter.ForkedBooter.invokeProviderInSameClassLoader(ForkedBooter.java:290) [surefire-booter-2.19.1.jar:2.19.1]
	at org.apache.maven.surefire.booter.ForkedBooter.runSuitesInProcess(ForkedBooter.java:242) [surefire-booter-2.19.1.jar:2.19.1]
	at org.apache.maven.surefire.booter.ForkedBooter.main(ForkedBooter.java:121) [surefire-booter-2.19.1.jar:2.19.1]
[main] INFO  io.siddhi.extension.map.text.sourcemapper.TextDefaultSourceMapperTestCase [] - test testTextSourceMapperSingleEventForEventGroup
[main] ERROR io.siddhi.extension.map.text.sourcemapper.TextSourceMapper [] - Invalid format of event symbol:"wso2",
price:55.6,
volume:200 for attribute price could not find proper value while fail on missing attribute is 'true' in the stream FooStream of siddhi text input mapper.
[main] ERROR io.siddhi.extension.map.text.sourcemapper.TextSourceMapper [] - Exception occurred when converting Text message:symbol:"wso2",
price:55.6,
volume:200 to Siddhi Event in the stream FooStream of siddhi text input mapper.
io.siddhi.core.exception.MappingFailedException: Invalid format of event symbol:"wso2",
price:55.6,
volume:200 for attribute price could not find proper value while fail on missing attribute is 'true' in the stream FooStream of siddhi text input mapper.
	at io.siddhi.extension.map.text.sourcemapper.TextSourceMapper.convertToCustomEvents(TextSourceMapper.java:400) ~[classes/:?]
	at io.siddhi.extension.map.text.sourcemapper.TextSourceMapper.onEventHandler(TextSourceMapper.java:303) [classes/:?]
	at io.siddhi.extension.map.text.sourcemapper.TextSourceMapper.mapAndProcess(TextSourceMapper.java:255) [classes/:?]
	at io.siddhi.core.stream.input.source.SourceMapper.onEvent(SourceMapper.java:201) [siddhi-core-5.1.21.jar:?]
	at io.siddhi.core.stream.input.source.SourceMapper.onEvent(SourceMapper.java:145) [siddhi-core-5.1.21.jar:?]
	at io.siddhi.extension.map.text.sourcemapper.util.TestTrpInMemorySource$1.onMessage(TestTrpInMemorySource.java:79) [test-classes/:?]
	at io.siddhi.core.util.transport.InMemoryBroker$MessageBroker.broadcast(InMemoryBroker.java:110) [siddhi-core-5.1.21.jar:?]
	at io.siddhi.core.util.transport.InMemoryBroker$MessageBroker.publish(InMemoryBroker.java:118) [siddhi-core-5.1.21.jar:?]
	at io.siddhi.core.util.transport.InMemoryBroker.publish(InMemoryBroker.java:41) [siddhi-core-5.1.21.jar:?]
	at io.siddhi.extension.map.text.sourcemapper.TextDefaultSourceMapperTestCase.testTextSourceMapperSingleEventForEventGroup(TextDefaultSourceMapperTestCase.java:695) [test-classes/:?]
	at sun.reflect.NativeMethodAccessorImpl.invoke0(Native Method) ~[?:1.8.0_171]
	at sun.reflect.NativeMethodAccessorImpl.invoke(NativeMethodAccessorImpl.java:62) ~[?:1.8.0_171]
	at sun.reflect.DelegatingMethodAccessorImpl.invoke(DelegatingMethodAccessorImpl.java:43) ~[?:1.8.0_171]
	at java.lang.reflect.Method.invoke(Method.java:498) ~[?:1.8.0_171]
	at org.testng.internal.MethodInvocationHelper.invokeMethod(MethodInvocationHelper.java:108) [testng-6.11.jar:?]
	at org.testng.internal.Invoker.invokeMethod(Invoker.java:661) [testng-6.11.jar:?]
	at org.testng.internal.Invoker.invokeTestMethod(Invoker.java:869) [testng-6.11.jar:?]
	at org.testng.internal.Invoker.invokeTestMethods(Invoker.java:1193) [testng-6.11.jar:?]
	at org.testng.internal.TestMethodWorker.invokeTestMethods(TestMethodWorker.java:126) [testng-6.11.jar:?]
	at org.testng.internal.TestMethodWorker.run(TestMethodWorker.java:109) [testng-6.11.jar:?]
	at org.testng.TestRunner.privateRun(TestRunner.java:744) [testng-6.11.jar:?]
	at org.testng.TestRunner.run(TestRunner.java:602) [testng-6.11.jar:?]
	at org.testng.SuiteRunner.runTest(SuiteRunner.java:380) [testng-6.11.jar:?]
	at org.testng.SuiteRunner.runSequentially(SuiteRunner.java:375) [testng-6.11.jar:?]
	at org.testng.SuiteRunner.privateRun(SuiteRunner.java:340) [testng-6.11.jar:?]
	at org.testng.SuiteRunner.run(SuiteRunner.java:289) [testng-6.11.jar:?]
	at org.testng.SuiteRunnerWorker.runSuite(SuiteRunnerWorker.java:52) [testng-6.11.jar:?]
	at org.testng.SuiteRunnerWorker.run(SuiteRunnerWorker.java:86) [testng-6.11.jar:?]
	at org.testng.TestNG.runSuitesSequentially(TestNG.java:1301) [testng-6.11.jar:?]
	at org.testng.TestNG.runSuitesLocally(TestNG.java:1226) [testng-6.11.jar:?]
	at org.testng.TestNG.runSuites(TestNG.java:1144) [testng-6.11.jar:?]
	at org.testng.TestNG.run(TestNG.java:1115) [testng-6.11.jar:?]
	at org.apache.maven.surefire.testng.TestNGExecutor.run(TestNGExecutor.java:281) [surefire-testng-2.19.1.jar:2.19.1]
	at org.apache.maven.surefire.testng.TestNGXmlTestSuite.execute(TestNGXmlTestSuite.java:75) [surefire-testng-2.19.1.jar:2.19.1]
	at org.apache.maven.surefire.testng.TestNGProvider.invoke(TestNGProvider.java:121) [surefire-testng-2.19.1.jar:2.19.1]
	at org.apache.maven.surefire.booter.ForkedBooter.invokeProviderInSameClassLoader(ForkedBooter.java:290) [surefire-booter-2.19.1.jar:2.19.1]
	at org.apache.maven.surefire.booter.ForkedBooter.runSuitesInProcess(ForkedBooter.java:242) [surefire-booter-2.19.1.jar:2.19.1]
	at org.apache.maven.surefire.booter.ForkedBooter.main(ForkedBooter.java:121) [surefire-booter-2.19.1.jar:2.19.1]
[main] ERROR io.siddhi.core.stream.input.source.SourceMapper [] - Error while processing 'symbol:"wso2",
price:55.6,
volume:200', for the input Mapping 'text' for the stream 'FooStream'.
io.siddhi.core.exception.MappingFailedException: null
	at io.siddhi.extension.map.text.sourcemapper.TextSourceMapper.mapAndProcess(TextSourceMapper.java:278) ~[classes/:?]
	at io.siddhi.core.stream.input.source.SourceMapper.onEvent(SourceMapper.java:201) [siddhi-core-5.1.21.jar:?]
	at io.siddhi.core.stream.input.source.SourceMapper.onEvent(SourceMapper.java:145) [siddhi-core-5.1.21.jar:?]
	at io.siddhi.extension.map.text.sourcemapper.util.TestTrpInMemorySource$1.onMessage(TestTrpInMemorySource.java:79) [test-classes/:?]
	at io.siddhi.core.util.transport.InMemoryBroker$MessageBroker.broadcast(InMemoryBroker.java:110) [siddhi-core-5.1.21.jar:?]
	at io.siddhi.core.util.transport.InMemoryBroker$MessageBroker.publish(InMemoryBroker.java:118) [siddhi-core-5.1.21.jar:?]
	at io.siddhi.core.util.transport.InMemoryBroker.publish(InMemoryBroker.java:41) [siddhi-core-5.1.21.jar:?]
	at io.siddhi.extension.map.text.sourcemapper.TextDefaultSourceMapperTestCase.testTextSourceMapperSingleEventForEventGroup(TextDefaultSourceMapperTestCase.java:695) [test-classes/:?]
	at sun.reflect.NativeMethodAccessorImpl.invoke0(Native Method) ~[?:1.8.0_171]
	at sun.reflect.NativeMethodAccessorImpl.invoke(NativeMethodAccessorImpl.java:62) ~[?:1.8.0_171]
	at sun.reflect.DelegatingMethodAccessorImpl.invoke(DelegatingMethodAccessorImpl.java:43) ~[?:1.8.0_171]
	at java.lang.reflect.Method.invoke(Method.java:498) ~[?:1.8.0_171]
	at org.testng.internal.MethodInvocationHelper.invokeMethod(MethodInvocationHelper.java:108) [testng-6.11.jar:?]
	at org.testng.internal.Invoker.invokeMethod(Invoker.java:661) [testng-6.11.jar:?]
	at org.testng.internal.Invoker.invokeTestMethod(Invoker.java:869) [testng-6.11.jar:?]
	at org.testng.internal.Invoker.invokeTestMethods(Invoker.java:1193) [testng-6.11.jar:?]
	at org.testng.internal.TestMethodWorker.invokeTestMethods(TestMethodWorker.java:126) [testng-6.11.jar:?]
	at org.testng.internal.TestMethodWorker.run(TestMethodWorker.java:109) [testng-6.11.jar:?]
	at org.testng.TestRunner.privateRun(TestRunner.java:744) [testng-6.11.jar:?]
	at org.testng.TestRunner.run(TestRunner.java:602) [testng-6.11.jar:?]
	at org.testng.SuiteRunner.runTest(SuiteRunner.java:380) [testng-6.11.jar:?]
	at org.testng.SuiteRunner.runSequentially(SuiteRunner.java:375) [testng-6.11.jar:?]
	at org.testng.SuiteRunner.privateRun(SuiteRunner.java:340) [testng-6.11.jar:?]
	at org.testng.SuiteRunner.run(SuiteRunner.java:289) [testng-6.11.jar:?]
	at org.testng.SuiteRunnerWorker.runSuite(SuiteRunnerWorker.java:52) [testng-6.11.jar:?]
	at org.testng.SuiteRunnerWorker.run(SuiteRunnerWorker.java:86) [testng-6.11.jar:?]
	at org.testng.TestNG.runSuitesSequentially(TestNG.java:1301) [testng-6.11.jar:?]
	at org.testng.TestNG.runSuitesLocally(TestNG.java:1226) [testng-6.11.jar:?]
	at org.testng.TestNG.runSuites(TestNG.java:1144) [testng-6.11.jar:?]
	at org.testng.TestNG.run(TestNG.java:1115) [testng-6.11.jar:?]
	at org.apache.maven.surefire.testng.TestNGExecutor.run(TestNGExecutor.java:281) [surefire-testng-2.19.1.jar:2.19.1]
	at org.apache.maven.surefire.testng.TestNGXmlTestSuite.execute(TestNGXmlTestSuite.java:75) [surefire-testng-2.19.1.jar:2.19.1]
	at org.apache.maven.surefire.testng.TestNGProvider.invoke(TestNGProvider.java:121) [surefire-testng-2.19.1.jar:2.19.1]
	at org.apache.maven.surefire.booter.ForkedBooter.invokeProviderInSameClassLoader(ForkedBooter.java:290) [surefire-booter-2.19.1.jar:2.19.1]
	at org.apache.maven.surefire.booter.ForkedBooter.runSuitesInProcess(ForkedBooter.java:242) [surefire-booter-2.19.1.jar:2.19.1]
	at org.apache.maven.surefire.booter.ForkedBooter.main(ForkedBooter.java:121) [surefire-booter-2.19.1.jar:2.19.1]
[main] ERROR io.siddhi.extension.map.text.sourcemapper.TextSourceMapper [] - Invalid format of event symbol:"wso2",
price:55.6,
volume:200 for attribute price could not find proper value while fail on missing attribute is 'true' in the stream FooStream of siddhi text input mapper.
[main] ERROR io.siddhi.extension.map.text.sourcemapper.TextSourceMapper [] - Exception occurred when converting Text message:symbol:"wso2",
price:55.6,
volume:200 to Siddhi Event in the stream FooStream of siddhi text input mapper.
io.siddhi.core.exception.MappingFailedException: Invalid format of event symbol:"wso2",
price:55.6,
volume:200 for attribute price could not find proper value while fail on missing attribute is 'true' in the stream FooStream of siddhi text input mapper.
	at io.siddhi.extension.map.text.sourcemapper.TextSourceMapper.convertToCustomEvents(TextSourceMapper.java:400) ~[classes/:?]
	at io.siddhi.extension.map.text.sourcemapper.TextSourceMapper.onEventHandler(TextSourceMapper.java:303) [classes/:?]
	at io.siddhi.extension.map.text.sourcemapper.TextSourceMapper.mapAndProcess(TextSourceMapper.java:255) [classes/:?]
	at io.siddhi.core.stream.input.source.SourceMapper.onEvent(SourceMapper.java:201) [siddhi-core-5.1.21.jar:?]
	at io.siddhi.core.stream.input.source.SourceMapper.onEvent(SourceMapper.java:145) [siddhi-core-5.1.21.jar:?]
	at io.siddhi.extension.map.text.sourcemapper.util.TestTrpInMemorySource$1.onMessage(TestTrpInMemorySource.java:79) [test-classes/:?]
	at io.siddhi.core.util.transport.InMemoryBroker$MessageBroker.broadcast(InMemoryBroker.java:110) [siddhi-core-5.1.21.jar:?]
	at io.siddhi.core.util.transport.InMemoryBroker$MessageBroker.publish(InMemoryBroker.java:118) [siddhi-core-5.1.21.jar:?]
	at io.siddhi.core.util.transport.InMemoryBroker.publish(InMemoryBroker.java:41) [siddhi-core-5.1.21.jar:?]
	at io.siddhi.extension.map.text.sourcemapper.TextDefaultSourceMapperTestCase.testTextSourceMapperSingleEventForEventGroup(TextDefaultSourceMapperTestCase.java:695) [test-classes/:?]
	at sun.reflect.NativeMethodAccessorImpl.invoke0(Native Method) ~[?:1.8.0_171]
	at sun.reflect.NativeMethodAccessorImpl.invoke(NativeMethodAccessorImpl.java:62) ~[?:1.8.0_171]
	at sun.reflect.DelegatingMethodAccessorImpl.invoke(DelegatingMethodAccessorImpl.java:43) ~[?:1.8.0_171]
	at java.lang.reflect.Method.invoke(Method.java:498) ~[?:1.8.0_171]
	at org.testng.internal.MethodInvocationHelper.invokeMethod(MethodInvocationHelper.java:108) [testng-6.11.jar:?]
	at org.testng.internal.Invoker.invokeMethod(Invoker.java:661) [testng-6.11.jar:?]
	at org.testng.internal.Invoker.invokeTestMethod(Invoker.java:869) [testng-6.11.jar:?]
	at org.testng.internal.Invoker.invokeTestMethods(Invoker.java:1193) [testng-6.11.jar:?]
	at org.testng.internal.TestMethodWorker.invokeTestMethods(TestMethodWorker.java:126) [testng-6.11.jar:?]
	at org.testng.internal.TestMethodWorker.run(TestMethodWorker.java:109) [testng-6.11.jar:?]
	at org.testng.TestRunner.privateRun(TestRunner.java:744) [testng-6.11.jar:?]
	at org.testng.TestRunner.run(TestRunner.java:602) [testng-6.11.jar:?]
	at org.testng.SuiteRunner.runTest(SuiteRunner.java:380) [testng-6.11.jar:?]
	at org.testng.SuiteRunner.runSequentially(SuiteRunner.java:375) [testng-6.11.jar:?]
	at org.testng.SuiteRunner.privateRun(SuiteRunner.java:340) [testng-6.11.jar:?]
	at org.testng.SuiteRunner.run(SuiteRunner.java:289) [testng-6.11.jar:?]
	at org.testng.SuiteRunnerWorker.runSuite(SuiteRunnerWorker.java:52) [testng-6.11.jar:?]
	at org.testng.SuiteRunnerWorker.run(SuiteRunnerWorker.java:86) [testng-6.11.jar:?]
	at org.testng.TestNG.runSuitesSequentially(TestNG.java:1301) [testng-6.11.jar:?]
	at org.testng.TestNG.runSuitesLocally(TestNG.java:1226) [testng-6.11.jar:?]
	at org.testng.TestNG.runSuites(TestNG.java:1144) [testng-6.11.jar:?]
	at org.testng.TestNG.run(TestNG.java:1115) [testng-6.11.jar:?]
	at org.apache.maven.surefire.testng.TestNGExecutor.run(TestNGExecutor.java:281) [surefire-testng-2.19.1.jar:2.19.1]
	at org.apache.maven.surefire.testng.TestNGXmlTestSuite.execute(TestNGXmlTestSuite.java:75) [surefire-testng-2.19.1.jar:2.19.1]
	at org.apache.maven.surefire.testng.TestNGProvider.invoke(TestNGProvider.java:121) [surefire-testng-2.19.1.jar:2.19.1]
	at org.apache.maven.surefire.booter.ForkedBooter.invokeProviderInSameClassLoader(ForkedBooter.java:290) [surefire-booter-2.19.1.jar:2.19.1]
	at org.apache.maven.surefire.booter.ForkedBooter.runSuitesInProcess(ForkedBooter.java:242) [surefire-booter-2.19.1.jar:2.19.1]
	at org.apache.maven.surefire.booter.ForkedBooter.main(ForkedBooter.java:121) [surefire-booter-2.19.1.jar:2.19.1]
[main] ERROR io.siddhi.core.stream.input.source.SourceMapper [] - Error while processing 'symbol:"wso2",
price:55.6,
volume:200', for the input Mapping 'text' for the stream 'FooStream'.
io.siddhi.core.exception.MappingFailedException: null
	at io.siddhi.extension.map.text.sourcemapper.TextSourceMapper.mapAndProcess(TextSourceMapper.java:278) ~[classes/:?]
	at io.siddhi.core.stream.input.source.SourceMapper.onEvent(SourceMapper.java:201) [siddhi-core-5.1.21.jar:?]
	at io.siddhi.core.stream.input.source.SourceMapper.onEvent(SourceMapper.java:145) [siddhi-core-5.1.21.jar:?]
	at io.siddhi.extension.map.text.sourcemapper.util.TestTrpInMemorySource$1.onMessage(TestTrpInMemorySource.java:79) [test-classes/:?]
	at io.siddhi.core.util.transport.InMemoryBroker$MessageBroker.broadcast(InMemoryBroker.java:110) [siddhi-core-5.1.21.jar:?]
	at io.siddhi.core.util.transport.InMemoryBroker$MessageBroker.publish(InMemoryBroker.java:118) [siddhi-core-5.1.21.jar:?]
	at io.siddhi.core.util.transport.InMemoryBroker.publish(InMemoryBroker.java:41) [siddhi-core-5.1.21.jar:?]
	at io.siddhi.extension.map.text.sourcemapper.TextDefaultSourceMapperTestCase.testTextSourceMapperSingleEventForEventGroup(TextDefaultSourceMapperTestCase.java:695) [test-classes/:?]
	at sun.reflect.NativeMethodAccessorImpl.invoke0(Native Method) ~[?:1.8.0_171]
	at sun.reflect.NativeMethodAccessorImpl.invoke(NativeMethodAccessorImpl.java:62) ~[?:1.8.0_171]
	at sun.reflect.DelegatingMethodAccessorImpl.invoke(DelegatingMethodAccessorImpl.java:43) ~[?:1.8.0_171]
	at java.lang.reflect.Method.invoke(Method.java:498) ~[?:1.8.0_171]
	at org.testng.internal.MethodInvocationHelper.invokeMethod(MethodInvocationHelper.java:108) [testng-6.11.jar:?]
	at org.testng.internal.Invoker.invokeMethod(Invoker.java:661) [testng-6.11.jar:?]
	at org.testng.internal.Invoker.invokeTestMethod(Invoker.java:869) [testng-6.11.jar:?]
	at org.testng.internal.Invoker.invokeTestMethods(Invoker.java:1193) [testng-6.11.jar:?]
	at org.testng.internal.TestMethodWorker.invokeTestMethods(TestMethodWorker.java:126) [testng-6.11.jar:?]
	at org.testng.internal.TestMethodWorker.run(TestMethodWorker.java:109) [testng-6.11.jar:?]
	at org.testng.TestRunner.privateRun(TestRunner.java:744) [testng-6.11.jar:?]
	at org.testng.TestRunner.run(TestRunner.java:602) [testng-6.11.jar:?]
	at org.testng.SuiteRunner.runTest(SuiteRunner.java:380) [testng-6.11.jar:?]
	at org.testng.SuiteRunner.runSequentially(SuiteRunner.java:375) [testng-6.11.jar:?]
	at org.testng.SuiteRunner.privateRun(SuiteRunner.java:340) [testng-6.11.jar:?]
	at org.testng.SuiteRunner.run(SuiteRunner.java:289) [testng-6.11.jar:?]
	at org.testng.SuiteRunnerWorker.runSuite(SuiteRunnerWorker.java:52) [testng-6.11.jar:?]
	at org.testng.SuiteRunnerWorker.run(SuiteRunnerWorker.java:86) [testng-6.11.jar:?]
	at org.testng.TestNG.runSuitesSequentially(TestNG.java:1301) [testng-6.11.jar:?]
	at org.testng.TestNG.runSuitesLocally(TestNG.java:1226) [testng-6.11.jar:?]
	at org.testng.TestNG.runSuites(TestNG.java:1144) [testng-6.11.jar:?]
	at org.testng.TestNG.run(TestNG.java:1115) [testng-6.11.jar:?]
	at org.apache.maven.surefire.testng.TestNGExecutor.run(TestNGExecutor.java:281) [surefire-testng-2.19.1.jar:2.19.1]
	at org.apache.maven.surefire.testng.TestNGXmlTestSuite.execute(TestNGXmlTestSuite.java:75) [surefire-testng-2.19.1.jar:2.19.1]
	at org.apache.maven.surefire.testng.TestNGProvider.invoke(TestNGProvider.java:121) [surefire-testng-2.19.1.jar:2.19.1]
	at org.apache.maven.surefire.booter.ForkedBooter.invokeProviderInSameClassLoader(ForkedBooter.java:290) [surefire-booter-2.19.1.jar:2.19.1]
	at org.apache.maven.surefire.booter.ForkedBooter.runSuitesInProcess(ForkedBooter.java:242) [surefire-booter-2.19.1.jar:2.19.1]
	at org.apache.maven.surefire.booter.ForkedBooter.main(ForkedBooter.java:121) [surefire-booter-2.19.1.jar:2.19.1]
[main] INFO  io.siddhi.core.util.EventPrinter [] - [Event{timestamp=1645063637596, data=[wso2, 55.6, 200], isExpired=false}]
[main] ERROR io.siddhi.extension.map.text.sourcemapper.TextSourceMapper [] - Invalid format of event symbol:"IFS",
price:50.6,
volume:200 for attribute price could not find proper value while fail on missing attribute is 'true' in the stream FooStream of siddhi text input mapper.
[main] ERROR io.siddhi.extension.map.text.sourcemapper.TextSourceMapper [] - Exception occurred when converting Text message:symbol:"IFS",
price:50.6,
volume:200 to Siddhi Event in the stream FooStream of siddhi text input mapper.
io.siddhi.core.exception.MappingFailedException: Invalid format of event symbol:"IFS",
price:50.6,
volume:200 for attribute price could not find proper value while fail on missing attribute is 'true' in the stream FooStream of siddhi text input mapper.
	at io.siddhi.extension.map.text.sourcemapper.TextSourceMapper.convertToCustomEvents(TextSourceMapper.java:400) ~[classes/:?]
	at io.siddhi.extension.map.text.sourcemapper.TextSourceMapper.onEventHandler(TextSourceMapper.java:303) [classes/:?]
	at io.siddhi.extension.map.text.sourcemapper.TextSourceMapper.mapAndProcess(TextSourceMapper.java:255) [classes/:?]
	at io.siddhi.core.stream.input.source.SourceMapper.onEvent(SourceMapper.java:201) [siddhi-core-5.1.21.jar:?]
	at io.siddhi.core.stream.input.source.SourceMapper.onEvent(SourceMapper.java:145) [siddhi-core-5.1.21.jar:?]
	at io.siddhi.extension.map.text.sourcemapper.util.TestTrpInMemorySource$1.onMessage(TestTrpInMemorySource.java:79) [test-classes/:?]
	at io.siddhi.core.util.transport.InMemoryBroker$MessageBroker.broadcast(InMemoryBroker.java:110) [siddhi-core-5.1.21.jar:?]
	at io.siddhi.core.util.transport.InMemoryBroker$MessageBroker.publish(InMemoryBroker.java:118) [siddhi-core-5.1.21.jar:?]
	at io.siddhi.core.util.transport.InMemoryBroker.publish(InMemoryBroker.java:41) [siddhi-core-5.1.21.jar:?]
	at io.siddhi.extension.map.text.sourcemapper.TextDefaultSourceMapperTestCase.testTextSourceMapperSingleEventForEventGroup(TextDefaultSourceMapperTestCase.java:696) [test-classes/:?]
	at sun.reflect.NativeMethodAccessorImpl.invoke0(Native Method) ~[?:1.8.0_171]
	at sun.reflect.NativeMethodAccessorImpl.invoke(NativeMethodAccessorImpl.java:62) ~[?:1.8.0_171]
	at sun.reflect.DelegatingMethodAccessorImpl.invoke(DelegatingMethodAccessorImpl.java:43) ~[?:1.8.0_171]
	at java.lang.reflect.Method.invoke(Method.java:498) ~[?:1.8.0_171]
	at org.testng.internal.MethodInvocationHelper.invokeMethod(MethodInvocationHelper.java:108) [testng-6.11.jar:?]
	at org.testng.internal.Invoker.invokeMethod(Invoker.java:661) [testng-6.11.jar:?]
	at org.testng.internal.Invoker.invokeTestMethod(Invoker.java:869) [testng-6.11.jar:?]
	at org.testng.internal.Invoker.invokeTestMethods(Invoker.java:1193) [testng-6.11.jar:?]
	at org.testng.internal.TestMethodWorker.invokeTestMethods(TestMethodWorker.java:126) [testng-6.11.jar:?]
	at org.testng.internal.TestMethodWorker.run(TestMethodWorker.java:109) [testng-6.11.jar:?]
	at org.testng.TestRunner.privateRun(TestRunner.java:744) [testng-6.11.jar:?]
	at org.testng.TestRunner.run(TestRunner.java:602) [testng-6.11.jar:?]
	at org.testng.SuiteRunner.runTest(SuiteRunner.java:380) [testng-6.11.jar:?]
	at org.testng.SuiteRunner.runSequentially(SuiteRunner.java:375) [testng-6.11.jar:?]
	at org.testng.SuiteRunner.privateRun(SuiteRunner.java:340) [testng-6.11.jar:?]
	at org.testng.SuiteRunner.run(SuiteRunner.java:289) [testng-6.11.jar:?]
	at org.testng.SuiteRunnerWorker.runSuite(SuiteRunnerWorker.java:52) [testng-6.11.jar:?]
	at org.testng.SuiteRunnerWorker.run(SuiteRunnerWorker.java:86) [testng-6.11.jar:?]
	at org.testng.TestNG.runSuitesSequentially(TestNG.java:1301) [testng-6.11.jar:?]
	at org.testng.TestNG.runSuitesLocally(TestNG.java:1226) [testng-6.11.jar:?]
	at org.testng.TestNG.runSuites(TestNG.java:1144) [testng-6.11.jar:?]
	at org.testng.TestNG.run(TestNG.java:1115) [testng-6.11.jar:?]
	at org.apache.maven.surefire.testng.TestNGExecutor.run(TestNGExecutor.java:281) [surefire-testng-2.19.1.jar:2.19.1]
	at org.apache.maven.surefire.testng.TestNGXmlTestSuite.execute(TestNGXmlTestSuite.java:75) [surefire-testng-2.19.1.jar:2.19.1]
	at org.apache.maven.surefire.testng.TestNGProvider.invoke(TestNGProvider.java:121) [surefire-testng-2.19.1.jar:2.19.1]
	at org.apache.maven.surefire.booter.ForkedBooter.invokeProviderInSameClassLoader(ForkedBooter.java:290) [surefire-booter-2.19.1.jar:2.19.1]
	at org.apache.maven.surefire.booter.ForkedBooter.runSuitesInProcess(ForkedBooter.java:242) [surefire-booter-2.19.1.jar:2.19.1]
	at org.apache.maven.surefire.booter.ForkedBooter.main(ForkedBooter.java:121) [surefire-booter-2.19.1.jar:2.19.1]
[main] ERROR io.siddhi.core.stream.input.source.SourceMapper [] - Error while processing 'symbol:"IFS",
price:50.6,
volume:200', for the input Mapping 'text' for the stream 'FooStream'.
io.siddhi.core.exception.MappingFailedException: null
	at io.siddhi.extension.map.text.sourcemapper.TextSourceMapper.mapAndProcess(TextSourceMapper.java:278) ~[classes/:?]
	at io.siddhi.core.stream.input.source.SourceMapper.onEvent(SourceMapper.java:201) [siddhi-core-5.1.21.jar:?]
	at io.siddhi.core.stream.input.source.SourceMapper.onEvent(SourceMapper.java:145) [siddhi-core-5.1.21.jar:?]
	at io.siddhi.extension.map.text.sourcemapper.util.TestTrpInMemorySource$1.onMessage(TestTrpInMemorySource.java:79) [test-classes/:?]
	at io.siddhi.core.util.transport.InMemoryBroker$MessageBroker.broadcast(InMemoryBroker.java:110) [siddhi-core-5.1.21.jar:?]
	at io.siddhi.core.util.transport.InMemoryBroker$MessageBroker.publish(InMemoryBroker.java:118) [siddhi-core-5.1.21.jar:?]
	at io.siddhi.core.util.transport.InMemoryBroker.publish(InMemoryBroker.java:41) [siddhi-core-5.1.21.jar:?]
	at io.siddhi.extension.map.text.sourcemapper.TextDefaultSourceMapperTestCase.testTextSourceMapperSingleEventForEventGroup(TextDefaultSourceMapperTestCase.java:696) [test-classes/:?]
	at sun.reflect.NativeMethodAccessorImpl.invoke0(Native Method) ~[?:1.8.0_171]
	at sun.reflect.NativeMethodAccessorImpl.invoke(NativeMethodAccessorImpl.java:62) ~[?:1.8.0_171]
	at sun.reflect.DelegatingMethodAccessorImpl.invoke(DelegatingMethodAccessorImpl.java:43) ~[?:1.8.0_171]
	at java.lang.reflect.Method.invoke(Method.java:498) ~[?:1.8.0_171]
	at org.testng.internal.MethodInvocationHelper.invokeMethod(MethodInvocationHelper.java:108) [testng-6.11.jar:?]
	at org.testng.internal.Invoker.invokeMethod(Invoker.java:661) [testng-6.11.jar:?]
	at org.testng.internal.Invoker.invokeTestMethod(Invoker.java:869) [testng-6.11.jar:?]
	at org.testng.internal.Invoker.invokeTestMethods(Invoker.java:1193) [testng-6.11.jar:?]
	at org.testng.internal.TestMethodWorker.invokeTestMethods(TestMethodWorker.java:126) [testng-6.11.jar:?]
	at org.testng.internal.TestMethodWorker.run(TestMethodWorker.java:109) [testng-6.11.jar:?]
	at org.testng.TestRunner.privateRun(TestRunner.java:744) [testng-6.11.jar:?]
	at org.testng.TestRunner.run(TestRunner.java:602) [testng-6.11.jar:?]
	at org.testng.SuiteRunner.runTest(SuiteRunner.java:380) [testng-6.11.jar:?]
	at org.testng.SuiteRunner.runSequentially(SuiteRunner.java:375) [testng-6.11.jar:?]
	at org.testng.SuiteRunner.privateRun(SuiteRunner.java:340) [testng-6.11.jar:?]
	at org.testng.SuiteRunner.run(SuiteRunner.java:289) [testng-6.11.jar:?]
	at org.testng.SuiteRunnerWorker.runSuite(SuiteRunnerWorker.java:52) [testng-6.11.jar:?]
	at org.testng.SuiteRunnerWorker.run(SuiteRunnerWorker.java:86) [testng-6.11.jar:?]
	at org.testng.TestNG.runSuitesSequentially(TestNG.java:1301) [testng-6.11.jar:?]
	at org.testng.TestNG.runSuitesLocally(TestNG.java:1226) [testng-6.11.jar:?]
	at org.testng.TestNG.runSuites(TestNG.java:1144) [testng-6.11.jar:?]
	at org.testng.TestNG.run(TestNG.java:1115) [testng-6.11.jar:?]
	at org.apache.maven.surefire.testng.TestNGExecutor.run(TestNGExecutor.java:281) [surefire-testng-2.19.1.jar:2.19.1]
	at org.apache.maven.surefire.testng.TestNGXmlTestSuite.execute(TestNGXmlTestSuite.java:75) [surefire-testng-2.19.1.jar:2.19.1]
	at org.apache.maven.surefire.testng.TestNGProvider.invoke(TestNGProvider.java:121) [surefire-testng-2.19.1.jar:2.19.1]
	at org.apache.maven.surefire.booter.ForkedBooter.invokeProviderInSameClassLoader(ForkedBooter.java:290) [surefire-booter-2.19.1.jar:2.19.1]
	at org.apache.maven.surefire.booter.ForkedBooter.runSuitesInProcess(ForkedBooter.java:242) [surefire-booter-2.19.1.jar:2.19.1]
	at org.apache.maven.surefire.booter.ForkedBooter.main(ForkedBooter.java:121) [surefire-booter-2.19.1.jar:2.19.1]
[main] ERROR io.siddhi.extension.map.text.sourcemapper.TextSourceMapper [] - Invalid format of event symbol:"IFS",
price:50.6,
volume:200 for attribute price could not find proper value while fail on missing attribute is 'true' in the stream FooStream of siddhi text input mapper.
[main] ERROR io.siddhi.extension.map.text.sourcemapper.TextSourceMapper [] - Exception occurred when converting Text message:symbol:"IFS",
price:50.6,
volume:200 to Siddhi Event in the stream FooStream of siddhi text input mapper.
io.siddhi.core.exception.MappingFailedException: Invalid format of event symbol:"IFS",
price:50.6,
volume:200 for attribute price could not find proper value while fail on missing attribute is 'true' in the stream FooStream of siddhi text input mapper.
	at io.siddhi.extension.map.text.sourcemapper.TextSourceMapper.convertToCustomEvents(TextSourceMapper.java:400) ~[classes/:?]
	at io.siddhi.extension.map.text.sourcemapper.TextSourceMapper.onEventHandler(TextSourceMapper.java:303) [classes/:?]
	at io.siddhi.extension.map.text.sourcemapper.TextSourceMapper.mapAndProcess(TextSourceMapper.java:255) [classes/:?]
	at io.siddhi.core.stream.input.source.SourceMapper.onEvent(SourceMapper.java:201) [siddhi-core-5.1.21.jar:?]
	at io.siddhi.core.stream.input.source.SourceMapper.onEvent(SourceMapper.java:145) [siddhi-core-5.1.21.jar:?]
	at io.siddhi.extension.map.text.sourcemapper.util.TestTrpInMemorySource$1.onMessage(TestTrpInMemorySource.java:79) [test-classes/:?]
	at io.siddhi.core.util.transport.InMemoryBroker$MessageBroker.broadcast(InMemoryBroker.java:110) [siddhi-core-5.1.21.jar:?]
	at io.siddhi.core.util.transport.InMemoryBroker$MessageBroker.publish(InMemoryBroker.java:118) [siddhi-core-5.1.21.jar:?]
	at io.siddhi.core.util.transport.InMemoryBroker.publish(InMemoryBroker.java:41) [siddhi-core-5.1.21.jar:?]
	at io.siddhi.extension.map.text.sourcemapper.TextDefaultSourceMapperTestCase.testTextSourceMapperSingleEventForEventGroup(TextDefaultSourceMapperTestCase.java:696) [test-classes/:?]
	at sun.reflect.NativeMethodAccessorImpl.invoke0(Native Method) ~[?:1.8.0_171]
	at sun.reflect.NativeMethodAccessorImpl.invoke(NativeMethodAccessorImpl.java:62) ~[?:1.8.0_171]
	at sun.reflect.DelegatingMethodAccessorImpl.invoke(DelegatingMethodAccessorImpl.java:43) ~[?:1.8.0_171]
	at java.lang.reflect.Method.invoke(Method.java:498) ~[?:1.8.0_171]
	at org.testng.internal.MethodInvocationHelper.invokeMethod(MethodInvocationHelper.java:108) [testng-6.11.jar:?]
	at org.testng.internal.Invoker.invokeMethod(Invoker.java:661) [testng-6.11.jar:?]
	at org.testng.internal.Invoker.invokeTestMethod(Invoker.java:869) [testng-6.11.jar:?]
	at org.testng.internal.Invoker.invokeTestMethods(Invoker.java:1193) [testng-6.11.jar:?]
	at org.testng.internal.TestMethodWorker.invokeTestMethods(TestMethodWorker.java:126) [testng-6.11.jar:?]
	at org.testng.internal.TestMethodWorker.run(TestMethodWorker.java:109) [testng-6.11.jar:?]
	at org.testng.TestRunner.privateRun(TestRunner.java:744) [testng-6.11.jar:?]
	at org.testng.TestRunner.run(TestRunner.java:602) [testng-6.11.jar:?]
	at org.testng.SuiteRunner.runTest(SuiteRunner.java:380) [testng-6.11.jar:?]
	at org.testng.SuiteRunner.runSequentially(SuiteRunner.java:375) [testng-6.11.jar:?]
	at org.testng.SuiteRunner.privateRun(SuiteRunner.java:340) [testng-6.11.jar:?]
	at org.testng.SuiteRunner.run(SuiteRunner.java:289) [testng-6.11.jar:?]
	at org.testng.SuiteRunnerWorker.runSuite(SuiteRunnerWorker.java:52) [testng-6.11.jar:?]
	at org.testng.SuiteRunnerWorker.run(SuiteRunnerWorker.java:86) [testng-6.11.jar:?]
	at org.testng.TestNG.runSuitesSequentially(TestNG.java:1301) [testng-6.11.jar:?]
	at org.testng.TestNG.runSuitesLocally(TestNG.java:1226) [testng-6.11.jar:?]
	at org.testng.TestNG.runSuites(TestNG.java:1144) [testng-6.11.jar:?]
	at org.testng.TestNG.run(TestNG.java:1115) [testng-6.11.jar:?]
	at org.apache.maven.surefire.testng.TestNGExecutor.run(TestNGExecutor.java:281) [surefire-testng-2.19.1.jar:2.19.1]
	at org.apache.maven.surefire.testng.TestNGXmlTestSuite.execute(TestNGXmlTestSuite.java:75) [surefire-testng-2.19.1.jar:2.19.1]
	at org.apache.maven.surefire.testng.TestNGProvider.invoke(TestNGProvider.java:121) [surefire-testng-2.19.1.jar:2.19.1]
	at org.apache.maven.surefire.booter.ForkedBooter.invokeProviderInSameClassLoader(ForkedBooter.java:290) [surefire-booter-2.19.1.jar:2.19.1]
	at org.apache.maven.surefire.booter.ForkedBooter.runSuitesInProcess(ForkedBooter.java:242) [surefire-booter-2.19.1.jar:2.19.1]
	at org.apache.maven.surefire.booter.ForkedBooter.main(ForkedBooter.java:121) [surefire-booter-2.19.1.jar:2.19.1]
[main] ERROR io.siddhi.core.stream.input.source.SourceMapper [] - Error while processing 'symbol:"IFS",
price:50.6,
volume:200', for the input Mapping 'text' for the stream 'FooStream'.
io.siddhi.core.exception.MappingFailedException: null
	at io.siddhi.extension.map.text.sourcemapper.TextSourceMapper.mapAndProcess(TextSourceMapper.java:278) ~[classes/:?]
	at io.siddhi.core.stream.input.source.SourceMapper.onEvent(SourceMapper.java:201) [siddhi-core-5.1.21.jar:?]
	at io.siddhi.core.stream.input.source.SourceMapper.onEvent(SourceMapper.java:145) [siddhi-core-5.1.21.jar:?]
	at io.siddhi.extension.map.text.sourcemapper.util.TestTrpInMemorySource$1.onMessage(TestTrpInMemorySource.java:79) [test-classes/:?]
	at io.siddhi.core.util.transport.InMemoryBroker$MessageBroker.broadcast(InMemoryBroker.java:110) [siddhi-core-5.1.21.jar:?]
	at io.siddhi.core.util.transport.InMemoryBroker$MessageBroker.publish(InMemoryBroker.java:118) [siddhi-core-5.1.21.jar:?]
	at io.siddhi.core.util.transport.InMemoryBroker.publish(InMemoryBroker.java:41) [siddhi-core-5.1.21.jar:?]
	at io.siddhi.extension.map.text.sourcemapper.TextDefaultSourceMapperTestCase.testTextSourceMapperSingleEventForEventGroup(TextDefaultSourceMapperTestCase.java:696) [test-classes/:?]
	at sun.reflect.NativeMethodAccessorImpl.invoke0(Native Method) ~[?:1.8.0_171]
	at sun.reflect.NativeMethodAccessorImpl.invoke(NativeMethodAccessorImpl.java:62) ~[?:1.8.0_171]
	at sun.reflect.DelegatingMethodAccessorImpl.invoke(DelegatingMethodAccessorImpl.java:43) ~[?:1.8.0_171]
	at java.lang.reflect.Method.invoke(Method.java:498) ~[?:1.8.0_171]
	at org.testng.internal.MethodInvocationHelper.invokeMethod(MethodInvocationHelper.java:108) [testng-6.11.jar:?]
	at org.testng.internal.Invoker.invokeMethod(Invoker.java:661) [testng-6.11.jar:?]
	at org.testng.internal.Invoker.invokeTestMethod(Invoker.java:869) [testng-6.11.jar:?]
	at org.testng.internal.Invoker.invokeTestMethods(Invoker.java:1193) [testng-6.11.jar:?]
	at org.testng.internal.TestMethodWorker.invokeTestMethods(TestMethodWorker.java:126) [testng-6.11.jar:?]
	at org.testng.internal.TestMethodWorker.run(TestMethodWorker.java:109) [testng-6.11.jar:?]
	at org.testng.TestRunner.privateRun(TestRunner.java:744) [testng-6.11.jar:?]
	at org.testng.TestRunner.run(TestRunner.java:602) [testng-6.11.jar:?]
	at org.testng.SuiteRunner.runTest(SuiteRunner.java:380) [testng-6.11.jar:?]
	at org.testng.SuiteRunner.runSequentially(SuiteRunner.java:375) [testng-6.11.jar:?]
	at org.testng.SuiteRunner.privateRun(SuiteRunner.java:340) [testng-6.11.jar:?]
	at org.testng.SuiteRunner.run(SuiteRunner.java:289) [testng-6.11.jar:?]
	at org.testng.SuiteRunnerWorker.runSuite(SuiteRunnerWorker.java:52) [testng-6.11.jar:?]
	at org.testng.SuiteRunnerWorker.run(SuiteRunnerWorker.java:86) [testng-6.11.jar:?]
	at org.testng.TestNG.runSuitesSequentially(TestNG.java:1301) [testng-6.11.jar:?]
	at org.testng.TestNG.runSuitesLocally(TestNG.java:1226) [testng-6.11.jar:?]
	at org.testng.TestNG.runSuites(TestNG.java:1144) [testng-6.11.jar:?]
	at org.testng.TestNG.run(TestNG.java:1115) [testng-6.11.jar:?]
	at org.apache.maven.surefire.testng.TestNGExecutor.run(TestNGExecutor.java:281) [surefire-testng-2.19.1.jar:2.19.1]
	at org.apache.maven.surefire.testng.TestNGXmlTestSuite.execute(TestNGXmlTestSuite.java:75) [surefire-testng-2.19.1.jar:2.19.1]
	at org.apache.maven.surefire.testng.TestNGProvider.invoke(TestNGProvider.java:121) [surefire-testng-2.19.1.jar:2.19.1]
	at org.apache.maven.surefire.booter.ForkedBooter.invokeProviderInSameClassLoader(ForkedBooter.java:290) [surefire-booter-2.19.1.jar:2.19.1]
	at org.apache.maven.surefire.booter.ForkedBooter.runSuitesInProcess(ForkedBooter.java:242) [surefire-booter-2.19.1.jar:2.19.1]
	at org.apache.maven.surefire.booter.ForkedBooter.main(ForkedBooter.java:121) [surefire-booter-2.19.1.jar:2.19.1]
[main] INFO  io.siddhi.core.util.EventPrinter [] - [Event{timestamp=1645063637597, data=[IFS, 50.6, 200], isExpired=false}]
[main] INFO  io.siddhi.extension.map.text.sinkmapper.TextCustomSinkMapperTestCase [] - test text custom map with file io
[org.apache.commons.vfs2.impl.StandardFileSystemManager] : Using "/tmp/vfs_cache" as temporary files store.
[org.apache.commons.vfs2.impl.StandardFileSystemManager] : Skipping provider "org.apache.commons.vfs2.provider.tar.TarFileProvider" because required class "org.apache.commons.compress.archivers.tar.TarArchiveOutputStream" is not available.
[org.apache.commons.vfs2.impl.StandardFileSystemManager] : Skipping provider "org.apache.commons.vfs2.provider.bzip2.Bzip2FileProvider" because required class "org.apache.commons.compress.compressors.bzip2.BZip2CompressorInputStream" is not available.
[org.apache.commons.vfs2.impl.StandardFileSystemManager] : Skipping provider "org.apache.commons.vfs2.provider.http.HttpFileProvider" because required class "org.apache.commons.httpclient.HttpClient" is not available.
[org.apache.commons.vfs2.impl.StandardFileSystemManager] : Skipping provider "org.apache.commons.vfs2.provider.https.HttpsFileProvider" because required class "org.apache.commons.httpclient.HttpClient" is not available.
[org.apache.commons.vfs2.impl.StandardFileSystemManager] : Skipping provider "org.apache.commons.vfs2.provider.sftp.SftpFileProvider" because required class "com.jcraft.jsch.JSch" is not available.
[org.apache.commons.vfs2.impl.StandardFileSystemManager] : Skipping provider "org.apache.commons.vfs2.provider.webdav.WebdavFileProvider" because required class "org.apache.commons.httpclient.HttpClient" is not available.
[org.apache.commons.vfs2.impl.StandardFileSystemManager] : Skipping provider "org.apache.commons.vfs2.provider.tar.TarFileProvider" because required scheme "tar" is not available.
[org.apache.commons.vfs2.impl.StandardFileSystemManager] : Skipping provider "org.apache.commons.vfs2.provider.tar.TarFileProvider" because required scheme "bz2" is not available.
[org.apache.commons.vfs2.impl.StandardFileSystemManager] : Skipping provider "org.apache.commons.vfs2.provider.hdfs.HdfsFileProvider" because required class "org.apache.hadoop.fs.FileSystem" is not available.
[org.apache.commons.vfs2.impl.StandardFileSystemManager] : Skipping provider "org.apache.commons.vfs2.provider.smb.SmbFileProvider" because required class "jcifs.smb.SmbFile" is not available.
[org.apache.commons.vfs2.impl.StandardFileSystemManager] : Skipping provider "org.apache.commons.vfs2.provider.mime.MimeFileProvider" because required class "javax.mail.internet.MimeMultipart" is not available.
[org.apache.commons.vfs2.cache.SoftRefFilesCache] : putFile: file:///home/jenkins/workspace/sonar/sonar-siddhi-map-text/component/target/test-classes/files/sink/WSO2.txt
[org.apache.commons.vfs2.cache.SoftRefFilesCache] : putFile: file:///
[org.apache.commons.vfs2.cache.SoftRefFilesCache] : putFile: file:///home/jenkins/workspace/sonar/sonar-siddhi-map-text/component/target/test-classes/files/sink
[org.apache.commons.vfs2.cache.SoftRefFilesCache] : putFile: file:///home/jenkins/workspace/sonar/sonar-siddhi-map-text/component/target/test-classes/files
[org.apache.commons.vfs2.cache.SoftRefFilesCache] : putFile: file:///home/jenkins/workspace/sonar/sonar-siddhi-map-text/component/target/test-classes/files/sink/IBM.txt
[org.apache.commons.vfs2.cache.SoftRefFilesCache] : putFile: file:///home/jenkins/workspace/sonar/sonar-siddhi-map-text/component/target/test-classes/files/sink/GOOGLE.txt
[org.apache.commons.vfs2.cache.SoftRefFilesCache] : putFile: file:///home/jenkins/workspace/sonar/sonar-siddhi-map-text/component/target/test-classes/files/sink/REDHAT.txt
[main] INFO  io.siddhi.extension.map.text.sinkmapper.TextCustomSinkMapperTestCase [] - test text default map with file io
[main] INFO  io.siddhi.extension.map.text.sinkmapper.TextCustomSinkMapperTestCase [] - Creating test for publishing events with TEXT mapping.
[io.siddhi.extension.io.http.sink.HttpSink] : 03405228-7561-424b-80ca-35777428be81:@sink( type = "http", publisher.url = "http://localhost:8005/abc", method = "{{method}}", headers = "{{headers}}", @map( type = "text", mustache.enabled = "true", @payload( "{{{message}}}")))define stream BarStream (message string, method string, headers string) has successfully connected to http://localhost:8005/abc
[Thread-4] INFO  io.siddhi.extension.map.text.sinkmapper.util.HttpServerListener [] - Event Arrived: WSO2,55.6,100

[io.siddhi.extension.io.http.sink.HttpSink] : Server connector for url http://localhost:8005/abc disconnected.
[nioEventLoopGroup-16-1] ERROR org.wso2.transport.http.netty.contractimpl.sender.states.RequestCompleted - Remote host closed the connection before initiating inbound response
[main] INFO  io.siddhi.extension.map.text.sinkmapper.TextCustomSinkMapperTestCase [] - Creating test for publishing events with TEXT mapping.
[io.siddhi.extension.io.http.sink.HttpSink] : bd369726-c0f7-4b59-8c1c-d13069d1df91:@sink( type = "http", publisher.url = "http://localhost:8005/abc", method = "{{method}}", headers = "{{headers}}", @map( type = "text", mustache.enabled = "true", event.grouping.enabled = "true", @payload( "{{{message}}}")))define stream BarStream (message string, method string, headers string) has successfully connected to http://localhost:8005/abc
[Thread-7] INFO  io.siddhi.extension.map.text.sinkmapper.util.HttpServerListener [] - Event Arrived: WSO2
~~~~~~~~~~
WSO2
~~~~~~~~~~
WSO2
~~~~~~~~~~
WSO2
~~~~~~~~~~
WSO2

[io.siddhi.extension.io.http.sink.HttpSink] : Server connector for url http://localhost:8005/abc disconnected.
[nioEventLoopGroup-19-1] ERROR org.wso2.transport.http.netty.contractimpl.sender.states.RequestCompleted - Remote host closed the connection before initiating inbound response
[main] INFO  io.siddhi.extension.map.text.sinkmapper.TextCustomSinkMapperTestCase [] - Test custom text mapping.
[main] WARN  io.siddhi.core.SiddhiManager [] - Dropping extension 'class io.siddhi.core.stream.output.sink.InMemorySink' as 'class io.siddhi.core.stream.output.sink.InMemorySink' is loaded with the same namespace and name 'sink:inMemory'
[main] INFO  io.siddhi.extension.map.text.sinkmapper.TextCustomSinkMapperTestCase [] - Test for custom delimiter.
[main] WARN  io.siddhi.core.SiddhiManager [] - Dropping extension 'class io.siddhi.core.stream.output.sink.InMemorySink' as 'class io.siddhi.core.stream.output.sink.InMemorySink' is loaded with the same namespace and name 'sink:inMemory'
[main] INFO  io.siddhi.extension.map.text.sinkmapper.TextCustomSinkMapperTestCase [] - Test for default delimiter
[main] WARN  io.siddhi.core.SiddhiManager [] - Dropping extension 'class io.siddhi.core.stream.output.sink.InMemorySink' as 'class io.siddhi.core.stream.output.sink.InMemorySink' is loaded with the same namespace and name 'sink:inMemory'
[main] INFO  io.siddhi.extension.map.text.sinkmapper.TextCustomSinkMapperTestCase [] - Test for event group with single event.
[main] WARN  io.siddhi.core.SiddhiManager [] - Dropping extension 'class io.siddhi.core.stream.output.sink.InMemorySink' as 'class io.siddhi.core.stream.output.sink.InMemorySink' is loaded with the same namespace and name 'sink:inMemory'
[main] INFO  io.siddhi.extension.map.text.sinkmapper.TextCustomSinkMapperTestCase [] - Test with custom new lie charater.
[main] WARN  io.siddhi.core.SiddhiManager [] - Dropping extension 'class io.siddhi.core.stream.output.sink.InMemorySink' as 'class io.siddhi.core.stream.output.sink.InMemorySink' is loaded with the same namespace and name 'sink:inMemory'
[main] INFO  io.siddhi.extension.map.text.sinkmapper.TextCustomSinkMapperTestCase [] - Test with custom new.line.character.
[main] WARN  io.siddhi.core.SiddhiManager [] - Dropping extension 'class io.siddhi.core.stream.output.sink.InMemorySink' as 'class io.siddhi.core.stream.output.sink.InMemorySink' is loaded with the same namespace and name 'sink:inMemory'
[main] INFO  io.siddhi.extension.map.text.sinkmapper.TextCustomSinkMapperTestCase [] - Test extra delimiter.
[main] WARN  io.siddhi.core.SiddhiManager [] - Dropping extension 'class io.siddhi.core.stream.output.sink.InMemorySink' as 'class io.siddhi.core.stream.output.sink.InMemorySink' is loaded with the same namespace and name 'sink:inMemory'
[main] INFO  io.siddhi.extension.map.text.sinkmapper.TextCustomSinkMapperTestCase [] - Test custom mapping without payload.
[main] WARN  io.siddhi.core.SiddhiManager [] - Dropping extension 'class io.siddhi.core.stream.output.sink.InMemorySink' as 'class io.siddhi.core.stream.output.sink.InMemorySink' is loaded with the same namespace and name 'sink:inMemory'
[main] INFO  io.siddhi.extension.map.text.sinkmapper.TextCustomSinkMapperTestCase [] - Test custom for wrong mapping.
[main] WARN  io.siddhi.core.SiddhiManager [] - Dropping extension 'class io.siddhi.core.stream.output.sink.InMemorySink' as 'class io.siddhi.core.stream.output.sink.InMemorySink' is loaded with the same namespace and name 'sink:inMemory'
[main] INFO  io.siddhi.extension.map.text.sinkmapper.TextDefaultSinkMapperTestCase [] - test text default map with file io
[main] INFO  io.siddhi.extension.map.text.sinkmapper.TextDefaultSinkMapperTestCase [] - test text default map with file io
[main] INFO  io.siddhi.extension.map.text.sinkmapper.TextDefaultSinkMapperTestCase [] - test text default map with file io
[main] INFO  io.siddhi.extension.map.text.sinkmapper.TextDefaultSinkMapperTestCase [] - Test for single event when event grouping enabled.
[main] WARN  io.siddhi.core.SiddhiManager [] - Dropping extension 'class io.siddhi.core.stream.output.sink.InMemorySink' as 'class io.siddhi.core.stream.output.sink.InMemorySink' is loaded with the same namespace and name 'sink:inMemory'
[main] INFO  io.siddhi.core.stream.output.sink.LogSink [] - TestSiddhiApp : BarStream : Event{timestamp=1645063645564, data=[WSO2, 55.6, 10], isExpired=false}
[main] INFO  io.siddhi.core.stream.output.sink.LogSink [] - TestSiddhiApp : BarStream : Event{timestamp=1645063645564, data=[IBM, 75.6, 10], isExpired=false}
[main] INFO  io.siddhi.extension.map.text.sinkmapper.TextDefaultSinkMapperTestCase [] - Creating test for publishing events with TEXT mapping.
[io.siddhi.extension.io.http.sink.HttpSink] : 9c05acc5-7127-47f4-8188-a0f28c6b8c27:@sink( type = "http", publisher.url = "http://localhost:8005/abc", method = "{{method}}", headers = "{{headers}}", @map( type = "text"))define stream BarStream (message string, method string, headers string) has successfully connected to http://localhost:8005/abc
[Thread-9] INFO  io.siddhi.extension.map.text.sinkmapper.util.HttpServerListener [] - Event Arrived: message:"WSO2,55.6,100",
method:"POST",
headers:"'Name:John','Age:23'"

[io.siddhi.extension.io.http.sink.HttpSink] : Server connector for url http://localhost:8005/abc disconnected.
[nioEventLoopGroup-22-1] ERROR org.wso2.transport.http.netty.contractimpl.sender.states.RequestCompleted - Remote host closed the connection before initiating inbound response
[main] INFO  io.siddhi.extension.map.text.sinkmapper.TextDefaultSinkMapperTestCase [] - Test without event grouping attribute.
[main] WARN  io.siddhi.core.SiddhiManager [] - Dropping extension 'class io.siddhi.core.stream.output.sink.InMemorySink' as 'class io.siddhi.core.stream.output.sink.InMemorySink' is loaded with the same namespace and name 'sink:inMemory'
[main] INFO  io.siddhi.extension.map.text.sinkmapper.TextDefaultSinkMapperTestCase [] - Test without event grouping attribute.
[main] WARN  io.siddhi.core.SiddhiManager [] - Dropping extension 'class io.siddhi.core.stream.output.sink.InMemorySink' as 'class io.siddhi.core.stream.output.sink.InMemorySink' is loaded with the same namespace and name 'sink:inMemory'
[main] INFO  io.siddhi.extension.map.text.sinkmapper.TextDefaultSinkMapperTestCase [] - Test for custom event delimiter.
[main] WARN  io.siddhi.core.SiddhiManager [] - Dropping extension 'class io.siddhi.core.stream.output.sink.InMemorySink' as 'class io.siddhi.core.stream.output.sink.InMemorySink' is loaded with the same namespace and name 'sink:inMemory'
[main] INFO  io.siddhi.extension.map.text.sinkmapper.TextDefaultSinkMapperTestCase [] - Test for default event delimiter.
[main] WARN  io.siddhi.core.SiddhiManager [] - Dropping extension 'class io.siddhi.core.stream.output.sink.InMemorySink' as 'class io.siddhi.core.stream.output.sink.InMemorySink' is loaded with the same namespace and name 'sink:inMemory'
[main] INFO  io.siddhi.extension.map.text.sinkmapper.TextDefaultSinkMapperTestCase [] - Test for default event delimiter and http.
[io.siddhi.extension.io.http.sink.HttpSink] : TestSiddhiApp:@sink( type = "http", publisher.url = "http://localhost:8005/abc", method = "{{method}}", headers = "{{headers}}", @map( type = "text", event.grouping.enabled = "true"))define stream BarStream (message string, method string, headers string) has successfully connected to http://localhost:8005/abc
[Thread-11] INFO  io.siddhi.extension.map.text.sinkmapper.util.HttpServerListener [] - Event Arrived: message:"WSO2",
method:"POST",
headers:"'place:office'"
~~~~~~~~~~
message:"WSO2",
method:"POST",
headers:"'place:office'"
~~~~~~~~~~
message:"WSO2",
method:"POST",
headers:"'place:office'"
~~~~~~~~~~
message:"WSO2",
method:"POST",
headers:"'place:office'"
~~~~~~~~~~
message:"WSO2",
method:"POST",
headers:"'place:office'"

[io.siddhi.extension.io.http.sink.HttpSink] : Server connector for url http://localhost:8005/abc disconnected.
[nioEventLoopGroup-25-1] ERROR org.wso2.transport.http.netty.contractimpl.sender.states.RequestCompleted - Remote host closed the connection before initiating inbound response
[main] INFO  io.siddhi.extension.map.text.sinkmapper.TextDefaultSinkMapperTestCase [] - Test for single event when event grouping enabled.
[main] WARN  io.siddhi.core.SiddhiManager [] - Dropping extension 'class io.siddhi.core.stream.output.sink.InMemorySink' as 'class io.siddhi.core.stream.output.sink.InMemorySink' is loaded with the same namespace and name 'sink:inMemory'
[main] INFO  io.siddhi.extension.map.text.sinkmapper.TextDefaultSinkMapperTestCase [] - Test for new.line.charater
[main] WARN  io.siddhi.core.SiddhiManager [] - Dropping extension 'class io.siddhi.core.stream.output.sink.InMemorySink' as 'class io.siddhi.core.stream.output.sink.InMemorySink' is loaded with the same namespace and name 'sink:inMemory'
[main] INFO  io.siddhi.extension.map.text.sinkmapper.TextDefaultSinkMapperTestCase [] - Test default text mapping.
[main] WARN  io.siddhi.core.SiddhiManager [] - Dropping extension 'class io.siddhi.core.stream.output.sink.InMemorySink' as 'class io.siddhi.core.stream.output.sink.InMemorySink' is loaded with the same namespace and name 'sink:inMemory'
Tests run: 62, Failures: 0, Errors: 0, Skipped: 0, Time elapsed: 12.917 sec - in TestSuite

Results :

Tests run: 62, Failures: 0, Errors: 0, Skipped: 0

[JENKINS] Recording test results
[INFO] 
[INFO] --- maven-bundle-plugin:3.0.1:bundle (default-bundle) @ siddhi-map-text ---
[WARNING] Include-Resource: overriding META-INF/NOTICE=target/maven-shared-archive-resources/META-INF/NOTICE,META-INF/LICENSE=target/maven-shared-archive-resources/META-INF/LICENSE,META-INF/DEPENDENCIES=target/maven-shared-archive-resources/META-INF/DEPENDENCIES with META-INF=target/classes/META-INF (add {maven-resources} if you want to include the maven resources)
[INFO] 
[INFO] --- jacoco-maven-plugin:0.7.9:report (jacoco-site) @ siddhi-map-text ---
[INFO] Loading execution data file /home/jenkins/workspace/sonar/sonar-siddhi-map-text/component/target/coverage-reports/jacoco.exec
[INFO] Analyzed bundle 'Siddhi Extension - Text Mapper' with 2 classes
[INFO] 
[INFO] --- maven-install-plugin:2.5.2:install (default-install) @ siddhi-map-text ---
[INFO] Installing /home/jenkins/workspace/sonar/sonar-siddhi-map-text/component/target/siddhi-map-text-2.1.2-SNAPSHOT.jar to /home/jenkins/workspace/sonar/sonar-siddhi-map-text/.repository/io/siddhi/extension/map/text/siddhi-map-text/2.1.2-SNAPSHOT/siddhi-map-text-2.1.2-SNAPSHOT.jar
[INFO] Installing /home/jenkins/workspace/sonar/sonar-siddhi-map-text/component/pom.xml to /home/jenkins/workspace/sonar/sonar-siddhi-map-text/.repository/io/siddhi/extension/map/text/siddhi-map-text/2.1.2-SNAPSHOT/siddhi-map-text-2.1.2-SNAPSHOT.pom
[INFO] 
[INFO] --- maven-bundle-plugin:3.0.1:install (default-install) @ siddhi-map-text ---
[INFO] Local OBR update disabled (enable with -DobrRepository)
[JENKINS] Archiving disabled