SuccessConsole Output

Skipping 401 KB.. Full Log
ava:281) [surefire-testng-2.19.1.jar:2.19.1]
	at org.apache.maven.surefire.testng.TestNGXmlTestSuite.execute(TestNGXmlTestSuite.java:75) [surefire-testng-2.19.1.jar:2.19.1]
	at org.apache.maven.surefire.testng.TestNGProvider.invoke(TestNGProvider.java:121) [surefire-testng-2.19.1.jar:2.19.1]
	at org.apache.maven.surefire.booter.ForkedBooter.invokeProviderInSameClassLoader(ForkedBooter.java:290) [surefire-booter-2.19.1.jar:2.19.1]
	at org.apache.maven.surefire.booter.ForkedBooter.runSuitesInProcess(ForkedBooter.java:242) [surefire-booter-2.19.1.jar:2.19.1]
	at org.apache.maven.surefire.booter.ForkedBooter.main(ForkedBooter.java:121) [surefire-booter-2.19.1.jar:2.19.1]
[main] ERROR io.siddhi.extension.map.keyvalue.sourcemapper.KeyValueSourceMapper [] - Stream "FooStream" has an attribute named "price", but the received event {volume=100, symbol=WSO2, amount=300, price=55.6, state=false} does not has a value for that attribute. Hence dropping the message.
[main] ERROR io.siddhi.core.stream.input.source.SourceMapper [] - Error while processing '{volume=100, symbol=WSO2, amount=300, price=55.6, state=false}', for the input Mapping 'keyvalue' for the stream 'FooStream'.
io.siddhi.core.exception.MappingFailedException: null
	at io.siddhi.extension.map.keyvalue.sourcemapper.KeyValueSourceMapper.mapAndProcess(KeyValueSourceMapper.java:172) ~[classes/:?]
	at io.siddhi.core.stream.input.source.SourceMapper.onEvent(SourceMapper.java:201) [siddhi-core-5.1.21.jar:?]
	at io.siddhi.core.stream.input.source.SourceMapper.onEvent(SourceMapper.java:145) [siddhi-core-5.1.21.jar:?]
	at io.siddhi.extension.map.keyvalue.sourcemapper.TestTrpInMemorySource$1.onMessage(TestTrpInMemorySource.java:79) [test-classes/:?]
	at io.siddhi.core.util.transport.InMemoryBroker$MessageBroker.broadcast(InMemoryBroker.java:110) [siddhi-core-5.1.21.jar:?]
	at io.siddhi.core.util.transport.InMemoryBroker$MessageBroker.publish(InMemoryBroker.java:118) [siddhi-core-5.1.21.jar:?]
	at io.siddhi.core.util.transport.InMemoryBroker.publish(InMemoryBroker.java:41) [siddhi-core-5.1.21.jar:?]
	at io.siddhi.extension.map.keyvalue.sourcemapper.KeyValueSourceMapperTestCase.keyvalueSourceMapperDefaultTest4(KeyValueSourceMapperTestCase.java:335) [test-classes/:?]
	at sun.reflect.NativeMethodAccessorImpl.invoke0(Native Method) ~[?:1.8.0_171]
	at sun.reflect.NativeMethodAccessorImpl.invoke(NativeMethodAccessorImpl.java:62) ~[?:1.8.0_171]
	at sun.reflect.DelegatingMethodAccessorImpl.invoke(DelegatingMethodAccessorImpl.java:43) ~[?:1.8.0_171]
	at java.lang.reflect.Method.invoke(Method.java:498) ~[?:1.8.0_171]
	at org.testng.internal.MethodInvocationHelper.invokeMethod(MethodInvocationHelper.java:108) [testng-6.11.jar:?]
	at org.testng.internal.Invoker.invokeMethod(Invoker.java:661) [testng-6.11.jar:?]
	at org.testng.internal.Invoker.invokeTestMethod(Invoker.java:869) [testng-6.11.jar:?]
	at org.testng.internal.Invoker.invokeTestMethods(Invoker.java:1193) [testng-6.11.jar:?]
	at org.testng.internal.TestMethodWorker.invokeTestMethods(TestMethodWorker.java:126) [testng-6.11.jar:?]
	at org.testng.internal.TestMethodWorker.run(TestMethodWorker.java:109) [testng-6.11.jar:?]
	at org.testng.TestRunner.privateRun(TestRunner.java:744) [testng-6.11.jar:?]
	at org.testng.TestRunner.run(TestRunner.java:602) [testng-6.11.jar:?]
	at org.testng.SuiteRunner.runTest(SuiteRunner.java:380) [testng-6.11.jar:?]
	at org.testng.SuiteRunner.runSequentially(SuiteRunner.java:375) [testng-6.11.jar:?]
	at org.testng.SuiteRunner.privateRun(SuiteRunner.java:340) [testng-6.11.jar:?]
	at org.testng.SuiteRunner.run(SuiteRunner.java:289) [testng-6.11.jar:?]
	at org.testng.SuiteRunnerWorker.runSuite(SuiteRunnerWorker.java:52) [testng-6.11.jar:?]
	at org.testng.SuiteRunnerWorker.run(SuiteRunnerWorker.java:86) [testng-6.11.jar:?]
	at org.testng.TestNG.runSuitesSequentially(TestNG.java:1301) [testng-6.11.jar:?]
	at org.testng.TestNG.runSuitesLocally(TestNG.java:1226) [testng-6.11.jar:?]
	at org.testng.TestNG.runSuites(TestNG.java:1144) [testng-6.11.jar:?]
	at org.testng.TestNG.run(TestNG.java:1115) [testng-6.11.jar:?]
	at org.apache.maven.surefire.testng.TestNGExecutor.run(TestNGExecutor.java:281) [surefire-testng-2.19.1.jar:2.19.1]
	at org.apache.maven.surefire.testng.TestNGXmlTestSuite.execute(TestNGXmlTestSuite.java:75) [surefire-testng-2.19.1.jar:2.19.1]
	at org.apache.maven.surefire.testng.TestNGProvider.invoke(TestNGProvider.java:121) [surefire-testng-2.19.1.jar:2.19.1]
	at org.apache.maven.surefire.booter.ForkedBooter.invokeProviderInSameClassLoader(ForkedBooter.java:290) [surefire-booter-2.19.1.jar:2.19.1]
	at org.apache.maven.surefire.booter.ForkedBooter.runSuitesInProcess(ForkedBooter.java:242) [surefire-booter-2.19.1.jar:2.19.1]
	at org.apache.maven.surefire.booter.ForkedBooter.main(ForkedBooter.java:121) [surefire-booter-2.19.1.jar:2.19.1]
[main] ERROR io.siddhi.extension.map.keyvalue.sourcemapper.KeyValueSourceMapper [] - Stream "FooStream" has an attribute named "price", but the received event {volume=100, symbol=WSO2, amount=300, price=55.6, state=false} does not has a value for that attribute. Hence dropping the message.
[main] ERROR io.siddhi.core.stream.input.source.SourceMapper [] - Error while processing '{volume=100, symbol=WSO2, amount=300, price=55.6, state=false}', for the input Mapping 'keyvalue' for the stream 'FooStream'.
io.siddhi.core.exception.MappingFailedException: null
	at io.siddhi.extension.map.keyvalue.sourcemapper.KeyValueSourceMapper.mapAndProcess(KeyValueSourceMapper.java:172) ~[classes/:?]
	at io.siddhi.core.stream.input.source.SourceMapper.onEvent(SourceMapper.java:201) [siddhi-core-5.1.21.jar:?]
	at io.siddhi.core.stream.input.source.SourceMapper.onEvent(SourceMapper.java:145) [siddhi-core-5.1.21.jar:?]
	at io.siddhi.extension.map.keyvalue.sourcemapper.TestTrpInMemorySource$1.onMessage(TestTrpInMemorySource.java:79) [test-classes/:?]
	at io.siddhi.core.util.transport.InMemoryBroker$MessageBroker.broadcast(InMemoryBroker.java:110) [siddhi-core-5.1.21.jar:?]
	at io.siddhi.core.util.transport.InMemoryBroker$MessageBroker.publish(InMemoryBroker.java:118) [siddhi-core-5.1.21.jar:?]
	at io.siddhi.core.util.transport.InMemoryBroker.publish(InMemoryBroker.java:41) [siddhi-core-5.1.21.jar:?]
	at io.siddhi.extension.map.keyvalue.sourcemapper.KeyValueSourceMapperTestCase.keyvalueSourceMapperDefaultTest4(KeyValueSourceMapperTestCase.java:335) [test-classes/:?]
	at sun.reflect.NativeMethodAccessorImpl.invoke0(Native Method) ~[?:1.8.0_171]
	at sun.reflect.NativeMethodAccessorImpl.invoke(NativeMethodAccessorImpl.java:62) ~[?:1.8.0_171]
	at sun.reflect.DelegatingMethodAccessorImpl.invoke(DelegatingMethodAccessorImpl.java:43) ~[?:1.8.0_171]
	at java.lang.reflect.Method.invoke(Method.java:498) ~[?:1.8.0_171]
	at org.testng.internal.MethodInvocationHelper.invokeMethod(MethodInvocationHelper.java:108) [testng-6.11.jar:?]
	at org.testng.internal.Invoker.invokeMethod(Invoker.java:661) [testng-6.11.jar:?]
	at org.testng.internal.Invoker.invokeTestMethod(Invoker.java:869) [testng-6.11.jar:?]
	at org.testng.internal.Invoker.invokeTestMethods(Invoker.java:1193) [testng-6.11.jar:?]
	at org.testng.internal.TestMethodWorker.invokeTestMethods(TestMethodWorker.java:126) [testng-6.11.jar:?]
	at org.testng.internal.TestMethodWorker.run(TestMethodWorker.java:109) [testng-6.11.jar:?]
	at org.testng.TestRunner.privateRun(TestRunner.java:744) [testng-6.11.jar:?]
	at org.testng.TestRunner.run(TestRunner.java:602) [testng-6.11.jar:?]
	at org.testng.SuiteRunner.runTest(SuiteRunner.java:380) [testng-6.11.jar:?]
	at org.testng.SuiteRunner.runSequentially(SuiteRunner.java:375) [testng-6.11.jar:?]
	at org.testng.SuiteRunner.privateRun(SuiteRunner.java:340) [testng-6.11.jar:?]
	at org.testng.SuiteRunner.run(SuiteRunner.java:289) [testng-6.11.jar:?]
	at org.testng.SuiteRunnerWorker.runSuite(SuiteRunnerWorker.java:52) [testng-6.11.jar:?]
	at org.testng.SuiteRunnerWorker.run(SuiteRunnerWorker.java:86) [testng-6.11.jar:?]
	at org.testng.TestNG.runSuitesSequentially(TestNG.java:1301) [testng-6.11.jar:?]
	at org.testng.TestNG.runSuitesLocally(TestNG.java:1226) [testng-6.11.jar:?]
	at org.testng.TestNG.runSuites(TestNG.java:1144) [testng-6.11.jar:?]
	at org.testng.TestNG.run(TestNG.java:1115) [testng-6.11.jar:?]
	at org.apache.maven.surefire.testng.TestNGExecutor.run(TestNGExecutor.java:281) [surefire-testng-2.19.1.jar:2.19.1]
	at org.apache.maven.surefire.testng.TestNGXmlTestSuite.execute(TestNGXmlTestSuite.java:75) [surefire-testng-2.19.1.jar:2.19.1]
	at org.apache.maven.surefire.testng.TestNGProvider.invoke(TestNGProvider.java:121) [surefire-testng-2.19.1.jar:2.19.1]
	at org.apache.maven.surefire.booter.ForkedBooter.invokeProviderInSameClassLoader(ForkedBooter.java:290) [surefire-booter-2.19.1.jar:2.19.1]
	at org.apache.maven.surefire.booter.ForkedBooter.runSuitesInProcess(ForkedBooter.java:242) [surefire-booter-2.19.1.jar:2.19.1]
	at org.apache.maven.surefire.booter.ForkedBooter.main(ForkedBooter.java:121) [surefire-booter-2.19.1.jar:2.19.1]
[main] ERROR io.siddhi.extension.map.keyvalue.sourcemapper.KeyValueSourceMapper [] - Stream "FooStream" has an attribute named "price", but the received event {volume=100, symbol=WSO2, amount=300, price=55.6, state=false} does not has a value for that attribute. Hence dropping the message.
[main] ERROR io.siddhi.core.stream.input.source.SourceMapper [] - Error while processing '{volume=100, symbol=WSO2, amount=300, price=55.6, state=false}', for the input Mapping 'keyvalue' for the stream 'FooStream'.
io.siddhi.core.exception.MappingFailedException: null
	at io.siddhi.extension.map.keyvalue.sourcemapper.KeyValueSourceMapper.mapAndProcess(KeyValueSourceMapper.java:172) ~[classes/:?]
	at io.siddhi.core.stream.input.source.SourceMapper.onEvent(SourceMapper.java:201) [siddhi-core-5.1.21.jar:?]
	at io.siddhi.core.stream.input.source.SourceMapper.onEvent(SourceMapper.java:145) [siddhi-core-5.1.21.jar:?]
	at io.siddhi.extension.map.keyvalue.sourcemapper.TestTrpInMemorySource$1.onMessage(TestTrpInMemorySource.java:79) [test-classes/:?]
	at io.siddhi.core.util.transport.InMemoryBroker$MessageBroker.broadcast(InMemoryBroker.java:110) [siddhi-core-5.1.21.jar:?]
	at io.siddhi.core.util.transport.InMemoryBroker$MessageBroker.publish(InMemoryBroker.java:118) [siddhi-core-5.1.21.jar:?]
	at io.siddhi.core.util.transport.InMemoryBroker.publish(InMemoryBroker.java:41) [siddhi-core-5.1.21.jar:?]
	at io.siddhi.extension.map.keyvalue.sourcemapper.KeyValueSourceMapperTestCase.keyvalueSourceMapperDefaultTest4(KeyValueSourceMapperTestCase.java:335) [test-classes/:?]
	at sun.reflect.NativeMethodAccessorImpl.invoke0(Native Method) ~[?:1.8.0_171]
	at sun.reflect.NativeMethodAccessorImpl.invoke(NativeMethodAccessorImpl.java:62) ~[?:1.8.0_171]
	at sun.reflect.DelegatingMethodAccessorImpl.invoke(DelegatingMethodAccessorImpl.java:43) ~[?:1.8.0_171]
	at java.lang.reflect.Method.invoke(Method.java:498) ~[?:1.8.0_171]
	at org.testng.internal.MethodInvocationHelper.invokeMethod(MethodInvocationHelper.java:108) [testng-6.11.jar:?]
	at org.testng.internal.Invoker.invokeMethod(Invoker.java:661) [testng-6.11.jar:?]
	at org.testng.internal.Invoker.invokeTestMethod(Invoker.java:869) [testng-6.11.jar:?]
	at org.testng.internal.Invoker.invokeTestMethods(Invoker.java:1193) [testng-6.11.jar:?]
	at org.testng.internal.TestMethodWorker.invokeTestMethods(TestMethodWorker.java:126) [testng-6.11.jar:?]
	at org.testng.internal.TestMethodWorker.run(TestMethodWorker.java:109) [testng-6.11.jar:?]
	at org.testng.TestRunner.privateRun(TestRunner.java:744) [testng-6.11.jar:?]
	at org.testng.TestRunner.run(TestRunner.java:602) [testng-6.11.jar:?]
	at org.testng.SuiteRunner.runTest(SuiteRunner.java:380) [testng-6.11.jar:?]
	at org.testng.SuiteRunner.runSequentially(SuiteRunner.java:375) [testng-6.11.jar:?]
	at org.testng.SuiteRunner.privateRun(SuiteRunner.java:340) [testng-6.11.jar:?]
	at org.testng.SuiteRunner.run(SuiteRunner.java:289) [testng-6.11.jar:?]
	at org.testng.SuiteRunnerWorker.runSuite(SuiteRunnerWorker.java:52) [testng-6.11.jar:?]
	at org.testng.SuiteRunnerWorker.run(SuiteRunnerWorker.java:86) [testng-6.11.jar:?]
	at org.testng.TestNG.runSuitesSequentially(TestNG.java:1301) [testng-6.11.jar:?]
	at org.testng.TestNG.runSuitesLocally(TestNG.java:1226) [testng-6.11.jar:?]
	at org.testng.TestNG.runSuites(TestNG.java:1144) [testng-6.11.jar:?]
	at org.testng.TestNG.run(TestNG.java:1115) [testng-6.11.jar:?]
	at org.apache.maven.surefire.testng.TestNGExecutor.run(TestNGExecutor.java:281) [surefire-testng-2.19.1.jar:2.19.1]
	at org.apache.maven.surefire.testng.TestNGXmlTestSuite.execute(TestNGXmlTestSuite.java:75) [surefire-testng-2.19.1.jar:2.19.1]
	at org.apache.maven.surefire.testng.TestNGProvider.invoke(TestNGProvider.java:121) [surefire-testng-2.19.1.jar:2.19.1]
	at org.apache.maven.surefire.booter.ForkedBooter.invokeProviderInSameClassLoader(ForkedBooter.java:290) [surefire-booter-2.19.1.jar:2.19.1]
	at org.apache.maven.surefire.booter.ForkedBooter.runSuitesInProcess(ForkedBooter.java:242) [surefire-booter-2.19.1.jar:2.19.1]
	at org.apache.maven.surefire.booter.ForkedBooter.main(ForkedBooter.java:121) [surefire-booter-2.19.1.jar:2.19.1]
[main] ERROR io.siddhi.extension.map.keyvalue.sourcemapper.KeyValueSourceMapper [] - Message {volume=100, symbol=WSO2, amount=300, price=55.6, state=false} contains incompatible attribute types and values. Value 55.6 is not compatible with type FLOAT,Hence dropping the message
[main] ERROR io.siddhi.core.stream.input.source.SourceMapper [] - Error while processing '{volume=100, symbol=WSO2, amount=300, price=55.6, state=false}', for the input Mapping 'keyvalue' for the stream 'FooStream'.
io.siddhi.core.exception.MappingFailedException: null
	at io.siddhi.extension.map.keyvalue.sourcemapper.KeyValueSourceMapper.mapAndProcess(KeyValueSourceMapper.java:172) ~[classes/:?]
	at io.siddhi.core.stream.input.source.SourceMapper.onEvent(SourceMapper.java:201) [siddhi-core-5.1.21.jar:?]
	at io.siddhi.core.stream.input.source.SourceMapper.onEvent(SourceMapper.java:145) [siddhi-core-5.1.21.jar:?]
	at io.siddhi.core.stream.input.source.InMemorySource$1.onMessage(InMemorySource.java:99) [siddhi-core-5.1.21.jar:?]
	at io.siddhi.core.util.transport.InMemoryBroker$MessageBroker.broadcast(InMemoryBroker.java:110) [siddhi-core-5.1.21.jar:?]
	at io.siddhi.core.util.transport.InMemoryBroker$MessageBroker.publish(InMemoryBroker.java:118) [siddhi-core-5.1.21.jar:?]
	at io.siddhi.core.util.transport.InMemoryBroker.publish(InMemoryBroker.java:41) [siddhi-core-5.1.21.jar:?]
	at io.siddhi.extension.map.keyvalue.sourcemapper.KeyValueSourceMapperTestCase.keyvalueSourceMapperDefaultTest4(KeyValueSourceMapperTestCase.java:335) [test-classes/:?]
	at sun.reflect.NativeMethodAccessorImpl.invoke0(Native Method) ~[?:1.8.0_171]
	at sun.reflect.NativeMethodAccessorImpl.invoke(NativeMethodAccessorImpl.java:62) ~[?:1.8.0_171]
	at sun.reflect.DelegatingMethodAccessorImpl.invoke(DelegatingMethodAccessorImpl.java:43) ~[?:1.8.0_171]
	at java.lang.reflect.Method.invoke(Method.java:498) ~[?:1.8.0_171]
	at org.testng.internal.MethodInvocationHelper.invokeMethod(MethodInvocationHelper.java:108) [testng-6.11.jar:?]
	at org.testng.internal.Invoker.invokeMethod(Invoker.java:661) [testng-6.11.jar:?]
	at org.testng.internal.Invoker.invokeTestMethod(Invoker.java:869) [testng-6.11.jar:?]
	at org.testng.internal.Invoker.invokeTestMethods(Invoker.java:1193) [testng-6.11.jar:?]
	at org.testng.internal.TestMethodWorker.invokeTestMethods(TestMethodWorker.java:126) [testng-6.11.jar:?]
	at org.testng.internal.TestMethodWorker.run(TestMethodWorker.java:109) [testng-6.11.jar:?]
	at org.testng.TestRunner.privateRun(TestRunner.java:744) [testng-6.11.jar:?]
	at org.testng.TestRunner.run(TestRunner.java:602) [testng-6.11.jar:?]
	at org.testng.SuiteRunner.runTest(SuiteRunner.java:380) [testng-6.11.jar:?]
	at org.testng.SuiteRunner.runSequentially(SuiteRunner.java:375) [testng-6.11.jar:?]
	at org.testng.SuiteRunner.privateRun(SuiteRunner.java:340) [testng-6.11.jar:?]
	at org.testng.SuiteRunner.run(SuiteRunner.java:289) [testng-6.11.jar:?]
	at org.testng.SuiteRunnerWorker.runSuite(SuiteRunnerWorker.java:52) [testng-6.11.jar:?]
	at org.testng.SuiteRunnerWorker.run(SuiteRunnerWorker.java:86) [testng-6.11.jar:?]
	at org.testng.TestNG.runSuitesSequentially(TestNG.java:1301) [testng-6.11.jar:?]
	at org.testng.TestNG.runSuitesLocally(TestNG.java:1226) [testng-6.11.jar:?]
	at org.testng.TestNG.runSuites(TestNG.java:1144) [testng-6.11.jar:?]
	at org.testng.TestNG.run(TestNG.java:1115) [testng-6.11.jar:?]
	at org.apache.maven.surefire.testng.TestNGExecutor.run(TestNGExecutor.java:281) [surefire-testng-2.19.1.jar:2.19.1]
	at org.apache.maven.surefire.testng.TestNGXmlTestSuite.execute(TestNGXmlTestSuite.java:75) [surefire-testng-2.19.1.jar:2.19.1]
	at org.apache.maven.surefire.testng.TestNGProvider.invoke(TestNGProvider.java:121) [surefire-testng-2.19.1.jar:2.19.1]
	at org.apache.maven.surefire.booter.ForkedBooter.invokeProviderInSameClassLoader(ForkedBooter.java:290) [surefire-booter-2.19.1.jar:2.19.1]
	at org.apache.maven.surefire.booter.ForkedBooter.runSuitesInProcess(ForkedBooter.java:242) [surefire-booter-2.19.1.jar:2.19.1]
	at org.apache.maven.surefire.booter.ForkedBooter.main(ForkedBooter.java:121) [surefire-booter-2.19.1.jar:2.19.1]
[main] ERROR io.siddhi.extension.map.keyvalue.sourcemapper.KeyValueSourceMapper [] - Stream "FooStream" has an attribute named "price", but the received event {volume=100.0, symbol=WSO2, amount=300, price=55.6, state=false} does not has a value for that attribute. Hence dropping the message.
[main] ERROR io.siddhi.core.stream.input.source.SourceMapper [] - Error while processing '{volume=100.0, symbol=WSO2, amount=300, price=55.6, state=false}', for the input Mapping 'keyvalue' for the stream 'FooStream'.
io.siddhi.core.exception.MappingFailedException: null
	at io.siddhi.extension.map.keyvalue.sourcemapper.KeyValueSourceMapper.mapAndProcess(KeyValueSourceMapper.java:172) ~[classes/:?]
	at io.siddhi.core.stream.input.source.SourceMapper.onEvent(SourceMapper.java:201) [siddhi-core-5.1.21.jar:?]
	at io.siddhi.core.stream.input.source.SourceMapper.onEvent(SourceMapper.java:145) [siddhi-core-5.1.21.jar:?]
	at io.siddhi.extension.map.keyvalue.sourcemapper.TestTrpInMemorySource$1.onMessage(TestTrpInMemorySource.java:79) [test-classes/:?]
	at io.siddhi.core.util.transport.InMemoryBroker$MessageBroker.broadcast(InMemoryBroker.java:110) [siddhi-core-5.1.21.jar:?]
	at io.siddhi.core.util.transport.InMemoryBroker$MessageBroker.publish(InMemoryBroker.java:118) [siddhi-core-5.1.21.jar:?]
	at io.siddhi.core.util.transport.InMemoryBroker.publish(InMemoryBroker.java:41) [siddhi-core-5.1.21.jar:?]
	at io.siddhi.extension.map.keyvalue.sourcemapper.KeyValueSourceMapperTestCase.keyvalueSourceMapperDefaultTest4(KeyValueSourceMapperTestCase.java:343) [test-classes/:?]
	at sun.reflect.NativeMethodAccessorImpl.invoke0(Native Method) ~[?:1.8.0_171]
	at sun.reflect.NativeMethodAccessorImpl.invoke(NativeMethodAccessorImpl.java:62) ~[?:1.8.0_171]
	at sun.reflect.DelegatingMethodAccessorImpl.invoke(DelegatingMethodAccessorImpl.java:43) ~[?:1.8.0_171]
	at java.lang.reflect.Method.invoke(Method.java:498) ~[?:1.8.0_171]
	at org.testng.internal.MethodInvocationHelper.invokeMethod(MethodInvocationHelper.java:108) [testng-6.11.jar:?]
	at org.testng.internal.Invoker.invokeMethod(Invoker.java:661) [testng-6.11.jar:?]
	at org.testng.internal.Invoker.invokeTestMethod(Invoker.java:869) [testng-6.11.jar:?]
	at org.testng.internal.Invoker.invokeTestMethods(Invoker.java:1193) [testng-6.11.jar:?]
	at org.testng.internal.TestMethodWorker.invokeTestMethods(TestMethodWorker.java:126) [testng-6.11.jar:?]
	at org.testng.internal.TestMethodWorker.run(TestMethodWorker.java:109) [testng-6.11.jar:?]
	at org.testng.TestRunner.privateRun(TestRunner.java:744) [testng-6.11.jar:?]
	at org.testng.TestRunner.run(TestRunner.java:602) [testng-6.11.jar:?]
	at org.testng.SuiteRunner.runTest(SuiteRunner.java:380) [testng-6.11.jar:?]
	at org.testng.SuiteRunner.runSequentially(SuiteRunner.java:375) [testng-6.11.jar:?]
	at org.testng.SuiteRunner.privateRun(SuiteRunner.java:340) [testng-6.11.jar:?]
	at org.testng.SuiteRunner.run(SuiteRunner.java:289) [testng-6.11.jar:?]
	at org.testng.SuiteRunnerWorker.runSuite(SuiteRunnerWorker.java:52) [testng-6.11.jar:?]
	at org.testng.SuiteRunnerWorker.run(SuiteRunnerWorker.java:86) [testng-6.11.jar:?]
	at org.testng.TestNG.runSuitesSequentially(TestNG.java:1301) [testng-6.11.jar:?]
	at org.testng.TestNG.runSuitesLocally(TestNG.java:1226) [testng-6.11.jar:?]
	at org.testng.TestNG.runSuites(TestNG.java:1144) [testng-6.11.jar:?]
	at org.testng.TestNG.run(TestNG.java:1115) [testng-6.11.jar:?]
	at org.apache.maven.surefire.testng.TestNGExecutor.run(TestNGExecutor.java:281) [surefire-testng-2.19.1.jar:2.19.1]
	at org.apache.maven.surefire.testng.TestNGXmlTestSuite.execute(TestNGXmlTestSuite.java:75) [surefire-testng-2.19.1.jar:2.19.1]
	at org.apache.maven.surefire.testng.TestNGProvider.invoke(TestNGProvider.java:121) [surefire-testng-2.19.1.jar:2.19.1]
	at org.apache.maven.surefire.booter.ForkedBooter.invokeProviderInSameClassLoader(ForkedBooter.java:290) [surefire-booter-2.19.1.jar:2.19.1]
	at org.apache.maven.surefire.booter.ForkedBooter.runSuitesInProcess(ForkedBooter.java:242) [surefire-booter-2.19.1.jar:2.19.1]
	at org.apache.maven.surefire.booter.ForkedBooter.main(ForkedBooter.java:121) [surefire-booter-2.19.1.jar:2.19.1]
[main] ERROR io.siddhi.extension.map.keyvalue.sourcemapper.KeyValueSourceMapper [] - Stream "FooStream" has an attribute named "price", but the received event {volume=100.0, symbol=WSO2, amount=300, price=55.6, state=false} does not has a value for that attribute. Hence dropping the message.
[main] ERROR io.siddhi.core.stream.input.source.SourceMapper [] - Error while processing '{volume=100.0, symbol=WSO2, amount=300, price=55.6, state=false}', for the input Mapping 'keyvalue' for the stream 'FooStream'.
io.siddhi.core.exception.MappingFailedException: null
	at io.siddhi.extension.map.keyvalue.sourcemapper.KeyValueSourceMapper.mapAndProcess(KeyValueSourceMapper.java:172) ~[classes/:?]
	at io.siddhi.core.stream.input.source.SourceMapper.onEvent(SourceMapper.java:201) [siddhi-core-5.1.21.jar:?]
	at io.siddhi.core.stream.input.source.SourceMapper.onEvent(SourceMapper.java:145) [siddhi-core-5.1.21.jar:?]
	at io.siddhi.extension.map.keyvalue.sourcemapper.TestTrpInMemorySource$1.onMessage(TestTrpInMemorySource.java:79) [test-classes/:?]
	at io.siddhi.core.util.transport.InMemoryBroker$MessageBroker.broadcast(InMemoryBroker.java:110) [siddhi-core-5.1.21.jar:?]
	at io.siddhi.core.util.transport.InMemoryBroker$MessageBroker.publish(InMemoryBroker.java:118) [siddhi-core-5.1.21.jar:?]
	at io.siddhi.core.util.transport.InMemoryBroker.publish(InMemoryBroker.java:41) [siddhi-core-5.1.21.jar:?]
	at io.siddhi.extension.map.keyvalue.sourcemapper.KeyValueSourceMapperTestCase.keyvalueSourceMapperDefaultTest4(KeyValueSourceMapperTestCase.java:343) [test-classes/:?]
	at sun.reflect.NativeMethodAccessorImpl.invoke0(Native Method) ~[?:1.8.0_171]
	at sun.reflect.NativeMethodAccessorImpl.invoke(NativeMethodAccessorImpl.java:62) ~[?:1.8.0_171]
	at sun.reflect.DelegatingMethodAccessorImpl.invoke(DelegatingMethodAccessorImpl.java:43) ~[?:1.8.0_171]
	at java.lang.reflect.Method.invoke(Method.java:498) ~[?:1.8.0_171]
	at org.testng.internal.MethodInvocationHelper.invokeMethod(MethodInvocationHelper.java:108) [testng-6.11.jar:?]
	at org.testng.internal.Invoker.invokeMethod(Invoker.java:661) [testng-6.11.jar:?]
	at org.testng.internal.Invoker.invokeTestMethod(Invoker.java:869) [testng-6.11.jar:?]
	at org.testng.internal.Invoker.invokeTestMethods(Invoker.java:1193) [testng-6.11.jar:?]
	at org.testng.internal.TestMethodWorker.invokeTestMethods(TestMethodWorker.java:126) [testng-6.11.jar:?]
	at org.testng.internal.TestMethodWorker.run(TestMethodWorker.java:109) [testng-6.11.jar:?]
	at org.testng.TestRunner.privateRun(TestRunner.java:744) [testng-6.11.jar:?]
	at org.testng.TestRunner.run(TestRunner.java:602) [testng-6.11.jar:?]
	at org.testng.SuiteRunner.runTest(SuiteRunner.java:380) [testng-6.11.jar:?]
	at org.testng.SuiteRunner.runSequentially(SuiteRunner.java:375) [testng-6.11.jar:?]
	at org.testng.SuiteRunner.privateRun(SuiteRunner.java:340) [testng-6.11.jar:?]
	at org.testng.SuiteRunner.run(SuiteRunner.java:289) [testng-6.11.jar:?]
	at org.testng.SuiteRunnerWorker.runSuite(SuiteRunnerWorker.java:52) [testng-6.11.jar:?]
	at org.testng.SuiteRunnerWorker.run(SuiteRunnerWorker.java:86) [testng-6.11.jar:?]
	at org.testng.TestNG.runSuitesSequentially(TestNG.java:1301) [testng-6.11.jar:?]
	at org.testng.TestNG.runSuitesLocally(TestNG.java:1226) [testng-6.11.jar:?]
	at org.testng.TestNG.runSuites(TestNG.java:1144) [testng-6.11.jar:?]
	at org.testng.TestNG.run(TestNG.java:1115) [testng-6.11.jar:?]
	at org.apache.maven.surefire.testng.TestNGExecutor.run(TestNGExecutor.java:281) [surefire-testng-2.19.1.jar:2.19.1]
	at org.apache.maven.surefire.testng.TestNGXmlTestSuite.execute(TestNGXmlTestSuite.java:75) [surefire-testng-2.19.1.jar:2.19.1]
	at org.apache.maven.surefire.testng.TestNGProvider.invoke(TestNGProvider.java:121) [surefire-testng-2.19.1.jar:2.19.1]
	at org.apache.maven.surefire.booter.ForkedBooter.invokeProviderInSameClassLoader(ForkedBooter.java:290) [surefire-booter-2.19.1.jar:2.19.1]
	at org.apache.maven.surefire.booter.ForkedBooter.runSuitesInProcess(ForkedBooter.java:242) [surefire-booter-2.19.1.jar:2.19.1]
	at org.apache.maven.surefire.booter.ForkedBooter.main(ForkedBooter.java:121) [surefire-booter-2.19.1.jar:2.19.1]
[main] ERROR io.siddhi.extension.map.keyvalue.sourcemapper.KeyValueSourceMapper [] - Stream "FooStream" has an attribute named "price", but the received event {volume=100.0, symbol=WSO2, amount=300, price=55.6, state=false} does not has a value for that attribute. Hence dropping the message.
[main] ERROR io.siddhi.core.stream.input.source.SourceMapper [] - Error while processing '{volume=100.0, symbol=WSO2, amount=300, price=55.6, state=false}', for the input Mapping 'keyvalue' for the stream 'FooStream'.
io.siddhi.core.exception.MappingFailedException: null
	at io.siddhi.extension.map.keyvalue.sourcemapper.KeyValueSourceMapper.mapAndProcess(KeyValueSourceMapper.java:172) ~[classes/:?]
	at io.siddhi.core.stream.input.source.SourceMapper.onEvent(SourceMapper.java:201) [siddhi-core-5.1.21.jar:?]
	at io.siddhi.core.stream.input.source.SourceMapper.onEvent(SourceMapper.java:145) [siddhi-core-5.1.21.jar:?]
	at io.siddhi.extension.map.keyvalue.sourcemapper.TestTrpInMemorySource$1.onMessage(TestTrpInMemorySource.java:79) [test-classes/:?]
	at io.siddhi.core.util.transport.InMemoryBroker$MessageBroker.broadcast(InMemoryBroker.java:110) [siddhi-core-5.1.21.jar:?]
	at io.siddhi.core.util.transport.InMemoryBroker$MessageBroker.publish(InMemoryBroker.java:118) [siddhi-core-5.1.21.jar:?]
	at io.siddhi.core.util.transport.InMemoryBroker.publish(InMemoryBroker.java:41) [siddhi-core-5.1.21.jar:?]
	at io.siddhi.extension.map.keyvalue.sourcemapper.KeyValueSourceMapperTestCase.keyvalueSourceMapperDefaultTest4(KeyValueSourceMapperTestCase.java:343) [test-classes/:?]
	at sun.reflect.NativeMethodAccessorImpl.invoke0(Native Method) ~[?:1.8.0_171]
	at sun.reflect.NativeMethodAccessorImpl.invoke(NativeMethodAccessorImpl.java:62) ~[?:1.8.0_171]
	at sun.reflect.DelegatingMethodAccessorImpl.invoke(DelegatingMethodAccessorImpl.java:43) ~[?:1.8.0_171]
	at java.lang.reflect.Method.invoke(Method.java:498) ~[?:1.8.0_171]
	at org.testng.internal.MethodInvocationHelper.invokeMethod(MethodInvocationHelper.java:108) [testng-6.11.jar:?]
	at org.testng.internal.Invoker.invokeMethod(Invoker.java:661) [testng-6.11.jar:?]
	at org.testng.internal.Invoker.invokeTestMethod(Invoker.java:869) [testng-6.11.jar:?]
	at org.testng.internal.Invoker.invokeTestMethods(Invoker.java:1193) [testng-6.11.jar:?]
	at org.testng.internal.TestMethodWorker.invokeTestMethods(TestMethodWorker.java:126) [testng-6.11.jar:?]
	at org.testng.internal.TestMethodWorker.run(TestMethodWorker.java:109) [testng-6.11.jar:?]
	at org.testng.TestRunner.privateRun(TestRunner.java:744) [testng-6.11.jar:?]
	at org.testng.TestRunner.run(TestRunner.java:602) [testng-6.11.jar:?]
	at org.testng.SuiteRunner.runTest(SuiteRunner.java:380) [testng-6.11.jar:?]
	at org.testng.SuiteRunner.runSequentially(SuiteRunner.java:375) [testng-6.11.jar:?]
	at org.testng.SuiteRunner.privateRun(SuiteRunner.java:340) [testng-6.11.jar:?]
	at org.testng.SuiteRunner.run(SuiteRunner.java:289) [testng-6.11.jar:?]
	at org.testng.SuiteRunnerWorker.runSuite(SuiteRunnerWorker.java:52) [testng-6.11.jar:?]
	at org.testng.SuiteRunnerWorker.run(SuiteRunnerWorker.java:86) [testng-6.11.jar:?]
	at org.testng.TestNG.runSuitesSequentially(TestNG.java:1301) [testng-6.11.jar:?]
	at org.testng.TestNG.runSuitesLocally(TestNG.java:1226) [testng-6.11.jar:?]
	at org.testng.TestNG.runSuites(TestNG.java:1144) [testng-6.11.jar:?]
	at org.testng.TestNG.run(TestNG.java:1115) [testng-6.11.jar:?]
	at org.apache.maven.surefire.testng.TestNGExecutor.run(TestNGExecutor.java:281) [surefire-testng-2.19.1.jar:2.19.1]
	at org.apache.maven.surefire.testng.TestNGXmlTestSuite.execute(TestNGXmlTestSuite.java:75) [surefire-testng-2.19.1.jar:2.19.1]
	at org.apache.maven.surefire.testng.TestNGProvider.invoke(TestNGProvider.java:121) [surefire-testng-2.19.1.jar:2.19.1]
	at org.apache.maven.surefire.booter.ForkedBooter.invokeProviderInSameClassLoader(ForkedBooter.java:290) [surefire-booter-2.19.1.jar:2.19.1]
	at org.apache.maven.surefire.booter.ForkedBooter.runSuitesInProcess(ForkedBooter.java:242) [surefire-booter-2.19.1.jar:2.19.1]
	at org.apache.maven.surefire.booter.ForkedBooter.main(ForkedBooter.java:121) [surefire-booter-2.19.1.jar:2.19.1]
[main] ERROR io.siddhi.extension.map.keyvalue.sourcemapper.KeyValueSourceMapper [] - Message {volume=100.0, symbol=WSO2, amount=300, price=55.6, state=false} contains incompatible attribute types and values. Value 100.0 is not compatible with type INTEGER,Hence dropping the message
[main] ERROR io.siddhi.core.stream.input.source.SourceMapper [] - Error while processing '{volume=100.0, symbol=WSO2, amount=300, price=55.6, state=false}', for the input Mapping 'keyvalue' for the stream 'FooStream'.
io.siddhi.core.exception.MappingFailedException: null
	at io.siddhi.extension.map.keyvalue.sourcemapper.KeyValueSourceMapper.mapAndProcess(KeyValueSourceMapper.java:172) ~[classes/:?]
	at io.siddhi.core.stream.input.source.SourceMapper.onEvent(SourceMapper.java:201) [siddhi-core-5.1.21.jar:?]
	at io.siddhi.core.stream.input.source.SourceMapper.onEvent(SourceMapper.java:145) [siddhi-core-5.1.21.jar:?]
	at io.siddhi.core.stream.input.source.InMemorySource$1.onMessage(InMemorySource.java:99) [siddhi-core-5.1.21.jar:?]
	at io.siddhi.core.util.transport.InMemoryBroker$MessageBroker.broadcast(InMemoryBroker.java:110) [siddhi-core-5.1.21.jar:?]
	at io.siddhi.core.util.transport.InMemoryBroker$MessageBroker.publish(InMemoryBroker.java:118) [siddhi-core-5.1.21.jar:?]
	at io.siddhi.core.util.transport.InMemoryBroker.publish(InMemoryBroker.java:41) [siddhi-core-5.1.21.jar:?]
	at io.siddhi.extension.map.keyvalue.sourcemapper.KeyValueSourceMapperTestCase.keyvalueSourceMapperDefaultTest4(KeyValueSourceMapperTestCase.java:343) [test-classes/:?]
	at sun.reflect.NativeMethodAccessorImpl.invoke0(Native Method) ~[?:1.8.0_171]
	at sun.reflect.NativeMethodAccessorImpl.invoke(NativeMethodAccessorImpl.java:62) ~[?:1.8.0_171]
	at sun.reflect.DelegatingMethodAccessorImpl.invoke(DelegatingMethodAccessorImpl.java:43) ~[?:1.8.0_171]
	at java.lang.reflect.Method.invoke(Method.java:498) ~[?:1.8.0_171]
	at org.testng.internal.MethodInvocationHelper.invokeMethod(MethodInvocationHelper.java:108) [testng-6.11.jar:?]
	at org.testng.internal.Invoker.invokeMethod(Invoker.java:661) [testng-6.11.jar:?]
	at org.testng.internal.Invoker.invokeTestMethod(Invoker.java:869) [testng-6.11.jar:?]
	at org.testng.internal.Invoker.invokeTestMethods(Invoker.java:1193) [testng-6.11.jar:?]
	at org.testng.internal.TestMethodWorker.invokeTestMethods(TestMethodWorker.java:126) [testng-6.11.jar:?]
	at org.testng.internal.TestMethodWorker.run(TestMethodWorker.java:109) [testng-6.11.jar:?]
	at org.testng.TestRunner.privateRun(TestRunner.java:744) [testng-6.11.jar:?]
	at org.testng.TestRunner.run(TestRunner.java:602) [testng-6.11.jar:?]
	at org.testng.SuiteRunner.runTest(SuiteRunner.java:380) [testng-6.11.jar:?]
	at org.testng.SuiteRunner.runSequentially(SuiteRunner.java:375) [testng-6.11.jar:?]
	at org.testng.SuiteRunner.privateRun(SuiteRunner.java:340) [testng-6.11.jar:?]
	at org.testng.SuiteRunner.run(SuiteRunner.java:289) [testng-6.11.jar:?]
	at org.testng.SuiteRunnerWorker.runSuite(SuiteRunnerWorker.java:52) [testng-6.11.jar:?]
	at org.testng.SuiteRunnerWorker.run(SuiteRunnerWorker.java:86) [testng-6.11.jar:?]
	at org.testng.TestNG.runSuitesSequentially(TestNG.java:1301) [testng-6.11.jar:?]
	at org.testng.TestNG.runSuitesLocally(TestNG.java:1226) [testng-6.11.jar:?]
	at org.testng.TestNG.runSuites(TestNG.java:1144) [testng-6.11.jar:?]
	at org.testng.TestNG.run(TestNG.java:1115) [testng-6.11.jar:?]
	at org.apache.maven.surefire.testng.TestNGExecutor.run(TestNGExecutor.java:281) [surefire-testng-2.19.1.jar:2.19.1]
	at org.apache.maven.surefire.testng.TestNGXmlTestSuite.execute(TestNGXmlTestSuite.java:75) [surefire-testng-2.19.1.jar:2.19.1]
	at org.apache.maven.surefire.testng.TestNGProvider.invoke(TestNGProvider.java:121) [surefire-testng-2.19.1.jar:2.19.1]
	at org.apache.maven.surefire.booter.ForkedBooter.invokeProviderInSameClassLoader(ForkedBooter.java:290) [surefire-booter-2.19.1.jar:2.19.1]
	at org.apache.maven.surefire.booter.ForkedBooter.runSuitesInProcess(ForkedBooter.java:242) [surefire-booter-2.19.1.jar:2.19.1]
	at org.apache.maven.surefire.booter.ForkedBooter.main(ForkedBooter.java:121) [surefire-booter-2.19.1.jar:2.19.1]
[main] ERROR io.siddhi.extension.map.keyvalue.sourcemapper.KeyValueSourceMapper [] - Stream "FooStream" has an attribute named "price", but the received event {volume=100, symbol=WSO2, amount=300, price=55.6, state=false} does not has a value for that attribute. Hence dropping the message.
[main] ERROR io.siddhi.core.stream.input.source.SourceMapper [] - Error while processing '{volume=100, symbol=WSO2, amount=300, price=55.6, state=false}', for the input Mapping 'keyvalue' for the stream 'FooStream'.
io.siddhi.core.exception.MappingFailedException: null
	at io.siddhi.extension.map.keyvalue.sourcemapper.KeyValueSourceMapper.mapAndProcess(KeyValueSourceMapper.java:172) ~[classes/:?]
	at io.siddhi.core.stream.input.source.SourceMapper.onEvent(SourceMapper.java:201) [siddhi-core-5.1.21.jar:?]
	at io.siddhi.core.stream.input.source.SourceMapper.onEvent(SourceMapper.java:145) [siddhi-core-5.1.21.jar:?]
	at io.siddhi.extension.map.keyvalue.sourcemapper.TestTrpInMemorySource$1.onMessage(TestTrpInMemorySource.java:79) [test-classes/:?]
	at io.siddhi.core.util.transport.InMemoryBroker$MessageBroker.broadcast(InMemoryBroker.java:110) [siddhi-core-5.1.21.jar:?]
	at io.siddhi.core.util.transport.InMemoryBroker$MessageBroker.publish(InMemoryBroker.java:118) [siddhi-core-5.1.21.jar:?]
	at io.siddhi.core.util.transport.InMemoryBroker.publish(InMemoryBroker.java:41) [siddhi-core-5.1.21.jar:?]
	at io.siddhi.extension.map.keyvalue.sourcemapper.KeyValueSourceMapperTestCase.keyvalueSourceMapperDefaultTest4(KeyValueSourceMapperTestCase.java:351) [test-classes/:?]
	at sun.reflect.NativeMethodAccessorImpl.invoke0(Native Method) ~[?:1.8.0_171]
	at sun.reflect.NativeMethodAccessorImpl.invoke(NativeMethodAccessorImpl.java:62) ~[?:1.8.0_171]
	at sun.reflect.DelegatingMethodAccessorImpl.invoke(DelegatingMethodAccessorImpl.java:43) ~[?:1.8.0_171]
	at java.lang.reflect.Method.invoke(Method.java:498) ~[?:1.8.0_171]
	at org.testng.internal.MethodInvocationHelper.invokeMethod(MethodInvocationHelper.java:108) [testng-6.11.jar:?]
	at org.testng.internal.Invoker.invokeMethod(Invoker.java:661) [testng-6.11.jar:?]
	at org.testng.internal.Invoker.invokeTestMethod(Invoker.java:869) [testng-6.11.jar:?]
	at org.testng.internal.Invoker.invokeTestMethods(Invoker.java:1193) [testng-6.11.jar:?]
	at org.testng.internal.TestMethodWorker.invokeTestMethods(TestMethodWorker.java:126) [testng-6.11.jar:?]
	at org.testng.internal.TestMethodWorker.run(TestMethodWorker.java:109) [testng-6.11.jar:?]
	at org.testng.TestRunner.privateRun(TestRunner.java:744) [testng-6.11.jar:?]
	at org.testng.TestRunner.run(TestRunner.java:602) [testng-6.11.jar:?]
	at org.testng.SuiteRunner.runTest(SuiteRunner.java:380) [testng-6.11.jar:?]
	at org.testng.SuiteRunner.runSequentially(SuiteRunner.java:375) [testng-6.11.jar:?]
	at org.testng.SuiteRunner.privateRun(SuiteRunner.java:340) [testng-6.11.jar:?]
	at org.testng.SuiteRunner.run(SuiteRunner.java:289) [testng-6.11.jar:?]
	at org.testng.SuiteRunnerWorker.runSuite(SuiteRunnerWorker.java:52) [testng-6.11.jar:?]
	at org.testng.SuiteRunnerWorker.run(SuiteRunnerWorker.java:86) [testng-6.11.jar:?]
	at org.testng.TestNG.runSuitesSequentially(TestNG.java:1301) [testng-6.11.jar:?]
	at org.testng.TestNG.runSuitesLocally(TestNG.java:1226) [testng-6.11.jar:?]
	at org.testng.TestNG.runSuites(TestNG.java:1144) [testng-6.11.jar:?]
	at org.testng.TestNG.run(TestNG.java:1115) [testng-6.11.jar:?]
	at org.apache.maven.surefire.testng.TestNGExecutor.run(TestNGExecutor.java:281) [surefire-testng-2.19.1.jar:2.19.1]
	at org.apache.maven.surefire.testng.TestNGXmlTestSuite.execute(TestNGXmlTestSuite.java:75) [surefire-testng-2.19.1.jar:2.19.1]
	at org.apache.maven.surefire.testng.TestNGProvider.invoke(TestNGProvider.java:121) [surefire-testng-2.19.1.jar:2.19.1]
	at org.apache.maven.surefire.booter.ForkedBooter.invokeProviderInSameClassLoader(ForkedBooter.java:290) [surefire-booter-2.19.1.jar:2.19.1]
	at org.apache.maven.surefire.booter.ForkedBooter.runSuitesInProcess(ForkedBooter.java:242) [surefire-booter-2.19.1.jar:2.19.1]
	at org.apache.maven.surefire.booter.ForkedBooter.main(ForkedBooter.java:121) [surefire-booter-2.19.1.jar:2.19.1]
[main] ERROR io.siddhi.extension.map.keyvalue.sourcemapper.KeyValueSourceMapper [] - Stream "FooStream" has an attribute named "price", but the received event {volume=100, symbol=WSO2, amount=300, price=55.6, state=false} does not has a value for that attribute. Hence dropping the message.
[main] ERROR io.siddhi.core.stream.input.source.SourceMapper [] - Error while processing '{volume=100, symbol=WSO2, amount=300, price=55.6, state=false}', for the input Mapping 'keyvalue' for the stream 'FooStream'.
io.siddhi.core.exception.MappingFailedException: null
	at io.siddhi.extension.map.keyvalue.sourcemapper.KeyValueSourceMapper.mapAndProcess(KeyValueSourceMapper.java:172) ~[classes/:?]
	at io.siddhi.core.stream.input.source.SourceMapper.onEvent(SourceMapper.java:201) [siddhi-core-5.1.21.jar:?]
	at io.siddhi.core.stream.input.source.SourceMapper.onEvent(SourceMapper.java:145) [siddhi-core-5.1.21.jar:?]
	at io.siddhi.extension.map.keyvalue.sourcemapper.TestTrpInMemorySource$1.onMessage(TestTrpInMemorySource.java:79) [test-classes/:?]
	at io.siddhi.core.util.transport.InMemoryBroker$MessageBroker.broadcast(InMemoryBroker.java:110) [siddhi-core-5.1.21.jar:?]
	at io.siddhi.core.util.transport.InMemoryBroker$MessageBroker.publish(InMemoryBroker.java:118) [siddhi-core-5.1.21.jar:?]
	at io.siddhi.core.util.transport.InMemoryBroker.publish(InMemoryBroker.java:41) [siddhi-core-5.1.21.jar:?]
	at io.siddhi.extension.map.keyvalue.sourcemapper.KeyValueSourceMapperTestCase.keyvalueSourceMapperDefaultTest4(KeyValueSourceMapperTestCase.java:351) [test-classes/:?]
	at sun.reflect.NativeMethodAccessorImpl.invoke0(Native Method) ~[?:1.8.0_171]
	at sun.reflect.NativeMethodAccessorImpl.invoke(NativeMethodAccessorImpl.java:62) ~[?:1.8.0_171]
	at sun.reflect.DelegatingMethodAccessorImpl.invoke(DelegatingMethodAccessorImpl.java:43) ~[?:1.8.0_171]
	at java.lang.reflect.Method.invoke(Method.java:498) ~[?:1.8.0_171]
	at org.testng.internal.MethodInvocationHelper.invokeMethod(MethodInvocationHelper.java:108) [testng-6.11.jar:?]
	at org.testng.internal.Invoker.invokeMethod(Invoker.java:661) [testng-6.11.jar:?]
	at org.testng.internal.Invoker.invokeTestMethod(Invoker.java:869) [testng-6.11.jar:?]
	at org.testng.internal.Invoker.invokeTestMethods(Invoker.java:1193) [testng-6.11.jar:?]
	at org.testng.internal.TestMethodWorker.invokeTestMethods(TestMethodWorker.java:126) [testng-6.11.jar:?]
	at org.testng.internal.TestMethodWorker.run(TestMethodWorker.java:109) [testng-6.11.jar:?]
	at org.testng.TestRunner.privateRun(TestRunner.java:744) [testng-6.11.jar:?]
	at org.testng.TestRunner.run(TestRunner.java:602) [testng-6.11.jar:?]
	at org.testng.SuiteRunner.runTest(SuiteRunner.java:380) [testng-6.11.jar:?]
	at org.testng.SuiteRunner.runSequentially(SuiteRunner.java:375) [testng-6.11.jar:?]
	at org.testng.SuiteRunner.privateRun(SuiteRunner.java:340) [testng-6.11.jar:?]
	at org.testng.SuiteRunner.run(SuiteRunner.java:289) [testng-6.11.jar:?]
	at org.testng.SuiteRunnerWorker.runSuite(SuiteRunnerWorker.java:52) [testng-6.11.jar:?]
	at org.testng.SuiteRunnerWorker.run(SuiteRunnerWorker.java:86) [testng-6.11.jar:?]
	at org.testng.TestNG.runSuitesSequentially(TestNG.java:1301) [testng-6.11.jar:?]
	at org.testng.TestNG.runSuitesLocally(TestNG.java:1226) [testng-6.11.jar:?]
	at org.testng.TestNG.runSuites(TestNG.java:1144) [testng-6.11.jar:?]
	at org.testng.TestNG.run(TestNG.java:1115) [testng-6.11.jar:?]
	at org.apache.maven.surefire.testng.TestNGExecutor.run(TestNGExecutor.java:281) [surefire-testng-2.19.1.jar:2.19.1]
	at org.apache.maven.surefire.testng.TestNGXmlTestSuite.execute(TestNGXmlTestSuite.java:75) [surefire-testng-2.19.1.jar:2.19.1]
	at org.apache.maven.surefire.testng.TestNGProvider.invoke(TestNGProvider.java:121) [surefire-testng-2.19.1.jar:2.19.1]
	at org.apache.maven.surefire.booter.ForkedBooter.invokeProviderInSameClassLoader(ForkedBooter.java:290) [surefire-booter-2.19.1.jar:2.19.1]
	at org.apache.maven.surefire.booter.ForkedBooter.runSuitesInProcess(ForkedBooter.java:242) [surefire-booter-2.19.1.jar:2.19.1]
	at org.apache.maven.surefire.booter.ForkedBooter.main(ForkedBooter.java:121) [surefire-booter-2.19.1.jar:2.19.1]
[main] ERROR io.siddhi.extension.map.keyvalue.sourcemapper.KeyValueSourceMapper [] - Stream "FooStream" has an attribute named "price", but the received event {volume=100, symbol=WSO2, amount=300, price=55.6, state=false} does not has a value for that attribute. Hence dropping the message.
[main] ERROR io.siddhi.core.stream.input.source.SourceMapper [] - Error while processing '{volume=100, symbol=WSO2, amount=300, price=55.6, state=false}', for the input Mapping 'keyvalue' for the stream 'FooStream'.
io.siddhi.core.exception.MappingFailedException: null
	at io.siddhi.extension.map.keyvalue.sourcemapper.KeyValueSourceMapper.mapAndProcess(KeyValueSourceMapper.java:172) ~[classes/:?]
	at io.siddhi.core.stream.input.source.SourceMapper.onEvent(SourceMapper.java:201) [siddhi-core-5.1.21.jar:?]
	at io.siddhi.core.stream.input.source.SourceMapper.onEvent(SourceMapper.java:145) [siddhi-core-5.1.21.jar:?]
	at io.siddhi.extension.map.keyvalue.sourcemapper.TestTrpInMemorySource$1.onMessage(TestTrpInMemorySource.java:79) [test-classes/:?]
	at io.siddhi.core.util.transport.InMemoryBroker$MessageBroker.broadcast(InMemoryBroker.java:110) [siddhi-core-5.1.21.jar:?]
	at io.siddhi.core.util.transport.InMemoryBroker$MessageBroker.publish(InMemoryBroker.java:118) [siddhi-core-5.1.21.jar:?]
	at io.siddhi.core.util.transport.InMemoryBroker.publish(InMemoryBroker.java:41) [siddhi-core-5.1.21.jar:?]
	at io.siddhi.extension.map.keyvalue.sourcemapper.KeyValueSourceMapperTestCase.keyvalueSourceMapperDefaultTest4(KeyValueSourceMapperTestCase.java:351) [test-classes/:?]
	at sun.reflect.NativeMethodAccessorImpl.invoke0(Native Method) ~[?:1.8.0_171]
	at sun.reflect.NativeMethodAccessorImpl.invoke(NativeMethodAccessorImpl.java:62) ~[?:1.8.0_171]
	at sun.reflect.DelegatingMethodAccessorImpl.invoke(DelegatingMethodAccessorImpl.java:43) ~[?:1.8.0_171]
	at java.lang.reflect.Method.invoke(Method.java:498) ~[?:1.8.0_171]
	at org.testng.internal.MethodInvocationHelper.invokeMethod(MethodInvocationHelper.java:108) [testng-6.11.jar:?]
	at org.testng.internal.Invoker.invokeMethod(Invoker.java:661) [testng-6.11.jar:?]
	at org.testng.internal.Invoker.invokeTestMethod(Invoker.java:869) [testng-6.11.jar:?]
	at org.testng.internal.Invoker.invokeTestMethods(Invoker.java:1193) [testng-6.11.jar:?]
	at org.testng.internal.TestMethodWorker.invokeTestMethods(TestMethodWorker.java:126) [testng-6.11.jar:?]
	at org.testng.internal.TestMethodWorker.run(TestMethodWorker.java:109) [testng-6.11.jar:?]
	at org.testng.TestRunner.privateRun(TestRunner.java:744) [testng-6.11.jar:?]
	at org.testng.TestRunner.run(TestRunner.java:602) [testng-6.11.jar:?]
	at org.testng.SuiteRunner.runTest(SuiteRunner.java:380) [testng-6.11.jar:?]
	at org.testng.SuiteRunner.runSequentially(SuiteRunner.java:375) [testng-6.11.jar:?]
	at org.testng.SuiteRunner.privateRun(SuiteRunner.java:340) [testng-6.11.jar:?]
	at org.testng.SuiteRunner.run(SuiteRunner.java:289) [testng-6.11.jar:?]
	at org.testng.SuiteRunnerWorker.runSuite(SuiteRunnerWorker.java:52) [testng-6.11.jar:?]
	at org.testng.SuiteRunnerWorker.run(SuiteRunnerWorker.java:86) [testng-6.11.jar:?]
	at org.testng.TestNG.runSuitesSequentially(TestNG.java:1301) [testng-6.11.jar:?]
	at org.testng.TestNG.runSuitesLocally(TestNG.java:1226) [testng-6.11.jar:?]
	at org.testng.TestNG.runSuites(TestNG.java:1144) [testng-6.11.jar:?]
	at org.testng.TestNG.run(TestNG.java:1115) [testng-6.11.jar:?]
	at org.apache.maven.surefire.testng.TestNGExecutor.run(TestNGExecutor.java:281) [surefire-testng-2.19.1.jar:2.19.1]
	at org.apache.maven.surefire.testng.TestNGXmlTestSuite.execute(TestNGXmlTestSuite.java:75) [surefire-testng-2.19.1.jar:2.19.1]
	at org.apache.maven.surefire.testng.TestNGProvider.invoke(TestNGProvider.java:121) [surefire-testng-2.19.1.jar:2.19.1]
	at org.apache.maven.surefire.booter.ForkedBooter.invokeProviderInSameClassLoader(ForkedBooter.java:290) [surefire-booter-2.19.1.jar:2.19.1]
	at org.apache.maven.surefire.booter.ForkedBooter.runSuitesInProcess(ForkedBooter.java:242) [surefire-booter-2.19.1.jar:2.19.1]
	at org.apache.maven.surefire.booter.ForkedBooter.main(ForkedBooter.java:121) [surefire-booter-2.19.1.jar:2.19.1]
[main] ERROR io.siddhi.extension.map.keyvalue.sourcemapper.KeyValueSourceMapper [] - Message {volume=100, symbol=WSO2, amount=300, price=55.6, state=false} contains incompatible attribute types and values. Value 300 is not compatible with type LONG,Hence dropping the message
[main] ERROR io.siddhi.core.stream.input.source.SourceMapper [] - Error while processing '{volume=100, symbol=WSO2, amount=300, price=55.6, state=false}', for the input Mapping 'keyvalue' for the stream 'FooStream'.
io.siddhi.core.exception.MappingFailedException: null
	at io.siddhi.extension.map.keyvalue.sourcemapper.KeyValueSourceMapper.mapAndProcess(KeyValueSourceMapper.java:172) ~[classes/:?]
	at io.siddhi.core.stream.input.source.SourceMapper.onEvent(SourceMapper.java:201) [siddhi-core-5.1.21.jar:?]
	at io.siddhi.core.stream.input.source.SourceMapper.onEvent(SourceMapper.java:145) [siddhi-core-5.1.21.jar:?]
	at io.siddhi.core.stream.input.source.InMemorySource$1.onMessage(InMemorySource.java:99) [siddhi-core-5.1.21.jar:?]
	at io.siddhi.core.util.transport.InMemoryBroker$MessageBroker.broadcast(InMemoryBroker.java:110) [siddhi-core-5.1.21.jar:?]
	at io.siddhi.core.util.transport.InMemoryBroker$MessageBroker.publish(InMemoryBroker.java:118) [siddhi-core-5.1.21.jar:?]
	at io.siddhi.core.util.transport.InMemoryBroker.publish(InMemoryBroker.java:41) [siddhi-core-5.1.21.jar:?]
	at io.siddhi.extension.map.keyvalue.sourcemapper.KeyValueSourceMapperTestCase.keyvalueSourceMapperDefaultTest4(KeyValueSourceMapperTestCase.java:351) [test-classes/:?]
	at sun.reflect.NativeMethodAccessorImpl.invoke0(Native Method) ~[?:1.8.0_171]
	at sun.reflect.NativeMethodAccessorImpl.invoke(NativeMethodAccessorImpl.java:62) ~[?:1.8.0_171]
	at sun.reflect.DelegatingMethodAccessorImpl.invoke(DelegatingMethodAccessorImpl.java:43) ~[?:1.8.0_171]
	at java.lang.reflect.Method.invoke(Method.java:498) ~[?:1.8.0_171]
	at org.testng.internal.MethodInvocationHelper.invokeMethod(MethodInvocationHelper.java:108) [testng-6.11.jar:?]
	at org.testng.internal.Invoker.invokeMethod(Invoker.java:661) [testng-6.11.jar:?]
	at org.testng.internal.Invoker.invokeTestMethod(Invoker.java:869) [testng-6.11.jar:?]
	at org.testng.internal.Invoker.invokeTestMethods(Invoker.java:1193) [testng-6.11.jar:?]
	at org.testng.internal.TestMethodWorker.invokeTestMethods(TestMethodWorker.java:126) [testng-6.11.jar:?]
	at org.testng.internal.TestMethodWorker.run(TestMethodWorker.java:109) [testng-6.11.jar:?]
	at org.testng.TestRunner.privateRun(TestRunner.java:744) [testng-6.11.jar:?]
	at org.testng.TestRunner.run(TestRunner.java:602) [testng-6.11.jar:?]
	at org.testng.SuiteRunner.runTest(SuiteRunner.java:380) [testng-6.11.jar:?]
	at org.testng.SuiteRunner.runSequentially(SuiteRunner.java:375) [testng-6.11.jar:?]
	at org.testng.SuiteRunner.privateRun(SuiteRunner.java:340) [testng-6.11.jar:?]
	at org.testng.SuiteRunner.run(SuiteRunner.java:289) [testng-6.11.jar:?]
	at org.testng.SuiteRunnerWorker.runSuite(SuiteRunnerWorker.java:52) [testng-6.11.jar:?]
	at org.testng.SuiteRunnerWorker.run(SuiteRunnerWorker.java:86) [testng-6.11.jar:?]
	at org.testng.TestNG.runSuitesSequentially(TestNG.java:1301) [testng-6.11.jar:?]
	at org.testng.TestNG.runSuitesLocally(TestNG.java:1226) [testng-6.11.jar:?]
	at org.testng.TestNG.runSuites(TestNG.java:1144) [testng-6.11.jar:?]
	at org.testng.TestNG.run(TestNG.java:1115) [testng-6.11.jar:?]
	at org.apache.maven.surefire.testng.TestNGExecutor.run(TestNGExecutor.java:281) [surefire-testng-2.19.1.jar:2.19.1]
	at org.apache.maven.surefire.testng.TestNGXmlTestSuite.execute(TestNGXmlTestSuite.java:75) [surefire-testng-2.19.1.jar:2.19.1]
	at org.apache.maven.surefire.testng.TestNGProvider.invoke(TestNGProvider.java:121) [surefire-testng-2.19.1.jar:2.19.1]
	at org.apache.maven.surefire.booter.ForkedBooter.invokeProviderInSameClassLoader(ForkedBooter.java:290) [surefire-booter-2.19.1.jar:2.19.1]
	at org.apache.maven.surefire.booter.ForkedBooter.runSuitesInProcess(ForkedBooter.java:242) [surefire-booter-2.19.1.jar:2.19.1]
	at org.apache.maven.surefire.booter.ForkedBooter.main(ForkedBooter.java:121) [surefire-booter-2.19.1.jar:2.19.1]
[main] INFO  io.siddhi.extension.map.keyvalue.sourcemapper.KeyValueSourceMapperTestCase [] - KeyValueSourceMapper-Default 8
[main] ERROR io.siddhi.extension.map.keyvalue.sourcemapper.KeyValueSourceMapper [] - Stream "FooStream" has an attribute named "price", but the received event {volume=100, symbol=9001, price=55.6} does not has a value for that attribute. Hence dropping the message.
[main] ERROR io.siddhi.core.stream.input.source.SourceMapper [] - Error while processing '{volume=100, symbol=9001, price=55.6}', for the input Mapping 'keyvalue' for the stream 'FooStream'.
io.siddhi.core.exception.MappingFailedException: null
	at io.siddhi.extension.map.keyvalue.sourcemapper.KeyValueSourceMapper.mapAndProcess(KeyValueSourceMapper.java:172) ~[classes/:?]
	at io.siddhi.core.stream.input.source.SourceMapper.onEvent(SourceMapper.java:201) [siddhi-core-5.1.21.jar:?]
	at io.siddhi.core.stream.input.source.SourceMapper.onEvent(SourceMapper.java:145) [siddhi-core-5.1.21.jar:?]
	at io.siddhi.extension.map.keyvalue.sourcemapper.TestTrpInMemorySource$1.onMessage(TestTrpInMemorySource.java:79) [test-classes/:?]
	at io.siddhi.core.util.transport.InMemoryBroker$MessageBroker.broadcast(InMemoryBroker.java:110) [siddhi-core-5.1.21.jar:?]
	at io.siddhi.core.util.transport.InMemoryBroker$MessageBroker.publish(InMemoryBroker.java:118) [siddhi-core-5.1.21.jar:?]
	at io.siddhi.core.util.transport.InMemoryBroker.publish(InMemoryBroker.java:41) [siddhi-core-5.1.21.jar:?]
	at io.siddhi.extension.map.keyvalue.sourcemapper.KeyValueSourceMapperTestCase.keyvalueSourceMapperDefaultTest8(KeyValueSourceMapperTestCase.java:978) [test-classes/:?]
	at sun.reflect.NativeMethodAccessorImpl.invoke0(Native Method) ~[?:1.8.0_171]
	at sun.reflect.NativeMethodAccessorImpl.invoke(NativeMethodAccessorImpl.java:62) ~[?:1.8.0_171]
	at sun.reflect.DelegatingMethodAccessorImpl.invoke(DelegatingMethodAccessorImpl.java:43) ~[?:1.8.0_171]
	at java.lang.reflect.Method.invoke(Method.java:498) ~[?:1.8.0_171]
	at org.testng.internal.MethodInvocationHelper.invokeMethod(MethodInvocationHelper.java:108) [testng-6.11.jar:?]
	at org.testng.internal.Invoker.invokeMethod(Invoker.java:661) [testng-6.11.jar:?]
	at org.testng.internal.Invoker.invokeTestMethod(Invoker.java:869) [testng-6.11.jar:?]
	at org.testng.internal.Invoker.invokeTestMethods(Invoker.java:1193) [testng-6.11.jar:?]
	at org.testng.internal.TestMethodWorker.invokeTestMethods(TestMethodWorker.java:126) [testng-6.11.jar:?]
	at org.testng.internal.TestMethodWorker.run(TestMethodWorker.java:109) [testng-6.11.jar:?]
	at org.testng.TestRunner.privateRun(TestRunner.java:744) [testng-6.11.jar:?]
	at org.testng.TestRunner.run(TestRunner.java:602) [testng-6.11.jar:?]
	at org.testng.SuiteRunner.runTest(SuiteRunner.java:380) [testng-6.11.jar:?]
	at org.testng.SuiteRunner.runSequentially(SuiteRunner.java:375) [testng-6.11.jar:?]
	at org.testng.SuiteRunner.privateRun(SuiteRunner.java:340) [testng-6.11.jar:?]
	at org.testng.SuiteRunner.run(SuiteRunner.java:289) [testng-6.11.jar:?]
	at org.testng.SuiteRunnerWorker.runSuite(SuiteRunnerWorker.java:52) [testng-6.11.jar:?]
	at org.testng.SuiteRunnerWorker.run(SuiteRunnerWorker.java:86) [testng-6.11.jar:?]
	at org.testng.TestNG.runSuitesSequentially(TestNG.java:1301) [testng-6.11.jar:?]
	at org.testng.TestNG.runSuitesLocally(TestNG.java:1226) [testng-6.11.jar:?]
	at org.testng.TestNG.runSuites(TestNG.java:1144) [testng-6.11.jar:?]
	at org.testng.TestNG.run(TestNG.java:1115) [testng-6.11.jar:?]
	at org.apache.maven.surefire.testng.TestNGExecutor.run(TestNGExecutor.java:281) [surefire-testng-2.19.1.jar:2.19.1]
	at org.apache.maven.surefire.testng.TestNGXmlTestSuite.execute(TestNGXmlTestSuite.java:75) [surefire-testng-2.19.1.jar:2.19.1]
	at org.apache.maven.surefire.testng.TestNGProvider.invoke(TestNGProvider.java:121) [surefire-testng-2.19.1.jar:2.19.1]
	at org.apache.maven.surefire.booter.ForkedBooter.invokeProviderInSameClassLoader(ForkedBooter.java:290) [surefire-booter-2.19.1.jar:2.19.1]
	at org.apache.maven.surefire.booter.ForkedBooter.runSuitesInProcess(ForkedBooter.java:242) [surefire-booter-2.19.1.jar:2.19.1]
	at org.apache.maven.surefire.booter.ForkedBooter.main(ForkedBooter.java:121) [surefire-booter-2.19.1.jar:2.19.1]
[main] ERROR io.siddhi.extension.map.keyvalue.sourcemapper.KeyValueSourceMapper [] - Stream "FooStream" has an attribute named "price", but the received event {volume=100, symbol=9001, price=55.6} does not has a value for that attribute. Hence dropping the message.
[main] ERROR io.siddhi.core.stream.input.source.SourceMapper [] - Error while processing '{volume=100, symbol=9001, price=55.6}', for the input Mapping 'keyvalue' for the stream 'FooStream'.
io.siddhi.core.exception.MappingFailedException: null
	at io.siddhi.extension.map.keyvalue.sourcemapper.KeyValueSourceMapper.mapAndProcess(KeyValueSourceMapper.java:172) ~[classes/:?]
	at io.siddhi.core.stream.input.source.SourceMapper.onEvent(SourceMapper.java:201) [siddhi-core-5.1.21.jar:?]
	at io.siddhi.core.stream.input.source.SourceMapper.onEvent(SourceMapper.java:145) [siddhi-core-5.1.21.jar:?]
	at io.siddhi.extension.map.keyvalue.sourcemapper.TestTrpInMemorySource$1.onMessage(TestTrpInMemorySource.java:79) [test-classes/:?]
	at io.siddhi.core.util.transport.InMemoryBroker$MessageBroker.broadcast(InMemoryBroker.java:110) [siddhi-core-5.1.21.jar:?]
	at io.siddhi.core.util.transport.InMemoryBroker$MessageBroker.publish(InMemoryBroker.java:118) [siddhi-core-5.1.21.jar:?]
	at io.siddhi.core.util.transport.InMemoryBroker.publish(InMemoryBroker.java:41) [siddhi-core-5.1.21.jar:?]
	at io.siddhi.extension.map.keyvalue.sourcemapper.KeyValueSourceMapperTestCase.keyvalueSourceMapperDefaultTest8(KeyValueSourceMapperTestCase.java:978) [test-classes/:?]
	at sun.reflect.NativeMethodAccessorImpl.invoke0(Native Method) ~[?:1.8.0_171]
	at sun.reflect.NativeMethodAccessorImpl.invoke(NativeMethodAccessorImpl.java:62) ~[?:1.8.0_171]
	at sun.reflect.DelegatingMethodAccessorImpl.invoke(DelegatingMethodAccessorImpl.java:43) ~[?:1.8.0_171]
	at java.lang.reflect.Method.invoke(Method.java:498) ~[?:1.8.0_171]
	at org.testng.internal.MethodInvocationHelper.invokeMethod(MethodInvocationHelper.java:108) [testng-6.11.jar:?]
	at org.testng.internal.Invoker.invokeMethod(Invoker.java:661) [testng-6.11.jar:?]
	at org.testng.internal.Invoker.invokeTestMethod(Invoker.java:869) [testng-6.11.jar:?]
	at org.testng.internal.Invoker.invokeTestMethods(Invoker.java:1193) [testng-6.11.jar:?]
	at org.testng.internal.TestMethodWorker.invokeTestMethods(TestMethodWorker.java:126) [testng-6.11.jar:?]
	at org.testng.internal.TestMethodWorker.run(TestMethodWorker.java:109) [testng-6.11.jar:?]
	at org.testng.TestRunner.privateRun(TestRunner.java:744) [testng-6.11.jar:?]
	at org.testng.TestRunner.run(TestRunner.java:602) [testng-6.11.jar:?]
	at org.testng.SuiteRunner.runTest(SuiteRunner.java:380) [testng-6.11.jar:?]
	at org.testng.SuiteRunner.runSequentially(SuiteRunner.java:375) [testng-6.11.jar:?]
	at org.testng.SuiteRunner.privateRun(SuiteRunner.java:340) [testng-6.11.jar:?]
	at org.testng.SuiteRunner.run(SuiteRunner.java:289) [testng-6.11.jar:?]
	at org.testng.SuiteRunnerWorker.runSuite(SuiteRunnerWorker.java:52) [testng-6.11.jar:?]
	at org.testng.SuiteRunnerWorker.run(SuiteRunnerWorker.java:86) [testng-6.11.jar:?]
	at org.testng.TestNG.runSuitesSequentially(TestNG.java:1301) [testng-6.11.jar:?]
	at org.testng.TestNG.runSuitesLocally(TestNG.java:1226) [testng-6.11.jar:?]
	at org.testng.TestNG.runSuites(TestNG.java:1144) [testng-6.11.jar:?]
	at org.testng.TestNG.run(TestNG.java:1115) [testng-6.11.jar:?]
	at org.apache.maven.surefire.testng.TestNGExecutor.run(TestNGExecutor.java:281) [surefire-testng-2.19.1.jar:2.19.1]
	at org.apache.maven.surefire.testng.TestNGXmlTestSuite.execute(TestNGXmlTestSuite.java:75) [surefire-testng-2.19.1.jar:2.19.1]
	at org.apache.maven.surefire.testng.TestNGProvider.invoke(TestNGProvider.java:121) [surefire-testng-2.19.1.jar:2.19.1]
	at org.apache.maven.surefire.booter.ForkedBooter.invokeProviderInSameClassLoader(ForkedBooter.java:290) [surefire-booter-2.19.1.jar:2.19.1]
	at org.apache.maven.surefire.booter.ForkedBooter.runSuitesInProcess(ForkedBooter.java:242) [surefire-booter-2.19.1.jar:2.19.1]
	at org.apache.maven.surefire.booter.ForkedBooter.main(ForkedBooter.java:121) [surefire-booter-2.19.1.jar:2.19.1]
[main] ERROR io.siddhi.extension.map.keyvalue.sourcemapper.KeyValueSourceMapper [] - Stream "FooStream" has an attribute named "price", but the received event {volume=100, symbol=9001, price=55.6} does not has a value for that attribute. Hence dropping the message.
[main] ERROR io.siddhi.core.stream.input.source.SourceMapper [] - Error while processing '{volume=100, symbol=9001, price=55.6}', for the input Mapping 'keyvalue' for the stream 'FooStream'.
io.siddhi.core.exception.MappingFailedException: null
	at io.siddhi.extension.map.keyvalue.sourcemapper.KeyValueSourceMapper.mapAndProcess(KeyValueSourceMapper.java:172) ~[classes/:?]
	at io.siddhi.core.stream.input.source.SourceMapper.onEvent(SourceMapper.java:201) [siddhi-core-5.1.21.jar:?]
	at io.siddhi.core.stream.input.source.SourceMapper.onEvent(SourceMapper.java:145) [siddhi-core-5.1.21.jar:?]
	at io.siddhi.extension.map.keyvalue.sourcemapper.TestTrpInMemorySource$1.onMessage(TestTrpInMemorySource.java:79) [test-classes/:?]
	at io.siddhi.core.util.transport.InMemoryBroker$MessageBroker.broadcast(InMemoryBroker.java:110) [siddhi-core-5.1.21.jar:?]
	at io.siddhi.core.util.transport.InMemoryBroker$MessageBroker.publish(InMemoryBroker.java:118) [siddhi-core-5.1.21.jar:?]
	at io.siddhi.core.util.transport.InMemoryBroker.publish(InMemoryBroker.java:41) [siddhi-core-5.1.21.jar:?]
	at io.siddhi.extension.map.keyvalue.sourcemapper.KeyValueSourceMapperTestCase.keyvalueSourceMapperDefaultTest8(KeyValueSourceMapperTestCase.java:978) [test-classes/:?]
	at sun.reflect.NativeMethodAccessorImpl.invoke0(Native Method) ~[?:1.8.0_171]
	at sun.reflect.NativeMethodAccessorImpl.invoke(NativeMethodAccessorImpl.java:62) ~[?:1.8.0_171]
	at sun.reflect.DelegatingMethodAccessorImpl.invoke(DelegatingMethodAccessorImpl.java:43) ~[?:1.8.0_171]
	at java.lang.reflect.Method.invoke(Method.java:498) ~[?:1.8.0_171]
	at org.testng.internal.MethodInvocationHelper.invokeMethod(MethodInvocationHelper.java:108) [testng-6.11.jar:?]
	at org.testng.internal.Invoker.invokeMethod(Invoker.java:661) [testng-6.11.jar:?]
	at org.testng.internal.Invoker.invokeTestMethod(Invoker.java:869) [testng-6.11.jar:?]
	at org.testng.internal.Invoker.invokeTestMethods(Invoker.java:1193) [testng-6.11.jar:?]
	at org.testng.internal.TestMethodWorker.invokeTestMethods(TestMethodWorker.java:126) [testng-6.11.jar:?]
	at org.testng.internal.TestMethodWorker.run(TestMethodWorker.java:109) [testng-6.11.jar:?]
	at org.testng.TestRunner.privateRun(TestRunner.java:744) [testng-6.11.jar:?]
	at org.testng.TestRunner.run(TestRunner.java:602) [testng-6.11.jar:?]
	at org.testng.SuiteRunner.runTest(SuiteRunner.java:380) [testng-6.11.jar:?]
	at org.testng.SuiteRunner.runSequentially(SuiteRunner.java:375) [testng-6.11.jar:?]
	at org.testng.SuiteRunner.privateRun(SuiteRunner.java:340) [testng-6.11.jar:?]
	at org.testng.SuiteRunner.run(SuiteRunner.java:289) [testng-6.11.jar:?]
	at org.testng.SuiteRunnerWorker.runSuite(SuiteRunnerWorker.java:52) [testng-6.11.jar:?]
	at org.testng.SuiteRunnerWorker.run(SuiteRunnerWorker.java:86) [testng-6.11.jar:?]
	at org.testng.TestNG.runSuitesSequentially(TestNG.java:1301) [testng-6.11.jar:?]
	at org.testng.TestNG.runSuitesLocally(TestNG.java:1226) [testng-6.11.jar:?]
	at org.testng.TestNG.runSuites(TestNG.java:1144) [testng-6.11.jar:?]
	at org.testng.TestNG.run(TestNG.java:1115) [testng-6.11.jar:?]
	at org.apache.maven.surefire.testng.TestNGExecutor.run(TestNGExecutor.java:281) [surefire-testng-2.19.1.jar:2.19.1]
	at org.apache.maven.surefire.testng.TestNGXmlTestSuite.execute(TestNGXmlTestSuite.java:75) [surefire-testng-2.19.1.jar:2.19.1]
	at org.apache.maven.surefire.testng.TestNGProvider.invoke(TestNGProvider.java:121) [surefire-testng-2.19.1.jar:2.19.1]
	at org.apache.maven.surefire.booter.ForkedBooter.invokeProviderInSameClassLoader(ForkedBooter.java:290) [surefire-booter-2.19.1.jar:2.19.1]
	at org.apache.maven.surefire.booter.ForkedBooter.runSuitesInProcess(ForkedBooter.java:242) [surefire-booter-2.19.1.jar:2.19.1]
	at org.apache.maven.surefire.booter.ForkedBooter.main(ForkedBooter.java:121) [surefire-booter-2.19.1.jar:2.19.1]
[main] INFO  io.siddhi.core.util.EventPrinter [] - [Event{timestamp=1644933184121, data=[9001, 55.6, 100], isExpired=false}]
[main] ERROR io.siddhi.extension.map.keyvalue.sourcemapper.KeyValueSourceMapper [] - Stream "FooStream" has an attribute named "price", but the received event {volume=100, symbol=9002, price=55.678} does not has a value for that attribute. Hence dropping the message.
[main] ERROR io.siddhi.core.stream.input.source.SourceMapper [] - Error while processing '{volume=100, symbol=9002, price=55.678}', for the input Mapping 'keyvalue' for the stream 'FooStream'.
io.siddhi.core.exception.MappingFailedException: null
	at io.siddhi.extension.map.keyvalue.sourcemapper.KeyValueSourceMapper.mapAndProcess(KeyValueSourceMapper.java:172) ~[classes/:?]
	at io.siddhi.core.stream.input.source.SourceMapper.onEvent(SourceMapper.java:201) [siddhi-core-5.1.21.jar:?]
	at io.siddhi.core.stream.input.source.SourceMapper.onEvent(SourceMapper.java:145) [siddhi-core-5.1.21.jar:?]
	at io.siddhi.extension.map.keyvalue.sourcemapper.TestTrpInMemorySource$1.onMessage(TestTrpInMemorySource.java:79) [test-classes/:?]
	at io.siddhi.core.util.transport.InMemoryBroker$MessageBroker.broadcast(InMemoryBroker.java:110) [siddhi-core-5.1.21.jar:?]
	at io.siddhi.core.util.transport.InMemoryBroker$MessageBroker.publish(InMemoryBroker.java:118) [siddhi-core-5.1.21.jar:?]
	at io.siddhi.core.util.transport.InMemoryBroker.publish(InMemoryBroker.java:41) [siddhi-core-5.1.21.jar:?]
	at io.siddhi.extension.map.keyvalue.sourcemapper.KeyValueSourceMapperTestCase.keyvalueSourceMapperDefaultTest8(KeyValueSourceMapperTestCase.java:984) [test-classes/:?]
	at sun.reflect.NativeMethodAccessorImpl.invoke0(Native Method) ~[?:1.8.0_171]
	at sun.reflect.NativeMethodAccessorImpl.invoke(NativeMethodAccessorImpl.java:62) ~[?:1.8.0_171]
	at sun.reflect.DelegatingMethodAccessorImpl.invoke(DelegatingMethodAccessorImpl.java:43) ~[?:1.8.0_171]
	at java.lang.reflect.Method.invoke(Method.java:498) ~[?:1.8.0_171]
	at org.testng.internal.MethodInvocationHelper.invokeMethod(MethodInvocationHelper.java:108) [testng-6.11.jar:?]
	at org.testng.internal.Invoker.invokeMethod(Invoker.java:661) [testng-6.11.jar:?]
	at org.testng.internal.Invoker.invokeTestMethod(Invoker.java:869) [testng-6.11.jar:?]
	at org.testng.internal.Invoker.invokeTestMethods(Invoker.java:1193) [testng-6.11.jar:?]
	at org.testng.internal.TestMethodWorker.invokeTestMethods(TestMethodWorker.java:126) [testng-6.11.jar:?]
	at org.testng.internal.TestMethodWorker.run(TestMethodWorker.java:109) [testng-6.11.jar:?]
	at org.testng.TestRunner.privateRun(TestRunner.java:744) [testng-6.11.jar:?]
	at org.testng.TestRunner.run(TestRunner.java:602) [testng-6.11.jar:?]
	at org.testng.SuiteRunner.runTest(SuiteRunner.java:380) [testng-6.11.jar:?]
	at org.testng.SuiteRunner.runSequentially(SuiteRunner.java:375) [testng-6.11.jar:?]
	at org.testng.SuiteRunner.privateRun(SuiteRunner.java:340) [testng-6.11.jar:?]
	at org.testng.SuiteRunner.run(SuiteRunner.java:289) [testng-6.11.jar:?]
	at org.testng.SuiteRunnerWorker.runSuite(SuiteRunnerWorker.java:52) [testng-6.11.jar:?]
	at org.testng.SuiteRunnerWorker.run(SuiteRunnerWorker.java:86) [testng-6.11.jar:?]
	at org.testng.TestNG.runSuitesSequentially(TestNG.java:1301) [testng-6.11.jar:?]
	at org.testng.TestNG.runSuitesLocally(TestNG.java:1226) [testng-6.11.jar:?]
	at org.testng.TestNG.runSuites(TestNG.java:1144) [testng-6.11.jar:?]
	at org.testng.TestNG.run(TestNG.java:1115) [testng-6.11.jar:?]
	at org.apache.maven.surefire.testng.TestNGExecutor.run(TestNGExecutor.java:281) [surefire-testng-2.19.1.jar:2.19.1]
	at org.apache.maven.surefire.testng.TestNGXmlTestSuite.execute(TestNGXmlTestSuite.java:75) [surefire-testng-2.19.1.jar:2.19.1]
	at org.apache.maven.surefire.testng.TestNGProvider.invoke(TestNGProvider.java:121) [surefire-testng-2.19.1.jar:2.19.1]
	at org.apache.maven.surefire.booter.ForkedBooter.invokeProviderInSameClassLoader(ForkedBooter.java:290) [surefire-booter-2.19.1.jar:2.19.1]
	at org.apache.maven.surefire.booter.ForkedBooter.runSuitesInProcess(ForkedBooter.java:242) [surefire-booter-2.19.1.jar:2.19.1]
	at org.apache.maven.surefire.booter.ForkedBooter.main(ForkedBooter.java:121) [surefire-booter-2.19.1.jar:2.19.1]
[main] ERROR io.siddhi.extension.map.keyvalue.sourcemapper.KeyValueSourceMapper [] - Stream "FooStream" has an attribute named "price", but the received event {volume=100, symbol=9002, price=55.678} does not has a value for that attribute. Hence dropping the message.
[main] ERROR io.siddhi.core.stream.input.source.SourceMapper [] - Error while processing '{volume=100, symbol=9002, price=55.678}', for the input Mapping 'keyvalue' for the stream 'FooStream'.
io.siddhi.core.exception.MappingFailedException: null
	at io.siddhi.extension.map.keyvalue.sourcemapper.KeyValueSourceMapper.mapAndProcess(KeyValueSourceMapper.java:172) ~[classes/:?]
	at io.siddhi.core.stream.input.source.SourceMapper.onEvent(SourceMapper.java:201) [siddhi-core-5.1.21.jar:?]
	at io.siddhi.core.stream.input.source.SourceMapper.onEvent(SourceMapper.java:145) [siddhi-core-5.1.21.jar:?]
	at io.siddhi.extension.map.keyvalue.sourcemapper.TestTrpInMemorySource$1.onMessage(TestTrpInMemorySource.java:79) [test-classes/:?]
	at io.siddhi.core.util.transport.InMemoryBroker$MessageBroker.broadcast(InMemoryBroker.java:110) [siddhi-core-5.1.21.jar:?]
	at io.siddhi.core.util.transport.InMemoryBroker$MessageBroker.publish(InMemoryBroker.java:118) [siddhi-core-5.1.21.jar:?]
	at io.siddhi.core.util.transport.InMemoryBroker.publish(InMemoryBroker.java:41) [siddhi-core-5.1.21.jar:?]
	at io.siddhi.extension.map.keyvalue.sourcemapper.KeyValueSourceMapperTestCase.keyvalueSourceMapperDefaultTest8(KeyValueSourceMapperTestCase.java:984) [test-classes/:?]
	at sun.reflect.NativeMethodAccessorImpl.invoke0(Native Method) ~[?:1.8.0_171]
	at sun.reflect.NativeMethodAccessorImpl.invoke(NativeMethodAccessorImpl.java:62) ~[?:1.8.0_171]
	at sun.reflect.DelegatingMethodAccessorImpl.invoke(DelegatingMethodAccessorImpl.java:43) ~[?:1.8.0_171]
	at java.lang.reflect.Method.invoke(Method.java:498) ~[?:1.8.0_171]
	at org.testng.internal.MethodInvocationHelper.invokeMethod(MethodInvocationHelper.java:108) [testng-6.11.jar:?]
	at org.testng.internal.Invoker.invokeMethod(Invoker.java:661) [testng-6.11.jar:?]
	at org.testng.internal.Invoker.invokeTestMethod(Invoker.java:869) [testng-6.11.jar:?]
	at org.testng.internal.Invoker.invokeTestMethods(Invoker.java:1193) [testng-6.11.jar:?]
	at org.testng.internal.TestMethodWorker.invokeTestMethods(TestMethodWorker.java:126) [testng-6.11.jar:?]
	at org.testng.internal.TestMethodWorker.run(TestMethodWorker.java:109) [testng-6.11.jar:?]
	at org.testng.TestRunner.privateRun(TestRunner.java:744) [testng-6.11.jar:?]
	at org.testng.TestRunner.run(TestRunner.java:602) [testng-6.11.jar:?]
	at org.testng.SuiteRunner.runTest(SuiteRunner.java:380) [testng-6.11.jar:?]
	at org.testng.SuiteRunner.runSequentially(SuiteRunner.java:375) [testng-6.11.jar:?]
	at org.testng.SuiteRunner.privateRun(SuiteRunner.java:340) [testng-6.11.jar:?]
	at org.testng.SuiteRunner.run(SuiteRunner.java:289) [testng-6.11.jar:?]
	at org.testng.SuiteRunnerWorker.runSuite(SuiteRunnerWorker.java:52) [testng-6.11.jar:?]
	at org.testng.SuiteRunnerWorker.run(SuiteRunnerWorker.java:86) [testng-6.11.jar:?]
	at org.testng.TestNG.runSuitesSequentially(TestNG.java:1301) [testng-6.11.jar:?]
	at org.testng.TestNG.runSuitesLocally(TestNG.java:1226) [testng-6.11.jar:?]
	at org.testng.TestNG.runSuites(TestNG.java:1144) [testng-6.11.jar:?]
	at org.testng.TestNG.run(TestNG.java:1115) [testng-6.11.jar:?]
	at org.apache.maven.surefire.testng.TestNGExecutor.run(TestNGExecutor.java:281) [surefire-testng-2.19.1.jar:2.19.1]
	at org.apache.maven.surefire.testng.TestNGXmlTestSuite.execute(TestNGXmlTestSuite.java:75) [surefire-testng-2.19.1.jar:2.19.1]
	at org.apache.maven.surefire.testng.TestNGProvider.invoke(TestNGProvider.java:121) [surefire-testng-2.19.1.jar:2.19.1]
	at org.apache.maven.surefire.booter.ForkedBooter.invokeProviderInSameClassLoader(ForkedBooter.java:290) [surefire-booter-2.19.1.jar:2.19.1]
	at org.apache.maven.surefire.booter.ForkedBooter.runSuitesInProcess(ForkedBooter.java:242) [surefire-booter-2.19.1.jar:2.19.1]
	at org.apache.maven.surefire.booter.ForkedBooter.main(ForkedBooter.java:121) [surefire-booter-2.19.1.jar:2.19.1]
[main] ERROR io.siddhi.extension.map.keyvalue.sourcemapper.KeyValueSourceMapper [] - Stream "FooStream" has an attribute named "price", but the received event {volume=100, symbol=9002, price=55.678} does not has a value for that attribute. Hence dropping the message.
[main] ERROR io.siddhi.core.stream.input.source.SourceMapper [] - Error while processing '{volume=100, symbol=9002, price=55.678}', for the input Mapping 'keyvalue' for the stream 'FooStream'.
io.siddhi.core.exception.MappingFailedException: null
	at io.siddhi.extension.map.keyvalue.sourcemapper.KeyValueSourceMapper.mapAndProcess(KeyValueSourceMapper.java:172) ~[classes/:?]
	at io.siddhi.core.stream.input.source.SourceMapper.onEvent(SourceMapper.java:201) [siddhi-core-5.1.21.jar:?]
	at io.siddhi.core.stream.input.source.SourceMapper.onEvent(SourceMapper.java:145) [siddhi-core-5.1.21.jar:?]
	at io.siddhi.extension.map.keyvalue.sourcemapper.TestTrpInMemorySource$1.onMessage(TestTrpInMemorySource.java:79) [test-classes/:?]
	at io.siddhi.core.util.transport.InMemoryBroker$MessageBroker.broadcast(InMemoryBroker.java:110) [siddhi-core-5.1.21.jar:?]
	at io.siddhi.core.util.transport.InMemoryBroker$MessageBroker.publish(InMemoryBroker.java:118) [siddhi-core-5.1.21.jar:?]
	at io.siddhi.core.util.transport.InMemoryBroker.publish(InMemoryBroker.java:41) [siddhi-core-5.1.21.jar:?]
	at io.siddhi.extension.map.keyvalue.sourcemapper.KeyValueSourceMapperTestCase.keyvalueSourceMapperDefaultTest8(KeyValueSourceMapperTestCase.java:984) [test-classes/:?]
	at sun.reflect.NativeMethodAccessorImpl.invoke0(Native Method) ~[?:1.8.0_171]
	at sun.reflect.NativeMethodAccessorImpl.invoke(NativeMethodAccessorImpl.java:62) ~[?:1.8.0_171]
	at sun.reflect.DelegatingMethodAccessorImpl.invoke(DelegatingMethodAccessorImpl.java:43) ~[?:1.8.0_171]
	at java.lang.reflect.Method.invoke(Method.java:498) ~[?:1.8.0_171]
	at org.testng.internal.MethodInvocationHelper.invokeMethod(MethodInvocationHelper.java:108) [testng-6.11.jar:?]
	at org.testng.internal.Invoker.invokeMethod(Invoker.java:661) [testng-6.11.jar:?]
	at org.testng.internal.Invoker.invokeTestMethod(Invoker.java:869) [testng-6.11.jar:?]
	at org.testng.internal.Invoker.invokeTestMethods(Invoker.java:1193) [testng-6.11.jar:?]
	at org.testng.internal.TestMethodWorker.invokeTestMethods(TestMethodWorker.java:126) [testng-6.11.jar:?]
	at org.testng.internal.TestMethodWorker.run(TestMethodWorker.java:109) [testng-6.11.jar:?]
	at org.testng.TestRunner.privateRun(TestRunner.java:744) [testng-6.11.jar:?]
	at org.testng.TestRunner.run(TestRunner.java:602) [testng-6.11.jar:?]
	at org.testng.SuiteRunner.runTest(SuiteRunner.java:380) [testng-6.11.jar:?]
	at org.testng.SuiteRunner.runSequentially(SuiteRunner.java:375) [testng-6.11.jar:?]
	at org.testng.SuiteRunner.privateRun(SuiteRunner.java:340) [testng-6.11.jar:?]
	at org.testng.SuiteRunner.run(SuiteRunner.java:289) [testng-6.11.jar:?]
	at org.testng.SuiteRunnerWorker.runSuite(SuiteRunnerWorker.java:52) [testng-6.11.jar:?]
	at org.testng.SuiteRunnerWorker.run(SuiteRunnerWorker.java:86) [testng-6.11.jar:?]
	at org.testng.TestNG.runSuitesSequentially(TestNG.java:1301) [testng-6.11.jar:?]
	at org.testng.TestNG.runSuitesLocally(TestNG.java:1226) [testng-6.11.jar:?]
	at org.testng.TestNG.runSuites(TestNG.java:1144) [testng-6.11.jar:?]
	at org.testng.TestNG.run(TestNG.java:1115) [testng-6.11.jar:?]
	at org.apache.maven.surefire.testng.TestNGExecutor.run(TestNGExecutor.java:281) [surefire-testng-2.19.1.jar:2.19.1]
	at org.apache.maven.surefire.testng.TestNGXmlTestSuite.execute(TestNGXmlTestSuite.java:75) [surefire-testng-2.19.1.jar:2.19.1]
	at org.apache.maven.surefire.testng.TestNGProvider.invoke(TestNGProvider.java:121) [surefire-testng-2.19.1.jar:2.19.1]
	at org.apache.maven.surefire.booter.ForkedBooter.invokeProviderInSameClassLoader(ForkedBooter.java:290) [surefire-booter-2.19.1.jar:2.19.1]
	at org.apache.maven.surefire.booter.ForkedBooter.runSuitesInProcess(ForkedBooter.java:242) [surefire-booter-2.19.1.jar:2.19.1]
	at org.apache.maven.surefire.booter.ForkedBooter.main(ForkedBooter.java:121) [surefire-booter-2.19.1.jar:2.19.1]
[main] INFO  io.siddhi.core.util.EventPrinter [] - [Event{timestamp=1644933184122, data=[9002, 55.678, 100], isExpired=false}]
[main] ERROR io.siddhi.extension.map.keyvalue.sourcemapper.KeyValueSourceMapper [] - Stream "FooStream" has an attribute named "price", but the received event {volume=100, symbol=9003, price=55.678} does not has a value for that attribute. Hence dropping the message.
[main] ERROR io.siddhi.core.stream.input.source.SourceMapper [] - Error while processing '{volume=100, symbol=9003, price=55.678}', for the input Mapping 'keyvalue' for the stream 'FooStream'.
io.siddhi.core.exception.MappingFailedException: null
	at io.siddhi.extension.map.keyvalue.sourcemapper.KeyValueSourceMapper.mapAndProcess(KeyValueSourceMapper.java:172) ~[classes/:?]
	at io.siddhi.core.stream.input.source.SourceMapper.onEvent(SourceMapper.java:201) [siddhi-core-5.1.21.jar:?]
	at io.siddhi.core.stream.input.source.SourceMapper.onEvent(SourceMapper.java:145) [siddhi-core-5.1.21.jar:?]
	at io.siddhi.extension.map.keyvalue.sourcemapper.TestTrpInMemorySource$1.onMessage(TestTrpInMemorySource.java:79) [test-classes/:?]
	at io.siddhi.core.util.transport.InMemoryBroker$MessageBroker.broadcast(InMemoryBroker.java:110) [siddhi-core-5.1.21.jar:?]
	at io.siddhi.core.util.transport.InMemoryBroker$MessageBroker.publish(InMemoryBroker.java:118) [siddhi-core-5.1.21.jar:?]
	at io.siddhi.core.util.transport.InMemoryBroker.publish(InMemoryBroker.java:41) [siddhi-core-5.1.21.jar:?]
	at io.siddhi.extension.map.keyvalue.sourcemapper.KeyValueSourceMapperTestCase.keyvalueSourceMapperDefaultTest8(KeyValueSourceMapperTestCase.java:990) [test-classes/:?]
	at sun.reflect.NativeMethodAccessorImpl.invoke0(Native Method) ~[?:1.8.0_171]
	at sun.reflect.NativeMethodAccessorImpl.invoke(NativeMethodAccessorImpl.java:62) ~[?:1.8.0_171]
	at sun.reflect.DelegatingMethodAccessorImpl.invoke(DelegatingMethodAccessorImpl.java:43) ~[?:1.8.0_171]
	at java.lang.reflect.Method.invoke(Method.java:498) ~[?:1.8.0_171]
	at org.testng.internal.MethodInvocationHelper.invokeMethod(MethodInvocationHelper.java:108) [testng-6.11.jar:?]
	at org.testng.internal.Invoker.invokeMethod(Invoker.java:661) [testng-6.11.jar:?]
	at org.testng.internal.Invoker.invokeTestMethod(Invoker.java:869) [testng-6.11.jar:?]
	at org.testng.internal.Invoker.invokeTestMethods(Invoker.java:1193) [testng-6.11.jar:?]
	at org.testng.internal.TestMethodWorker.invokeTestMethods(TestMethodWorker.java:126) [testng-6.11.jar:?]
	at org.testng.internal.TestMethodWorker.run(TestMethodWorker.java:109) [testng-6.11.jar:?]
	at org.testng.TestRunner.privateRun(TestRunner.java:744) [testng-6.11.jar:?]
	at org.testng.TestRunner.run(TestRunner.java:602) [testng-6.11.jar:?]
	at org.testng.SuiteRunner.runTest(SuiteRunner.java:380) [testng-6.11.jar:?]
	at org.testng.SuiteRunner.runSequentially(SuiteRunner.java:375) [testng-6.11.jar:?]
	at org.testng.SuiteRunner.privateRun(SuiteRunner.java:340) [testng-6.11.jar:?]
	at org.testng.SuiteRunner.run(SuiteRunner.java:289) [testng-6.11.jar:?]
	at org.testng.SuiteRunnerWorker.runSuite(SuiteRunnerWorker.java:52) [testng-6.11.jar:?]
	at org.testng.SuiteRunnerWorker.run(SuiteRunnerWorker.java:86) [testng-6.11.jar:?]
	at org.testng.TestNG.runSuitesSequentially(TestNG.java:1301) [testng-6.11.jar:?]
	at org.testng.TestNG.runSuitesLocally(TestNG.java:1226) [testng-6.11.jar:?]
	at org.testng.TestNG.runSuites(TestNG.java:1144) [testng-6.11.jar:?]
	at org.testng.TestNG.run(TestNG.java:1115) [testng-6.11.jar:?]
	at org.apache.maven.surefire.testng.TestNGExecutor.run(TestNGExecutor.java:281) [surefire-testng-2.19.1.jar:2.19.1]
	at org.apache.maven.surefire.testng.TestNGXmlTestSuite.execute(TestNGXmlTestSuite.java:75) [surefire-testng-2.19.1.jar:2.19.1]
	at org.apache.maven.surefire.testng.TestNGProvider.invoke(TestNGProvider.java:121) [surefire-testng-2.19.1.jar:2.19.1]
	at org.apache.maven.surefire.booter.ForkedBooter.invokeProviderInSameClassLoader(ForkedBooter.java:290) [surefire-booter-2.19.1.jar:2.19.1]
	at org.apache.maven.surefire.booter.ForkedBooter.runSuitesInProcess(ForkedBooter.java:242) [surefire-booter-2.19.1.jar:2.19.1]
	at org.apache.maven.surefire.booter.ForkedBooter.main(ForkedBooter.java:121) [surefire-booter-2.19.1.jar:2.19.1]
[main] ERROR io.siddhi.extension.map.keyvalue.sourcemapper.KeyValueSourceMapper [] - Stream "FooStream" has an attribute named "price", but the received event {volume=100, symbol=9003, price=55.678} does not has a value for that attribute. Hence dropping the message.
[main] ERROR io.siddhi.core.stream.input.source.SourceMapper [] - Error while processing '{volume=100, symbol=9003, price=55.678}', for the input Mapping 'keyvalue' for the stream 'FooStream'.
io.siddhi.core.exception.MappingFailedException: null
	at io.siddhi.extension.map.keyvalue.sourcemapper.KeyValueSourceMapper.mapAndProcess(KeyValueSourceMapper.java:172) ~[classes/:?]
	at io.siddhi.core.stream.input.source.SourceMapper.onEvent(SourceMapper.java:201) [siddhi-core-5.1.21.jar:?]
	at io.siddhi.core.stream.input.source.SourceMapper.onEvent(SourceMapper.java:145) [siddhi-core-5.1.21.jar:?]
	at io.siddhi.extension.map.keyvalue.sourcemapper.TestTrpInMemorySource$1.onMessage(TestTrpInMemorySource.java:79) [test-classes/:?]
	at io.siddhi.core.util.transport.InMemoryBroker$MessageBroker.broadcast(InMemoryBroker.java:110) [siddhi-core-5.1.21.jar:?]
	at io.siddhi.core.util.transport.InMemoryBroker$MessageBroker.publish(InMemoryBroker.java:118) [siddhi-core-5.1.21.jar:?]
	at io.siddhi.core.util.transport.InMemoryBroker.publish(InMemoryBroker.java:41) [siddhi-core-5.1.21.jar:?]
	at io.siddhi.extension.map.keyvalue.sourcemapper.KeyValueSourceMapperTestCase.keyvalueSourceMapperDefaultTest8(KeyValueSourceMapperTestCase.java:990) [test-classes/:?]
	at sun.reflect.NativeMethodAccessorImpl.invoke0(Native Method) ~[?:1.8.0_171]
	at sun.reflect.NativeMethodAccessorImpl.invoke(NativeMethodAccessorImpl.java:62) ~[?:1.8.0_171]
	at sun.reflect.DelegatingMethodAccessorImpl.invoke(DelegatingMethodAccessorImpl.java:43) ~[?:1.8.0_171]
	at java.lang.reflect.Method.invoke(Method.java:498) ~[?:1.8.0_171]
	at org.testng.internal.MethodInvocationHelper.invokeMethod(MethodInvocationHelper.java:108) [testng-6.11.jar:?]
	at org.testng.internal.Invoker.invokeMethod(Invoker.java:661) [testng-6.11.jar:?]
	at org.testng.internal.Invoker.invokeTestMethod(Invoker.java:869) [testng-6.11.jar:?]
	at org.testng.internal.Invoker.invokeTestMethods(Invoker.java:1193) [testng-6.11.jar:?]
	at org.testng.internal.TestMethodWorker.invokeTestMethods(TestMethodWorker.java:126) [testng-6.11.jar:?]
	at org.testng.internal.TestMethodWorker.run(TestMethodWorker.java:109) [testng-6.11.jar:?]
	at org.testng.TestRunner.privateRun(TestRunner.java:744) [testng-6.11.jar:?]
	at org.testng.TestRunner.run(TestRunner.java:602) [testng-6.11.jar:?]
	at org.testng.SuiteRunner.runTest(SuiteRunner.java:380) [testng-6.11.jar:?]
	at org.testng.SuiteRunner.runSequentially(SuiteRunner.java:375) [testng-6.11.jar:?]
	at org.testng.SuiteRunner.privateRun(SuiteRunner.java:340) [testng-6.11.jar:?]
	at org.testng.SuiteRunner.run(SuiteRunner.java:289) [testng-6.11.jar:?]
	at org.testng.SuiteRunnerWorker.runSuite(SuiteRunnerWorker.java:52) [testng-6.11.jar:?]
	at org.testng.SuiteRunnerWorker.run(SuiteRunnerWorker.java:86) [testng-6.11.jar:?]
	at org.testng.TestNG.runSuitesSequentially(TestNG.java:1301) [testng-6.11.jar:?]
	at org.testng.TestNG.runSuitesLocally(TestNG.java:1226) [testng-6.11.jar:?]
	at org.testng.TestNG.runSuites(TestNG.java:1144) [testng-6.11.jar:?]
	at org.testng.TestNG.run(TestNG.java:1115) [testng-6.11.jar:?]
	at org.apache.maven.surefire.testng.TestNGExecutor.run(TestNGExecutor.java:281) [surefire-testng-2.19.1.jar:2.19.1]
	at org.apache.maven.surefire.testng.TestNGXmlTestSuite.execute(TestNGXmlTestSuite.java:75) [surefire-testng-2.19.1.jar:2.19.1]
	at org.apache.maven.surefire.testng.TestNGProvider.invoke(TestNGProvider.java:121) [surefire-testng-2.19.1.jar:2.19.1]
	at org.apache.maven.surefire.booter.ForkedBooter.invokeProviderInSameClassLoader(ForkedBooter.java:290) [surefire-booter-2.19.1.jar:2.19.1]
	at org.apache.maven.surefire.booter.ForkedBooter.runSuitesInProcess(ForkedBooter.java:242) [surefire-booter-2.19.1.jar:2.19.1]
	at org.apache.maven.surefire.booter.ForkedBooter.main(ForkedBooter.java:121) [surefire-booter-2.19.1.jar:2.19.1]
[main] ERROR io.siddhi.extension.map.keyvalue.sourcemapper.KeyValueSourceMapper [] - Stream "FooStream" has an attribute named "price", but the received event {volume=100, symbol=9003, price=55.678} does not has a value for that attribute. Hence dropping the message.
[main] ERROR io.siddhi.core.stream.input.source.SourceMapper [] - Error while processing '{volume=100, symbol=9003, price=55.678}', for the input Mapping 'keyvalue' for the stream 'FooStream'.
io.siddhi.core.exception.MappingFailedException: null
	at io.siddhi.extension.map.keyvalue.sourcemapper.KeyValueSourceMapper.mapAndProcess(KeyValueSourceMapper.java:172) ~[classes/:?]
	at io.siddhi.core.stream.input.source.SourceMapper.onEvent(SourceMapper.java:201) [siddhi-core-5.1.21.jar:?]
	at io.siddhi.core.stream.input.source.SourceMapper.onEvent(SourceMapper.java:145) [siddhi-core-5.1.21.jar:?]
	at io.siddhi.extension.map.keyvalue.sourcemapper.TestTrpInMemorySource$1.onMessage(TestTrpInMemorySource.java:79) [test-classes/:?]
	at io.siddhi.core.util.transport.InMemoryBroker$MessageBroker.broadcast(InMemoryBroker.java:110) [siddhi-core-5.1.21.jar:?]
	at io.siddhi.core.util.transport.InMemoryBroker$MessageBroker.publish(InMemoryBroker.java:118) [siddhi-core-5.1.21.jar:?]
	at io.siddhi.core.util.transport.InMemoryBroker.publish(InMemoryBroker.java:41) [siddhi-core-5.1.21.jar:?]
	at io.siddhi.extension.map.keyvalue.sourcemapper.KeyValueSourceMapperTestCase.keyvalueSourceMapperDefaultTest8(KeyValueSourceMapperTestCase.java:990) [test-classes/:?]
	at sun.reflect.NativeMethodAccessorImpl.invoke0(Native Method) ~[?:1.8.0_171]
	at sun.reflect.NativeMethodAccessorImpl.invoke(NativeMethodAccessorImpl.java:62) ~[?:1.8.0_171]
	at sun.reflect.DelegatingMethodAccessorImpl.invoke(DelegatingMethodAccessorImpl.java:43) ~[?:1.8.0_171]
	at java.lang.reflect.Method.invoke(Method.java:498) ~[?:1.8.0_171]
	at org.testng.internal.MethodInvocationHelper.invokeMethod(MethodInvocationHelper.java:108) [testng-6.11.jar:?]
	at org.testng.internal.Invoker.invokeMethod(Invoker.java:661) [testng-6.11.jar:?]
	at org.testng.internal.Invoker.invokeTestMethod(Invoker.java:869) [testng-6.11.jar:?]
	at org.testng.internal.Invoker.invokeTestMethods(Invoker.java:1193) [testng-6.11.jar:?]
	at org.testng.internal.TestMethodWorker.invokeTestMethods(TestMethodWorker.java:126) [testng-6.11.jar:?]
	at org.testng.internal.TestMethodWorker.run(TestMethodWorker.java:109) [testng-6.11.jar:?]
	at org.testng.TestRunner.privateRun(TestRunner.java:744) [testng-6.11.jar:?]
	at org.testng.TestRunner.run(TestRunner.java:602) [testng-6.11.jar:?]
	at org.testng.SuiteRunner.runTest(SuiteRunner.java:380) [testng-6.11.jar:?]
	at org.testng.SuiteRunner.runSequentially(SuiteRunner.java:375) [testng-6.11.jar:?]
	at org.testng.SuiteRunner.privateRun(SuiteRunner.java:340) [testng-6.11.jar:?]
	at org.testng.SuiteRunner.run(SuiteRunner.java:289) [testng-6.11.jar:?]
	at org.testng.SuiteRunnerWorker.runSuite(SuiteRunnerWorker.java:52) [testng-6.11.jar:?]
	at org.testng.SuiteRunnerWorker.run(SuiteRunnerWorker.java:86) [testng-6.11.jar:?]
	at org.testng.TestNG.runSuitesSequentially(TestNG.java:1301) [testng-6.11.jar:?]
	at org.testng.TestNG.runSuitesLocally(TestNG.java:1226) [testng-6.11.jar:?]
	at org.testng.TestNG.runSuites(TestNG.java:1144) [testng-6.11.jar:?]
	at org.testng.TestNG.run(TestNG.java:1115) [testng-6.11.jar:?]
	at org.apache.maven.surefire.testng.TestNGExecutor.run(TestNGExecutor.java:281) [surefire-testng-2.19.1.jar:2.19.1]
	at org.apache.maven.surefire.testng.TestNGXmlTestSuite.execute(TestNGXmlTestSuite.java:75) [surefire-testng-2.19.1.jar:2.19.1]
	at org.apache.maven.surefire.testng.TestNGProvider.invoke(TestNGProvider.java:121) [surefire-testng-2.19.1.jar:2.19.1]
	at org.apache.maven.surefire.booter.ForkedBooter.invokeProviderInSameClassLoader(ForkedBooter.java:290) [surefire-booter-2.19.1.jar:2.19.1]
	at org.apache.maven.surefire.booter.ForkedBooter.runSuitesInProcess(ForkedBooter.java:242) [surefire-booter-2.19.1.jar:2.19.1]
	at org.apache.maven.surefire.booter.ForkedBooter.main(ForkedBooter.java:121) [surefire-booter-2.19.1.jar:2.19.1]
[main] INFO  io.siddhi.core.util.EventPrinter [] - [Event{timestamp=1644933184123, data=[9003, 55.678, 100], isExpired=false}]
[main] ERROR io.siddhi.extension.map.keyvalue.sourcemapper.KeyValueSourceMapper [] - Stream "FooStream" has an attribute named "price", but the received event {volume=100, symbol=9004, price=55.678} does not has a value for that attribute. Hence dropping the message.
[main] ERROR io.siddhi.core.stream.input.source.SourceMapper [] - Error while processing '{volume=100, symbol=9004, price=55.678}', for the input Mapping 'keyvalue' for the stream 'FooStream'.
io.siddhi.core.exception.MappingFailedException: null
	at io.siddhi.extension.map.keyvalue.sourcemapper.KeyValueSourceMapper.mapAndProcess(KeyValueSourceMapper.java:172) ~[classes/:?]
	at io.siddhi.core.stream.input.source.SourceMapper.onEvent(SourceMapper.java:201) [siddhi-core-5.1.21.jar:?]
	at io.siddhi.core.stream.input.source.SourceMapper.onEvent(SourceMapper.java:145) [siddhi-core-5.1.21.jar:?]
	at io.siddhi.extension.map.keyvalue.sourcemapper.TestTrpInMemorySource$1.onMessage(TestTrpInMemorySource.java:79) [test-classes/:?]
	at io.siddhi.core.util.transport.InMemoryBroker$MessageBroker.broadcast(InMemoryBroker.java:110) [siddhi-core-5.1.21.jar:?]
	at io.siddhi.core.util.transport.InMemoryBroker$MessageBroker.publish(InMemoryBroker.java:118) [siddhi-core-5.1.21.jar:?]
	at io.siddhi.core.util.transport.InMemoryBroker.publish(InMemoryBroker.java:41) [siddhi-core-5.1.21.jar:?]
	at io.siddhi.extension.map.keyvalue.sourcemapper.KeyValueSourceMapperTestCase.keyvalueSourceMapperDefaultTest8(KeyValueSourceMapperTestCase.java:996) [test-classes/:?]
	at sun.reflect.NativeMethodAccessorImpl.invoke0(Native Method) ~[?:1.8.0_171]
	at sun.reflect.NativeMethodAccessorImpl.invoke(NativeMethodAccessorImpl.java:62) ~[?:1.8.0_171]
	at sun.reflect.DelegatingMethodAccessorImpl.invoke(DelegatingMethodAccessorImpl.java:43) ~[?:1.8.0_171]
	at java.lang.reflect.Method.invoke(Method.java:498) ~[?:1.8.0_171]
	at org.testng.internal.MethodInvocationHelper.invokeMethod(MethodInvocationHelper.java:108) [testng-6.11.jar:?]
	at org.testng.internal.Invoker.invokeMethod(Invoker.java:661) [testng-6.11.jar:?]
	at org.testng.internal.Invoker.invokeTestMethod(Invoker.java:869) [testng-6.11.jar:?]
	at org.testng.internal.Invoker.invokeTestMethods(Invoker.java:1193) [testng-6.11.jar:?]
	at org.testng.internal.TestMethodWorker.invokeTestMethods(TestMethodWorker.java:126) [testng-6.11.jar:?]
	at org.testng.internal.TestMethodWorker.run(TestMethodWorker.java:109) [testng-6.11.jar:?]
	at org.testng.TestRunner.privateRun(TestRunner.java:744) [testng-6.11.jar:?]
	at org.testng.TestRunner.run(TestRunner.java:602) [testng-6.11.jar:?]
	at org.testng.SuiteRunner.runTest(SuiteRunner.java:380) [testng-6.11.jar:?]
	at org.testng.SuiteRunner.runSequentially(SuiteRunner.java:375) [testng-6.11.jar:?]
	at org.testng.SuiteRunner.privateRun(SuiteRunner.java:340) [testng-6.11.jar:?]
	at org.testng.SuiteRunner.run(SuiteRunner.java:289) [testng-6.11.jar:?]
	at org.testng.SuiteRunnerWorker.runSuite(SuiteRunnerWorker.java:52) [testng-6.11.jar:?]
	at org.testng.SuiteRunnerWorker.run(SuiteRunnerWorker.java:86) [testng-6.11.jar:?]
	at org.testng.TestNG.runSuitesSequentially(TestNG.java:1301) [testng-6.11.jar:?]
	at org.testng.TestNG.runSuitesLocally(TestNG.java:1226) [testng-6.11.jar:?]
	at org.testng.TestNG.runSuites(TestNG.java:1144) [testng-6.11.jar:?]
	at org.testng.TestNG.run(TestNG.java:1115) [testng-6.11.jar:?]
	at org.apache.maven.surefire.testng.TestNGExecutor.run(TestNGExecutor.java:281) [surefire-testng-2.19.1.jar:2.19.1]
	at org.apache.maven.surefire.testng.TestNGXmlTestSuite.execute(TestNGXmlTestSuite.java:75) [surefire-testng-2.19.1.jar:2.19.1]
	at org.apache.maven.surefire.testng.TestNGProvider.invoke(TestNGProvider.java:121) [surefire-testng-2.19.1.jar:2.19.1]
	at org.apache.maven.surefire.booter.ForkedBooter.invokeProviderInSameClassLoader(ForkedBooter.java:290) [surefire-booter-2.19.1.jar:2.19.1]
	at org.apache.maven.surefire.booter.ForkedBooter.runSuitesInProcess(ForkedBooter.java:242) [surefire-booter-2.19.1.jar:2.19.1]
	at org.apache.maven.surefire.booter.ForkedBooter.main(ForkedBooter.java:121) [surefire-booter-2.19.1.jar:2.19.1]
[main] ERROR io.siddhi.extension.map.keyvalue.sourcemapper.KeyValueSourceMapper [] - Stream "FooStream" has an attribute named "price", but the received event {volume=100, symbol=9004, price=55.678} does not has a value for that attribute. Hence dropping the message.
[main] ERROR io.siddhi.core.stream.input.source.SourceMapper [] - Error while processing '{volume=100, symbol=9004, price=55.678}', for the input Mapping 'keyvalue' for the stream 'FooStream'.
io.siddhi.core.exception.MappingFailedException: null
	at io.siddhi.extension.map.keyvalue.sourcemapper.KeyValueSourceMapper.mapAndProcess(KeyValueSourceMapper.java:172) ~[classes/:?]
	at io.siddhi.core.stream.input.source.SourceMapper.onEvent(SourceMapper.java:201) [siddhi-core-5.1.21.jar:?]
	at io.siddhi.core.stream.input.source.SourceMapper.onEvent(SourceMapper.java:145) [siddhi-core-5.1.21.jar:?]
	at io.siddhi.extension.map.keyvalue.sourcemapper.TestTrpInMemorySource$1.onMessage(TestTrpInMemorySource.java:79) [test-classes/:?]
	at io.siddhi.core.util.transport.InMemoryBroker$MessageBroker.broadcast(InMemoryBroker.java:110) [siddhi-core-5.1.21.jar:?]
	at io.siddhi.core.util.transport.InMemoryBroker$MessageBroker.publish(InMemoryBroker.java:118) [siddhi-core-5.1.21.jar:?]
	at io.siddhi.core.util.transport.InMemoryBroker.publish(InMemoryBroker.java:41) [siddhi-core-5.1.21.jar:?]
	at io.siddhi.extension.map.keyvalue.sourcemapper.KeyValueSourceMapperTestCase.keyvalueSourceMapperDefaultTest8(KeyValueSourceMapperTestCase.java:996) [test-classes/:?]
	at sun.reflect.NativeMethodAccessorImpl.invoke0(Native Method) ~[?:1.8.0_171]
	at sun.reflect.NativeMethodAccessorImpl.invoke(NativeMethodAccessorImpl.java:62) ~[?:1.8.0_171]
	at sun.reflect.DelegatingMethodAccessorImpl.invoke(DelegatingMethodAccessorImpl.java:43) ~[?:1.8.0_171]
	at java.lang.reflect.Method.invoke(Method.java:498) ~[?:1.8.0_171]
	at org.testng.internal.MethodInvocationHelper.invokeMethod(MethodInvocationHelper.java:108) [testng-6.11.jar:?]
	at org.testng.internal.Invoker.invokeMethod(Invoker.java:661) [testng-6.11.jar:?]
	at org.testng.internal.Invoker.invokeTestMethod(Invoker.java:869) [testng-6.11.jar:?]
	at org.testng.internal.Invoker.invokeTestMethods(Invoker.java:1193) [testng-6.11.jar:?]
	at org.testng.internal.TestMethodWorker.invokeTestMethods(TestMethodWorker.java:126) [testng-6.11.jar:?]
	at org.testng.internal.TestMethodWorker.run(TestMethodWorker.java:109) [testng-6.11.jar:?]
	at org.testng.TestRunner.privateRun(TestRunner.java:744) [testng-6.11.jar:?]
	at org.testng.TestRunner.run(TestRunner.java:602) [testng-6.11.jar:?]
	at org.testng.SuiteRunner.runTest(SuiteRunner.java:380) [testng-6.11.jar:?]
	at org.testng.SuiteRunner.runSequentially(SuiteRunner.java:375) [testng-6.11.jar:?]
	at org.testng.SuiteRunner.privateRun(SuiteRunner.java:340) [testng-6.11.jar:?]
	at org.testng.SuiteRunner.run(SuiteRunner.java:289) [testng-6.11.jar:?]
	at org.testng.SuiteRunnerWorker.runSuite(SuiteRunnerWorker.java:52) [testng-6.11.jar:?]
	at org.testng.SuiteRunnerWorker.run(SuiteRunnerWorker.java:86) [testng-6.11.jar:?]
	at org.testng.TestNG.runSuitesSequentially(TestNG.java:1301) [testng-6.11.jar:?]
	at org.testng.TestNG.runSuitesLocally(TestNG.java:1226) [testng-6.11.jar:?]
	at org.testng.TestNG.runSuites(TestNG.java:1144) [testng-6.11.jar:?]
	at org.testng.TestNG.run(TestNG.java:1115) [testng-6.11.jar:?]
	at org.apache.maven.surefire.testng.TestNGExecutor.run(TestNGExecutor.java:281) [surefire-testng-2.19.1.jar:2.19.1]
	at org.apache.maven.surefire.testng.TestNGXmlTestSuite.execute(TestNGXmlTestSuite.java:75) [surefire-testng-2.19.1.jar:2.19.1]
	at org.apache.maven.surefire.testng.TestNGProvider.invoke(TestNGProvider.java:121) [surefire-testng-2.19.1.jar:2.19.1]
	at org.apache.maven.surefire.booter.ForkedBooter.invokeProviderInSameClassLoader(ForkedBooter.java:290) [surefire-booter-2.19.1.jar:2.19.1]
	at org.apache.maven.surefire.booter.ForkedBooter.runSuitesInProcess(ForkedBooter.java:242) [surefire-booter-2.19.1.jar:2.19.1]
	at org.apache.maven.surefire.booter.ForkedBooter.main(ForkedBooter.java:121) [surefire-booter-2.19.1.jar:2.19.1]
[main] ERROR io.siddhi.extension.map.keyvalue.sourcemapper.KeyValueSourceMapper [] - Stream "FooStream" has an attribute named "price", but the received event {volume=100, symbol=9004, price=55.678} does not has a value for that attribute. Hence dropping the message.
[main] ERROR io.siddhi.core.stream.input.source.SourceMapper [] - Error while processing '{volume=100, symbol=9004, price=55.678}', for the input Mapping 'keyvalue' for the stream 'FooStream'.
io.siddhi.core.exception.MappingFailedException: null
	at io.siddhi.extension.map.keyvalue.sourcemapper.KeyValueSourceMapper.mapAndProcess(KeyValueSourceMapper.java:172) ~[classes/:?]
	at io.siddhi.core.stream.input.source.SourceMapper.onEvent(SourceMapper.java:201) [siddhi-core-5.1.21.jar:?]
	at io.siddhi.core.stream.input.source.SourceMapper.onEvent(SourceMapper.java:145) [siddhi-core-5.1.21.jar:?]
	at io.siddhi.extension.map.keyvalue.sourcemapper.TestTrpInMemorySource$1.onMessage(TestTrpInMemorySource.java:79) [test-classes/:?]
	at io.siddhi.core.util.transport.InMemoryBroker$MessageBroker.broadcast(InMemoryBroker.java:110) [siddhi-core-5.1.21.jar:?]
	at io.siddhi.core.util.transport.InMemoryBroker$MessageBroker.publish(InMemoryBroker.java:118) [siddhi-core-5.1.21.jar:?]
	at io.siddhi.core.util.transport.InMemoryBroker.publish(InMemoryBroker.java:41) [siddhi-core-5.1.21.jar:?]
	at io.siddhi.extension.map.keyvalue.sourcemapper.KeyValueSourceMapperTestCase.keyvalueSourceMapperDefaultTest8(KeyValueSourceMapperTestCase.java:996) [test-classes/:?]
	at sun.reflect.NativeMethodAccessorImpl.invoke0(Native Method) ~[?:1.8.0_171]
	at sun.reflect.NativeMethodAccessorImpl.invoke(NativeMethodAccessorImpl.java:62) ~[?:1.8.0_171]
	at sun.reflect.DelegatingMethodAccessorImpl.invoke(DelegatingMethodAccessorImpl.java:43) ~[?:1.8.0_171]
	at java.lang.reflect.Method.invoke(Method.java:498) ~[?:1.8.0_171]
	at org.testng.internal.MethodInvocationHelper.invokeMethod(MethodInvocationHelper.java:108) [testng-6.11.jar:?]
	at org.testng.internal.Invoker.invokeMethod(Invoker.java:661) [testng-6.11.jar:?]
	at org.testng.internal.Invoker.invokeTestMethod(Invoker.java:869) [testng-6.11.jar:?]
	at org.testng.internal.Invoker.invokeTestMethods(Invoker.java:1193) [testng-6.11.jar:?]
	at org.testng.internal.TestMethodWorker.invokeTestMethods(TestMethodWorker.java:126) [testng-6.11.jar:?]
	at org.testng.internal.TestMethodWorker.run(TestMethodWorker.java:109) [testng-6.11.jar:?]
	at org.testng.TestRunner.privateRun(TestRunner.java:744) [testng-6.11.jar:?]
	at org.testng.TestRunner.run(TestRunner.java:602) [testng-6.11.jar:?]
	at org.testng.SuiteRunner.runTest(SuiteRunner.java:380) [testng-6.11.jar:?]
	at org.testng.SuiteRunner.runSequentially(SuiteRunner.java:375) [testng-6.11.jar:?]
	at org.testng.SuiteRunner.privateRun(SuiteRunner.java:340) [testng-6.11.jar:?]
	at org.testng.SuiteRunner.run(SuiteRunner.java:289) [testng-6.11.jar:?]
	at org.testng.SuiteRunnerWorker.runSuite(SuiteRunnerWorker.java:52) [testng-6.11.jar:?]
	at org.testng.SuiteRunnerWorker.run(SuiteRunnerWorker.java:86) [testng-6.11.jar:?]
	at org.testng.TestNG.runSuitesSequentially(TestNG.java:1301) [testng-6.11.jar:?]
	at org.testng.TestNG.runSuitesLocally(TestNG.java:1226) [testng-6.11.jar:?]
	at org.testng.TestNG.runSuites(TestNG.java:1144) [testng-6.11.jar:?]
	at org.testng.TestNG.run(TestNG.java:1115) [testng-6.11.jar:?]
	at org.apache.maven.surefire.testng.TestNGExecutor.run(TestNGExecutor.java:281) [surefire-testng-2.19.1.jar:2.19.1]
	at org.apache.maven.surefire.testng.TestNGXmlTestSuite.execute(TestNGXmlTestSuite.java:75) [surefire-testng-2.19.1.jar:2.19.1]
	at org.apache.maven.surefire.testng.TestNGProvider.invoke(TestNGProvider.java:121) [surefire-testng-2.19.1.jar:2.19.1]
	at org.apache.maven.surefire.booter.ForkedBooter.invokeProviderInSameClassLoader(ForkedBooter.java:290) [surefire-booter-2.19.1.jar:2.19.1]
	at org.apache.maven.surefire.booter.ForkedBooter.runSuitesInProcess(ForkedBooter.java:242) [surefire-booter-2.19.1.jar:2.19.1]
	at org.apache.maven.surefire.booter.ForkedBooter.main(ForkedBooter.java:121) [surefire-booter-2.19.1.jar:2.19.1]
[main] INFO  io.siddhi.core.util.EventPrinter [] - [Event{timestamp=1644933184125, data=[9004, 55.678, 100], isExpired=false}]
[main] INFO  io.siddhi.extension.map.keyvalue.sourcemapper.KeyValueSourceMapperTestCase [] - KeyValueSourceMapper-Forcefully-Cast-Attributes-Test
[main] ERROR io.siddhi.extension.map.keyvalue.sourcemapper.KeyValueSourceMapper [] - Stream "FooStream" has an attribute named "price", but the received event {volume=100, symbol=9001, price=55.6} does not has a value for that attribute. Hence dropping the message.
[main] ERROR io.siddhi.core.stream.input.source.SourceMapper [] - Error while processing '{volume=100, symbol=9001, price=55.6}', for the input Mapping 'keyvalue' for the stream 'FooStream'.
io.siddhi.core.exception.MappingFailedException: null
	at io.siddhi.extension.map.keyvalue.sourcemapper.KeyValueSourceMapper.mapAndProcess(KeyValueSourceMapper.java:172) ~[classes/:?]
	at io.siddhi.core.stream.input.source.SourceMapper.onEvent(SourceMapper.java:201) [siddhi-core-5.1.21.jar:?]
	at io.siddhi.core.stream.input.source.SourceMapper.onEvent(SourceMapper.java:145) [siddhi-core-5.1.21.jar:?]
	at io.siddhi.extension.map.keyvalue.sourcemapper.TestTrpInMemorySource$1.onMessage(TestTrpInMemorySource.java:79) [test-classes/:?]
	at io.siddhi.core.util.transport.InMemoryBroker$MessageBroker.broadcast(InMemoryBroker.java:110) [siddhi-core-5.1.21.jar:?]
	at io.siddhi.core.util.transport.InMemoryBroker$MessageBroker.publish(InMemoryBroker.java:118) [siddhi-core-5.1.21.jar:?]
	at io.siddhi.core.util.transport.InMemoryBroker.publish(InMemoryBroker.java:41) [siddhi-core-5.1.21.jar:?]
	at io.siddhi.extension.map.keyvalue.sourcemapper.KeyValueSourceMapperTestCase.keyvalueSourceMapperDefaultTest9(KeyValueSourceMapperTestCase.java:1056) [test-classes/:?]
	at sun.reflect.NativeMethodAccessorImpl.invoke0(Native Method) ~[?:1.8.0_171]
	at sun.reflect.NativeMethodAccessorImpl.invoke(NativeMethodAccessorImpl.java:62) ~[?:1.8.0_171]
	at sun.reflect.DelegatingMethodAccessorImpl.invoke(DelegatingMethodAccessorImpl.java:43) ~[?:1.8.0_171]
	at java.lang.reflect.Method.invoke(Method.java:498) ~[?:1.8.0_171]
	at org.testng.internal.MethodInvocationHelper.invokeMethod(MethodInvocationHelper.java:108) [testng-6.11.jar:?]
	at org.testng.internal.Invoker.invokeMethod(Invoker.java:661) [testng-6.11.jar:?]
	at org.testng.internal.Invoker.invokeTestMethod(Invoker.java:869) [testng-6.11.jar:?]
	at org.testng.internal.Invoker.invokeTestMethods(Invoker.java:1193) [testng-6.11.jar:?]
	at org.testng.internal.TestMethodWorker.invokeTestMethods(TestMethodWorker.java:126) [testng-6.11.jar:?]
	at org.testng.internal.TestMethodWorker.run(TestMethodWorker.java:109) [testng-6.11.jar:?]
	at org.testng.TestRunner.privateRun(TestRunner.java:744) [testng-6.11.jar:?]
	at org.testng.TestRunner.run(TestRunner.java:602) [testng-6.11.jar:?]
	at org.testng.SuiteRunner.runTest(SuiteRunner.java:380) [testng-6.11.jar:?]
	at org.testng.SuiteRunner.runSequentially(SuiteRunner.java:375) [testng-6.11.jar:?]
	at org.testng.SuiteRunner.privateRun(SuiteRunner.java:340) [testng-6.11.jar:?]
	at org.testng.SuiteRunner.run(SuiteRunner.java:289) [testng-6.11.jar:?]
	at org.testng.SuiteRunnerWorker.runSuite(SuiteRunnerWorker.java:52) [testng-6.11.jar:?]
	at org.testng.SuiteRunnerWorker.run(SuiteRunnerWorker.java:86) [testng-6.11.jar:?]
	at org.testng.TestNG.runSuitesSequentially(TestNG.java:1301) [testng-6.11.jar:?]
	at org.testng.TestNG.runSuitesLocally(TestNG.java:1226) [testng-6.11.jar:?]
	at org.testng.TestNG.runSuites(TestNG.java:1144) [testng-6.11.jar:?]
	at org.testng.TestNG.run(TestNG.java:1115) [testng-6.11.jar:?]
	at org.apache.maven.surefire.testng.TestNGExecutor.run(TestNGExecutor.java:281) [surefire-testng-2.19.1.jar:2.19.1]
	at org.apache.maven.surefire.testng.TestNGXmlTestSuite.execute(TestNGXmlTestSuite.java:75) [surefire-testng-2.19.1.jar:2.19.1]
	at org.apache.maven.surefire.testng.TestNGProvider.invoke(TestNGProvider.java:121) [surefire-testng-2.19.1.jar:2.19.1]
	at org.apache.maven.surefire.booter.ForkedBooter.invokeProviderInSameClassLoader(ForkedBooter.java:290) [surefire-booter-2.19.1.jar:2.19.1]
	at org.apache.maven.surefire.booter.ForkedBooter.runSuitesInProcess(ForkedBooter.java:242) [surefire-booter-2.19.1.jar:2.19.1]
	at org.apache.maven.surefire.booter.ForkedBooter.main(ForkedBooter.java:121) [surefire-booter-2.19.1.jar:2.19.1]
[main] ERROR io.siddhi.extension.map.keyvalue.sourcemapper.KeyValueSourceMapper [] - Stream "FooStream" has an attribute named "price", but the received event {volume=100, symbol=9001, price=55.6} does not has a value for that attribute. Hence dropping the message.
[main] ERROR io.siddhi.core.stream.input.source.SourceMapper [] - Error while processing '{volume=100, symbol=9001, price=55.6}', for the input Mapping 'keyvalue' for the stream 'FooStream'.
io.siddhi.core.exception.MappingFailedException: null
	at io.siddhi.extension.map.keyvalue.sourcemapper.KeyValueSourceMapper.mapAndProcess(KeyValueSourceMapper.java:172) ~[classes/:?]
	at io.siddhi.core.stream.input.source.SourceMapper.onEvent(SourceMapper.java:201) [siddhi-core-5.1.21.jar:?]
	at io.siddhi.core.stream.input.source.SourceMapper.onEvent(SourceMapper.java:145) [siddhi-core-5.1.21.jar:?]
	at io.siddhi.extension.map.keyvalue.sourcemapper.TestTrpInMemorySource$1.onMessage(TestTrpInMemorySource.java:79) [test-classes/:?]
	at io.siddhi.core.util.transport.InMemoryBroker$MessageBroker.broadcast(InMemoryBroker.java:110) [siddhi-core-5.1.21.jar:?]
	at io.siddhi.core.util.transport.InMemoryBroker$MessageBroker.publish(InMemoryBroker.java:118) [siddhi-core-5.1.21.jar:?]
	at io.siddhi.core.util.transport.InMemoryBroker.publish(InMemoryBroker.java:41) [siddhi-core-5.1.21.jar:?]
	at io.siddhi.extension.map.keyvalue.sourcemapper.KeyValueSourceMapperTestCase.keyvalueSourceMapperDefaultTest9(KeyValueSourceMapperTestCase.java:1056) [test-classes/:?]
	at sun.reflect.NativeMethodAccessorImpl.invoke0(Native Method) ~[?:1.8.0_171]
	at sun.reflect.NativeMethodAccessorImpl.invoke(NativeMethodAccessorImpl.java:62) ~[?:1.8.0_171]
	at sun.reflect.DelegatingMethodAccessorImpl.invoke(DelegatingMethodAccessorImpl.java:43) ~[?:1.8.0_171]
	at java.lang.reflect.Method.invoke(Method.java:498) ~[?:1.8.0_171]
	at org.testng.internal.MethodInvocationHelper.invokeMethod(MethodInvocationHelper.java:108) [testng-6.11.jar:?]
	at org.testng.internal.Invoker.invokeMethod(Invoker.java:661) [testng-6.11.jar:?]
	at org.testng.internal.Invoker.invokeTestMethod(Invoker.java:869) [testng-6.11.jar:?]
	at org.testng.internal.Invoker.invokeTestMethods(Invoker.java:1193) [testng-6.11.jar:?]
	at org.testng.internal.TestMethodWorker.invokeTestMethods(TestMethodWorker.java:126) [testng-6.11.jar:?]
	at org.testng.internal.TestMethodWorker.run(TestMethodWorker.java:109) [testng-6.11.jar:?]
	at org.testng.TestRunner.privateRun(TestRunner.java:744) [testng-6.11.jar:?]
	at org.testng.TestRunner.run(TestRunner.java:602) [testng-6.11.jar:?]
	at org.testng.SuiteRunner.runTest(SuiteRunner.java:380) [testng-6.11.jar:?]
	at org.testng.SuiteRunner.runSequentially(SuiteRunner.java:375) [testng-6.11.jar:?]
	at org.testng.SuiteRunner.privateRun(SuiteRunner.java:340) [testng-6.11.jar:?]
	at org.testng.SuiteRunner.run(SuiteRunner.java:289) [testng-6.11.jar:?]
	at org.testng.SuiteRunnerWorker.runSuite(SuiteRunnerWorker.java:52) [testng-6.11.jar:?]
	at org.testng.SuiteRunnerWorker.run(SuiteRunnerWorker.java:86) [testng-6.11.jar:?]
	at org.testng.TestNG.runSuitesSequentially(TestNG.java:1301) [testng-6.11.jar:?]
	at org.testng.TestNG.runSuitesLocally(TestNG.java:1226) [testng-6.11.jar:?]
	at org.testng.TestNG.runSuites(TestNG.java:1144) [testng-6.11.jar:?]
	at org.testng.TestNG.run(TestNG.java:1115) [testng-6.11.jar:?]
	at org.apache.maven.surefire.testng.TestNGExecutor.run(TestNGExecutor.java:281) [surefire-testng-2.19.1.jar:2.19.1]
	at org.apache.maven.surefire.testng.TestNGXmlTestSuite.execute(TestNGXmlTestSuite.java:75) [surefire-testng-2.19.1.jar:2.19.1]
	at org.apache.maven.surefire.testng.TestNGProvider.invoke(TestNGProvider.java:121) [surefire-testng-2.19.1.jar:2.19.1]
	at org.apache.maven.surefire.booter.ForkedBooter.invokeProviderInSameClassLoader(ForkedBooter.java:290) [surefire-booter-2.19.1.jar:2.19.1]
	at org.apache.maven.surefire.booter.ForkedBooter.runSuitesInProcess(ForkedBooter.java:242) [surefire-booter-2.19.1.jar:2.19.1]
	at org.apache.maven.surefire.booter.ForkedBooter.main(ForkedBooter.java:121) [surefire-booter-2.19.1.jar:2.19.1]
[main] ERROR io.siddhi.extension.map.keyvalue.sourcemapper.KeyValueSourceMapper [] - Stream "FooStream" has an attribute named "price", but the received event {volume=100, symbol=9001, price=55.6} does not has a value for that attribute. Hence dropping the message.
[main] ERROR io.siddhi.core.stream.input.source.SourceMapper [] - Error while processing '{volume=100, symbol=9001, price=55.6}', for the input Mapping 'keyvalue' for the stream 'FooStream'.
io.siddhi.core.exception.MappingFailedException: null
	at io.siddhi.extension.map.keyvalue.sourcemapper.KeyValueSourceMapper.mapAndProcess(KeyValueSourceMapper.java:172) ~[classes/:?]
	at io.siddhi.core.stream.input.source.SourceMapper.onEvent(SourceMapper.java:201) [siddhi-core-5.1.21.jar:?]
	at io.siddhi.core.stream.input.source.SourceMapper.onEvent(SourceMapper.java:145) [siddhi-core-5.1.21.jar:?]
	at io.siddhi.extension.map.keyvalue.sourcemapper.TestTrpInMemorySource$1.onMessage(TestTrpInMemorySource.java:79) [test-classes/:?]
	at io.siddhi.core.util.transport.InMemoryBroker$MessageBroker.broadcast(InMemoryBroker.java:110) [siddhi-core-5.1.21.jar:?]
	at io.siddhi.core.util.transport.InMemoryBroker$MessageBroker.publish(InMemoryBroker.java:118) [siddhi-core-5.1.21.jar:?]
	at io.siddhi.core.util.transport.InMemoryBroker.publish(InMemoryBroker.java:41) [siddhi-core-5.1.21.jar:?]
	at io.siddhi.extension.map.keyvalue.sourcemapper.KeyValueSourceMapperTestCase.keyvalueSourceMapperDefaultTest9(KeyValueSourceMapperTestCase.java:1056) [test-classes/:?]
	at sun.reflect.NativeMethodAccessorImpl.invoke0(Native Method) ~[?:1.8.0_171]
	at sun.reflect.NativeMethodAccessorImpl.invoke(NativeMethodAccessorImpl.java:62) ~[?:1.8.0_171]
	at sun.reflect.DelegatingMethodAccessorImpl.invoke(DelegatingMethodAccessorImpl.java:43) ~[?:1.8.0_171]
	at java.lang.reflect.Method.invoke(Method.java:498) ~[?:1.8.0_171]
	at org.testng.internal.MethodInvocationHelper.invokeMethod(MethodInvocationHelper.java:108) [testng-6.11.jar:?]
	at org.testng.internal.Invoker.invokeMethod(Invoker.java:661) [testng-6.11.jar:?]
	at org.testng.internal.Invoker.invokeTestMethod(Invoker.java:869) [testng-6.11.jar:?]
	at org.testng.internal.Invoker.invokeTestMethods(Invoker.java:1193) [testng-6.11.jar:?]
	at org.testng.internal.TestMethodWorker.invokeTestMethods(TestMethodWorker.java:126) [testng-6.11.jar:?]
	at org.testng.internal.TestMethodWorker.run(TestMethodWorker.java:109) [testng-6.11.jar:?]
	at org.testng.TestRunner.privateRun(TestRunner.java:744) [testng-6.11.jar:?]
	at org.testng.TestRunner.run(TestRunner.java:602) [testng-6.11.jar:?]
	at org.testng.SuiteRunner.runTest(SuiteRunner.java:380) [testng-6.11.jar:?]
	at org.testng.SuiteRunner.runSequentially(SuiteRunner.java:375) [testng-6.11.jar:?]
	at org.testng.SuiteRunner.privateRun(SuiteRunner.java:340) [testng-6.11.jar:?]
	at org.testng.SuiteRunner.run(SuiteRunner.java:289) [testng-6.11.jar:?]
	at org.testng.SuiteRunnerWorker.runSuite(SuiteRunnerWorker.java:52) [testng-6.11.jar:?]
	at org.testng.SuiteRunnerWorker.run(SuiteRunnerWorker.java:86) [testng-6.11.jar:?]
	at org.testng.TestNG.runSuitesSequentially(TestNG.java:1301) [testng-6.11.jar:?]
	at org.testng.TestNG.runSuitesLocally(TestNG.java:1226) [testng-6.11.jar:?]
	at org.testng.TestNG.runSuites(TestNG.java:1144) [testng-6.11.jar:?]
	at org.testng.TestNG.run(TestNG.java:1115) [testng-6.11.jar:?]
	at org.apache.maven.surefire.testng.TestNGExecutor.run(TestNGExecutor.java:281) [surefire-testng-2.19.1.jar:2.19.1]
	at org.apache.maven.surefire.testng.TestNGXmlTestSuite.execute(TestNGXmlTestSuite.java:75) [surefire-testng-2.19.1.jar:2.19.1]
	at org.apache.maven.surefire.testng.TestNGProvider.invoke(TestNGProvider.java:121) [surefire-testng-2.19.1.jar:2.19.1]
	at org.apache.maven.surefire.booter.ForkedBooter.invokeProviderInSameClassLoader(ForkedBooter.java:290) [surefire-booter-2.19.1.jar:2.19.1]
	at org.apache.maven.surefire.booter.ForkedBooter.runSuitesInProcess(ForkedBooter.java:242) [surefire-booter-2.19.1.jar:2.19.1]
	at org.apache.maven.surefire.booter.ForkedBooter.main(ForkedBooter.java:121) [surefire-booter-2.19.1.jar:2.19.1]
[main] INFO  io.siddhi.core.util.EventPrinter [] - [Event{timestamp=1644933184130, data=[9001, 55.6, 100], isExpired=false}]
[main] ERROR io.siddhi.extension.map.keyvalue.sourcemapper.KeyValueSourceMapper [] - Stream "FooStream" has an attribute named "price", but the received event {volume=100, symbol=9002, price=55.678} does not has a value for that attribute. Hence dropping the message.
[main] ERROR io.siddhi.core.stream.input.source.SourceMapper [] - Error while processing '{volume=100, symbol=9002, price=55.678}', for the input Mapping 'keyvalue' for the stream 'FooStream'.
io.siddhi.core.exception.MappingFailedException: null
	at io.siddhi.extension.map.keyvalue.sourcemapper.KeyValueSourceMapper.mapAndProcess(KeyValueSourceMapper.java:172) ~[classes/:?]
	at io.siddhi.core.stream.input.source.SourceMapper.onEvent(SourceMapper.java:201) [siddhi-core-5.1.21.jar:?]
	at io.siddhi.core.stream.input.source.SourceMapper.onEvent(SourceMapper.java:145) [siddhi-core-5.1.21.jar:?]
	at io.siddhi.extension.map.keyvalue.sourcemapper.TestTrpInMemorySource$1.onMessage(TestTrpInMemorySource.java:79) [test-classes/:?]
	at io.siddhi.core.util.transport.InMemoryBroker$MessageBroker.broadcast(InMemoryBroker.java:110) [siddhi-core-5.1.21.jar:?]
	at io.siddhi.core.util.transport.InMemoryBroker$MessageBroker.publish(InMemoryBroker.java:118) [siddhi-core-5.1.21.jar:?]
	at io.siddhi.core.util.transport.InMemoryBroker.publish(InMemoryBroker.java:41) [siddhi-core-5.1.21.jar:?]
	at io.siddhi.extension.map.keyvalue.sourcemapper.KeyValueSourceMapperTestCase.keyvalueSourceMapperDefaultTest9(KeyValueSourceMapperTestCase.java:1062) [test-classes/:?]
	at sun.reflect.NativeMethodAccessorImpl.invoke0(Native Method) ~[?:1.8.0_171]
	at sun.reflect.NativeMethodAccessorImpl.invoke(NativeMethodAccessorImpl.java:62) ~[?:1.8.0_171]
	at sun.reflect.DelegatingMethodAccessorImpl.invoke(DelegatingMethodAccessorImpl.java:43) ~[?:1.8.0_171]
	at java.lang.reflect.Method.invoke(Method.java:498) ~[?:1.8.0_171]
	at org.testng.internal.MethodInvocationHelper.invokeMethod(MethodInvocationHelper.java:108) [testng-6.11.jar:?]
	at org.testng.internal.Invoker.invokeMethod(Invoker.java:661) [testng-6.11.jar:?]
	at org.testng.internal.Invoker.invokeTestMethod(Invoker.java:869) [testng-6.11.jar:?]
	at org.testng.internal.Invoker.invokeTestMethods(Invoker.java:1193) [testng-6.11.jar:?]
	at org.testng.internal.TestMethodWorker.invokeTestMethods(TestMethodWorker.java:126) [testng-6.11.jar:?]
	at org.testng.internal.TestMethodWorker.run(TestMethodWorker.java:109) [testng-6.11.jar:?]
	at org.testng.TestRunner.privateRun(TestRunner.java:744) [testng-6.11.jar:?]
	at org.testng.TestRunner.run(TestRunner.java:602) [testng-6.11.jar:?]
	at org.testng.SuiteRunner.runTest(SuiteRunner.java:380) [testng-6.11.jar:?]
	at org.testng.SuiteRunner.runSequentially(SuiteRunner.java:375) [testng-6.11.jar:?]
	at org.testng.SuiteRunner.privateRun(SuiteRunner.java:340) [testng-6.11.jar:?]
	at org.testng.SuiteRunner.run(SuiteRunner.java:289) [testng-6.11.jar:?]
	at org.testng.SuiteRunnerWorker.runSuite(SuiteRunnerWorker.java:52) [testng-6.11.jar:?]
	at org.testng.SuiteRunnerWorker.run(SuiteRunnerWorker.java:86) [testng-6.11.jar:?]
	at org.testng.TestNG.runSuitesSequentially(TestNG.java:1301) [testng-6.11.jar:?]
	at org.testng.TestNG.runSuitesLocally(TestNG.java:1226) [testng-6.11.jar:?]
	at org.testng.TestNG.runSuites(TestNG.java:1144) [testng-6.11.jar:?]
	at org.testng.TestNG.run(TestNG.java:1115) [testng-6.11.jar:?]
	at org.apache.maven.surefire.testng.TestNGExecutor.run(TestNGExecutor.java:281) [surefire-testng-2.19.1.jar:2.19.1]
	at org.apache.maven.surefire.testng.TestNGXmlTestSuite.execute(TestNGXmlTestSuite.java:75) [surefire-testng-2.19.1.jar:2.19.1]
	at org.apache.maven.surefire.testng.TestNGProvider.invoke(TestNGProvider.java:121) [surefire-testng-2.19.1.jar:2.19.1]
	at org.apache.maven.surefire.booter.ForkedBooter.invokeProviderInSameClassLoader(ForkedBooter.java:290) [surefire-booter-2.19.1.jar:2.19.1]
	at org.apache.maven.surefire.booter.ForkedBooter.runSuitesInProcess(ForkedBooter.java:242) [surefire-booter-2.19.1.jar:2.19.1]
	at org.apache.maven.surefire.booter.ForkedBooter.main(ForkedBooter.java:121) [surefire-booter-2.19.1.jar:2.19.1]
[main] ERROR io.siddhi.extension.map.keyvalue.sourcemapper.KeyValueSourceMapper [] - Stream "FooStream" has an attribute named "price", but the received event {volume=100, symbol=9002, price=55.678} does not has a value for that attribute. Hence dropping the message.
[main] ERROR io.siddhi.core.stream.input.source.SourceMapper [] - Error while processing '{volume=100, symbol=9002, price=55.678}', for the input Mapping 'keyvalue' for the stream 'FooStream'.
io.siddhi.core.exception.MappingFailedException: null
	at io.siddhi.extension.map.keyvalue.sourcemapper.KeyValueSourceMapper.mapAndProcess(KeyValueSourceMapper.java:172) ~[classes/:?]
	at io.siddhi.core.stream.input.source.SourceMapper.onEvent(SourceMapper.java:201) [siddhi-core-5.1.21.jar:?]
	at io.siddhi.core.stream.input.source.SourceMapper.onEvent(SourceMapper.java:145) [siddhi-core-5.1.21.jar:?]
	at io.siddhi.extension.map.keyvalue.sourcemapper.TestTrpInMemorySource$1.onMessage(TestTrpInMemorySource.java:79) [test-classes/:?]
	at io.siddhi.core.util.transport.InMemoryBroker$MessageBroker.broadcast(InMemoryBroker.java:110) [siddhi-core-5.1.21.jar:?]
	at io.siddhi.core.util.transport.InMemoryBroker$MessageBroker.publish(InMemoryBroker.java:118) [siddhi-core-5.1.21.jar:?]
	at io.siddhi.core.util.transport.InMemoryBroker.publish(InMemoryBroker.java:41) [siddhi-core-5.1.21.jar:?]
	at io.siddhi.extension.map.keyvalue.sourcemapper.KeyValueSourceMapperTestCase.keyvalueSourceMapperDefaultTest9(KeyValueSourceMapperTestCase.java:1062) [test-classes/:?]
	at sun.reflect.NativeMethodAccessorImpl.invoke0(Native Method) ~[?:1.8.0_171]
	at sun.reflect.NativeMethodAccessorImpl.invoke(NativeMethodAccessorImpl.java:62) ~[?:1.8.0_171]
	at sun.reflect.DelegatingMethodAccessorImpl.invoke(DelegatingMethodAccessorImpl.java:43) ~[?:1.8.0_171]
	at java.lang.reflect.Method.invoke(Method.java:498) ~[?:1.8.0_171]
	at org.testng.internal.MethodInvocationHelper.invokeMethod(MethodInvocationHelper.java:108) [testng-6.11.jar:?]
	at org.testng.internal.Invoker.invokeMethod(Invoker.java:661) [testng-6.11.jar:?]
	at org.testng.internal.Invoker.invokeTestMethod(Invoker.java:869) [testng-6.11.jar:?]
	at org.testng.internal.Invoker.invokeTestMethods(Invoker.java:1193) [testng-6.11.jar:?]
	at org.testng.internal.TestMethodWorker.invokeTestMethods(TestMethodWorker.java:126) [testng-6.11.jar:?]
	at org.testng.internal.TestMethodWorker.run(TestMethodWorker.java:109) [testng-6.11.jar:?]
	at org.testng.TestRunner.privateRun(TestRunner.java:744) [testng-6.11.jar:?]
	at org.testng.TestRunner.run(TestRunner.java:602) [testng-6.11.jar:?]
	at org.testng.SuiteRunner.runTest(SuiteRunner.java:380) [testng-6.11.jar:?]
	at org.testng.SuiteRunner.runSequentially(SuiteRunner.java:375) [testng-6.11.jar:?]
	at org.testng.SuiteRunner.privateRun(SuiteRunner.java:340) [testng-6.11.jar:?]
	at org.testng.SuiteRunner.run(SuiteRunner.java:289) [testng-6.11.jar:?]
	at org.testng.SuiteRunnerWorker.runSuite(SuiteRunnerWorker.java:52) [testng-6.11.jar:?]
	at org.testng.SuiteRunnerWorker.run(SuiteRunnerWorker.java:86) [testng-6.11.jar:?]
	at org.testng.TestNG.runSuitesSequentially(TestNG.java:1301) [testng-6.11.jar:?]
	at org.testng.TestNG.runSuitesLocally(TestNG.java:1226) [testng-6.11.jar:?]
	at org.testng.TestNG.runSuites(TestNG.java:1144) [testng-6.11.jar:?]
	at org.testng.TestNG.run(TestNG.java:1115) [testng-6.11.jar:?]
	at org.apache.maven.surefire.testng.TestNGExecutor.run(TestNGExecutor.java:281) [surefire-testng-2.19.1.jar:2.19.1]
	at org.apache.maven.surefire.testng.TestNGXmlTestSuite.execute(TestNGXmlTestSuite.java:75) [surefire-testng-2.19.1.jar:2.19.1]
	at org.apache.maven.surefire.testng.TestNGProvider.invoke(TestNGProvider.java:121) [surefire-testng-2.19.1.jar:2.19.1]
	at org.apache.maven.surefire.booter.ForkedBooter.invokeProviderInSameClassLoader(ForkedBooter.java:290) [surefire-booter-2.19.1.jar:2.19.1]
	at org.apache.maven.surefire.booter.ForkedBooter.runSuitesInProcess(ForkedBooter.java:242) [surefire-booter-2.19.1.jar:2.19.1]
	at org.apache.maven.surefire.booter.ForkedBooter.main(ForkedBooter.java:121) [surefire-booter-2.19.1.jar:2.19.1]
[main] ERROR io.siddhi.extension.map.keyvalue.sourcemapper.KeyValueSourceMapper [] - Stream "FooStream" has an attribute named "price", but the received event {volume=100, symbol=9002, price=55.678} does not has a value for that attribute. Hence dropping the message.
[main] ERROR io.siddhi.core.stream.input.source.SourceMapper [] - Error while processing '{volume=100, symbol=9002, price=55.678}', for the input Mapping 'keyvalue' for the stream 'FooStream'.
io.siddhi.core.exception.MappingFailedException: null
	at io.siddhi.extension.map.keyvalue.sourcemapper.KeyValueSourceMapper.mapAndProcess(KeyValueSourceMapper.java:172) ~[classes/:?]
	at io.siddhi.core.stream.input.source.SourceMapper.onEvent(SourceMapper.java:201) [siddhi-core-5.1.21.jar:?]
	at io.siddhi.core.stream.input.source.SourceMapper.onEvent(SourceMapper.java:145) [siddhi-core-5.1.21.jar:?]
	at io.siddhi.extension.map.keyvalue.sourcemapper.TestTrpInMemorySource$1.onMessage(TestTrpInMemorySource.java:79) [test-classes/:?]
	at io.siddhi.core.util.transport.InMemoryBroker$MessageBroker.broadcast(InMemoryBroker.java:110) [siddhi-core-5.1.21.jar:?]
	at io.siddhi.core.util.transport.InMemoryBroker$MessageBroker.publish(InMemoryBroker.java:118) [siddhi-core-5.1.21.jar:?]
	at io.siddhi.core.util.transport.InMemoryBroker.publish(InMemoryBroker.java:41) [siddhi-core-5.1.21.jar:?]
	at io.siddhi.extension.map.keyvalue.sourcemapper.KeyValueSourceMapperTestCase.keyvalueSourceMapperDefaultTest9(KeyValueSourceMapperTestCase.java:1062) [test-classes/:?]
	at sun.reflect.NativeMethodAccessorImpl.invoke0(Native Method) ~[?:1.8.0_171]
	at sun.reflect.NativeMethodAccessorImpl.invoke(NativeMethodAccessorImpl.java:62) ~[?:1.8.0_171]
	at sun.reflect.DelegatingMethodAccessorImpl.invoke(DelegatingMethodAccessorImpl.java:43) ~[?:1.8.0_171]
	at java.lang.reflect.Method.invoke(Method.java:498) ~[?:1.8.0_171]
	at org.testng.internal.MethodInvocationHelper.invokeMethod(MethodInvocationHelper.java:108) [testng-6.11.jar:?]
	at org.testng.internal.Invoker.invokeMethod(Invoker.java:661) [testng-6.11.jar:?]
	at org.testng.internal.Invoker.invokeTestMethod(Invoker.java:869) [testng-6.11.jar:?]
	at org.testng.internal.Invoker.invokeTestMethods(Invoker.java:1193) [testng-6.11.jar:?]
	at org.testng.internal.TestMethodWorker.invokeTestMethods(TestMethodWorker.java:126) [testng-6.11.jar:?]
	at org.testng.internal.TestMethodWorker.run(TestMethodWorker.java:109) [testng-6.11.jar:?]
	at org.testng.TestRunner.privateRun(TestRunner.java:744) [testng-6.11.jar:?]
	at org.testng.TestRunner.run(TestRunner.java:602) [testng-6.11.jar:?]
	at org.testng.SuiteRunner.runTest(SuiteRunner.java:380) [testng-6.11.jar:?]
	at org.testng.SuiteRunner.runSequentially(SuiteRunner.java:375) [testng-6.11.jar:?]
	at org.testng.SuiteRunner.privateRun(SuiteRunner.java:340) [testng-6.11.jar:?]
	at org.testng.SuiteRunner.run(SuiteRunner.java:289) [testng-6.11.jar:?]
	at org.testng.SuiteRunnerWorker.runSuite(SuiteRunnerWorker.java:52) [testng-6.11.jar:?]
	at org.testng.SuiteRunnerWorker.run(SuiteRunnerWorker.java:86) [testng-6.11.jar:?]
	at org.testng.TestNG.runSuitesSequentially(TestNG.java:1301) [testng-6.11.jar:?]
	at org.testng.TestNG.runSuitesLocally(TestNG.java:1226) [testng-6.11.jar:?]
	at org.testng.TestNG.runSuites(TestNG.java:1144) [testng-6.11.jar:?]
	at org.testng.TestNG.run(TestNG.java:1115) [testng-6.11.jar:?]
	at org.apache.maven.surefire.testng.TestNGExecutor.run(TestNGExecutor.java:281) [surefire-testng-2.19.1.jar:2.19.1]
	at org.apache.maven.surefire.testng.TestNGXmlTestSuite.execute(TestNGXmlTestSuite.java:75) [surefire-testng-2.19.1.jar:2.19.1]
	at org.apache.maven.surefire.testng.TestNGProvider.invoke(TestNGProvider.java:121) [surefire-testng-2.19.1.jar:2.19.1]
	at org.apache.maven.surefire.booter.ForkedBooter.invokeProviderInSameClassLoader(ForkedBooter.java:290) [surefire-booter-2.19.1.jar:2.19.1]
	at org.apache.maven.surefire.booter.ForkedBooter.runSuitesInProcess(ForkedBooter.java:242) [surefire-booter-2.19.1.jar:2.19.1]
	at org.apache.maven.surefire.booter.ForkedBooter.main(ForkedBooter.java:121) [surefire-booter-2.19.1.jar:2.19.1]
[main] INFO  io.siddhi.core.util.EventPrinter [] - [Event{timestamp=1644933184132, data=[9002, 55.678, 100], isExpired=false}]
[main] ERROR io.siddhi.extension.map.keyvalue.sourcemapper.KeyValueSourceMapper [] - Stream "FooStream" has an attribute named "price", but the received event {volume=100, symbol=9003, price=55.678} does not has a value for that attribute. Hence dropping the message.
[main] ERROR io.siddhi.core.stream.input.source.SourceMapper [] - Error while processing '{volume=100, symbol=9003, price=55.678}', for the input Mapping 'keyvalue' for the stream 'FooStream'.
io.siddhi.core.exception.MappingFailedException: null
	at io.siddhi.extension.map.keyvalue.sourcemapper.KeyValueSourceMapper.mapAndProcess(KeyValueSourceMapper.java:172) ~[classes/:?]
	at io.siddhi.core.stream.input.source.SourceMapper.onEvent(SourceMapper.java:201) [siddhi-core-5.1.21.jar:?]
	at io.siddhi.core.stream.input.source.SourceMapper.onEvent(SourceMapper.java:145) [siddhi-core-5.1.21.jar:?]
	at io.siddhi.extension.map.keyvalue.sourcemapper.TestTrpInMemorySource$1.onMessage(TestTrpInMemorySource.java:79) [test-classes/:?]
	at io.siddhi.core.util.transport.InMemoryBroker$MessageBroker.broadcast(InMemoryBroker.java:110) [siddhi-core-5.1.21.jar:?]
	at io.siddhi.core.util.transport.InMemoryBroker$MessageBroker.publish(InMemoryBroker.java:118) [siddhi-core-5.1.21.jar:?]
	at io.siddhi.core.util.transport.InMemoryBroker.publish(InMemoryBroker.java:41) [siddhi-core-5.1.21.jar:?]
	at io.siddhi.extension.map.keyvalue.sourcemapper.KeyValueSourceMapperTestCase.keyvalueSourceMapperDefaultTest9(KeyValueSourceMapperTestCase.java:1068) [test-classes/:?]
	at sun.reflect.NativeMethodAccessorImpl.invoke0(Native Method) ~[?:1.8.0_171]
	at sun.reflect.NativeMethodAccessorImpl.invoke(NativeMethodAccessorImpl.java:62) ~[?:1.8.0_171]
	at sun.reflect.DelegatingMethodAccessorImpl.invoke(DelegatingMethodAccessorImpl.java:43) ~[?:1.8.0_171]
	at java.lang.reflect.Method.invoke(Method.java:498) ~[?:1.8.0_171]
	at org.testng.internal.MethodInvocationHelper.invokeMethod(MethodInvocationHelper.java:108) [testng-6.11.jar:?]
	at org.testng.internal.Invoker.invokeMethod(Invoker.java:661) [testng-6.11.jar:?]
	at org.testng.internal.Invoker.invokeTestMethod(Invoker.java:869) [testng-6.11.jar:?]
	at org.testng.internal.Invoker.invokeTestMethods(Invoker.java:1193) [testng-6.11.jar:?]
	at org.testng.internal.TestMethodWorker.invokeTestMethods(TestMethodWorker.java:126) [testng-6.11.jar:?]
	at org.testng.internal.TestMethodWorker.run(TestMethodWorker.java:109) [testng-6.11.jar:?]
	at org.testng.TestRunner.privateRun(TestRunner.java:744) [testng-6.11.jar:?]
	at org.testng.TestRunner.run(TestRunner.java:602) [testng-6.11.jar:?]
	at org.testng.SuiteRunner.runTest(SuiteRunner.java:380) [testng-6.11.jar:?]
	at org.testng.SuiteRunner.runSequentially(SuiteRunner.java:375) [testng-6.11.jar:?]
	at org.testng.SuiteRunner.privateRun(SuiteRunner.java:340) [testng-6.11.jar:?]
	at org.testng.SuiteRunner.run(SuiteRunner.java:289) [testng-6.11.jar:?]
	at org.testng.SuiteRunnerWorker.runSuite(SuiteRunnerWorker.java:52) [testng-6.11.jar:?]
	at org.testng.SuiteRunnerWorker.run(SuiteRunnerWorker.java:86) [testng-6.11.jar:?]
	at org.testng.TestNG.runSuitesSequentially(TestNG.java:1301) [testng-6.11.jar:?]
	at org.testng.TestNG.runSuitesLocally(TestNG.java:1226) [testng-6.11.jar:?]
	at org.testng.TestNG.runSuites(TestNG.java:1144) [testng-6.11.jar:?]
	at org.testng.TestNG.run(TestNG.java:1115) [testng-6.11.jar:?]
	at org.apache.maven.surefire.testng.TestNGExecutor.run(TestNGExecutor.java:281) [surefire-testng-2.19.1.jar:2.19.1]
	at org.apache.maven.surefire.testng.TestNGXmlTestSuite.execute(TestNGXmlTestSuite.java:75) [surefire-testng-2.19.1.jar:2.19.1]
	at org.apache.maven.surefire.testng.TestNGProvider.invoke(TestNGProvider.java:121) [surefire-testng-2.19.1.jar:2.19.1]
	at org.apache.maven.surefire.booter.ForkedBooter.invokeProviderInSameClassLoader(ForkedBooter.java:290) [surefire-booter-2.19.1.jar:2.19.1]
	at org.apache.maven.surefire.booter.ForkedBooter.runSuitesInProcess(ForkedBooter.java:242) [surefire-booter-2.19.1.jar:2.19.1]
	at org.apache.maven.surefire.booter.ForkedBooter.main(ForkedBooter.java:121) [surefire-booter-2.19.1.jar:2.19.1]
[main] ERROR io.siddhi.extension.map.keyvalue.sourcemapper.KeyValueSourceMapper [] - Stream "FooStream" has an attribute named "price", but the received event {volume=100, symbol=9003, price=55.678} does not has a value for that attribute. Hence dropping the message.
[main] ERROR io.siddhi.core.stream.input.source.SourceMapper [] - Error while processing '{volume=100, symbol=9003, price=55.678}', for the input Mapping 'keyvalue' for the stream 'FooStream'.
io.siddhi.core.exception.MappingFailedException: null
	at io.siddhi.extension.map.keyvalue.sourcemapper.KeyValueSourceMapper.mapAndProcess(KeyValueSourceMapper.java:172) ~[classes/:?]
	at io.siddhi.core.stream.input.source.SourceMapper.onEvent(SourceMapper.java:201) [siddhi-core-5.1.21.jar:?]
	at io.siddhi.core.stream.input.source.SourceMapper.onEvent(SourceMapper.java:145) [siddhi-core-5.1.21.jar:?]
	at io.siddhi.extension.map.keyvalue.sourcemapper.TestTrpInMemorySource$1.onMessage(TestTrpInMemorySource.java:79) [test-classes/:?]
	at io.siddhi.core.util.transport.InMemoryBroker$MessageBroker.broadcast(InMemoryBroker.java:110) [siddhi-core-5.1.21.jar:?]
	at io.siddhi.core.util.transport.InMemoryBroker$MessageBroker.publish(InMemoryBroker.java:118) [siddhi-core-5.1.21.jar:?]
	at io.siddhi.core.util.transport.InMemoryBroker.publish(InMemoryBroker.java:41) [siddhi-core-5.1.21.jar:?]
	at io.siddhi.extension.map.keyvalue.sourcemapper.KeyValueSourceMapperTestCase.keyvalueSourceMapperDefaultTest9(KeyValueSourceMapperTestCase.java:1068) [test-classes/:?]
	at sun.reflect.NativeMethodAccessorImpl.invoke0(Native Method) ~[?:1.8.0_171]
	at sun.reflect.NativeMethodAccessorImpl.invoke(NativeMethodAccessorImpl.java:62) ~[?:1.8.0_171]
	at sun.reflect.DelegatingMethodAccessorImpl.invoke(DelegatingMethodAccessorImpl.java:43) ~[?:1.8.0_171]
	at java.lang.reflect.Method.invoke(Method.java:498) ~[?:1.8.0_171]
	at org.testng.internal.MethodInvocationHelper.invokeMethod(MethodInvocationHelper.java:108) [testng-6.11.jar:?]
	at org.testng.internal.Invoker.invokeMethod(Invoker.java:661) [testng-6.11.jar:?]
	at org.testng.internal.Invoker.invokeTestMethod(Invoker.java:869) [testng-6.11.jar:?]
	at org.testng.internal.Invoker.invokeTestMethods(Invoker.java:1193) [testng-6.11.jar:?]
	at org.testng.internal.TestMethodWorker.invokeTestMethods(TestMethodWorker.java:126) [testng-6.11.jar:?]
	at org.testng.internal.TestMethodWorker.run(TestMethodWorker.java:109) [testng-6.11.jar:?]
	at org.testng.TestRunner.privateRun(TestRunner.java:744) [testng-6.11.jar:?]
	at org.testng.TestRunner.run(TestRunner.java:602) [testng-6.11.jar:?]
	at org.testng.SuiteRunner.runTest(SuiteRunner.java:380) [testng-6.11.jar:?]
	at org.testng.SuiteRunner.runSequentially(SuiteRunner.java:375) [testng-6.11.jar:?]
	at org.testng.SuiteRunner.privateRun(SuiteRunner.java:340) [testng-6.11.jar:?]
	at org.testng.SuiteRunner.run(SuiteRunner.java:289) [testng-6.11.jar:?]
	at org.testng.SuiteRunnerWorker.runSuite(SuiteRunnerWorker.java:52) [testng-6.11.jar:?]
	at org.testng.SuiteRunnerWorker.run(SuiteRunnerWorker.java:86) [testng-6.11.jar:?]
	at org.testng.TestNG.runSuitesSequentially(TestNG.java:1301) [testng-6.11.jar:?]
	at org.testng.TestNG.runSuitesLocally(TestNG.java:1226) [testng-6.11.jar:?]
	at org.testng.TestNG.runSuites(TestNG.java:1144) [testng-6.11.jar:?]
	at org.testng.TestNG.run(TestNG.java:1115) [testng-6.11.jar:?]
	at org.apache.maven.surefire.testng.TestNGExecutor.run(TestNGExecutor.java:281) [surefire-testng-2.19.1.jar:2.19.1]
	at org.apache.maven.surefire.testng.TestNGXmlTestSuite.execute(TestNGXmlTestSuite.java:75) [surefire-testng-2.19.1.jar:2.19.1]
	at org.apache.maven.surefire.testng.TestNGProvider.invoke(TestNGProvider.java:121) [surefire-testng-2.19.1.jar:2.19.1]
	at org.apache.maven.surefire.booter.ForkedBooter.invokeProviderInSameClassLoader(ForkedBooter.java:290) [surefire-booter-2.19.1.jar:2.19.1]
	at org.apache.maven.surefire.booter.ForkedBooter.runSuitesInProcess(ForkedBooter.java:242) [surefire-booter-2.19.1.jar:2.19.1]
	at org.apache.maven.surefire.booter.ForkedBooter.main(ForkedBooter.java:121) [surefire-booter-2.19.1.jar:2.19.1]
[main] ERROR io.siddhi.extension.map.keyvalue.sourcemapper.KeyValueSourceMapper [] - Stream "FooStream" has an attribute named "price", but the received event {volume=100, symbol=9003, price=55.678} does not has a value for that attribute. Hence dropping the message.
[main] ERROR io.siddhi.core.stream.input.source.SourceMapper [] - Error while processing '{volume=100, symbol=9003, price=55.678}', for the input Mapping 'keyvalue' for the stream 'FooStream'.
io.siddhi.core.exception.MappingFailedException: null
	at io.siddhi.extension.map.keyvalue.sourcemapper.KeyValueSourceMapper.mapAndProcess(KeyValueSourceMapper.java:172) ~[classes/:?]
	at io.siddhi.core.stream.input.source.SourceMapper.onEvent(SourceMapper.java:201) [siddhi-core-5.1.21.jar:?]
	at io.siddhi.core.stream.input.source.SourceMapper.onEvent(SourceMapper.java:145) [siddhi-core-5.1.21.jar:?]
	at io.siddhi.extension.map.keyvalue.sourcemapper.TestTrpInMemorySource$1.onMessage(TestTrpInMemorySource.java:79) [test-classes/:?]
	at io.siddhi.core.util.transport.InMemoryBroker$MessageBroker.broadcast(InMemoryBroker.java:110) [siddhi-core-5.1.21.jar:?]
	at io.siddhi.core.util.transport.InMemoryBroker$MessageBroker.publish(InMemoryBroker.java:118) [siddhi-core-5.1.21.jar:?]
	at io.siddhi.core.util.transport.InMemoryBroker.publish(InMemoryBroker.java:41) [siddhi-core-5.1.21.jar:?]
	at io.siddhi.extension.map.keyvalue.sourcemapper.KeyValueSourceMapperTestCase.keyvalueSourceMapperDefaultTest9(KeyValueSourceMapperTestCase.java:1068) [test-classes/:?]
	at sun.reflect.NativeMethodAccessorImpl.invoke0(Native Method) ~[?:1.8.0_171]
	at sun.reflect.NativeMethodAccessorImpl.invoke(NativeMethodAccessorImpl.java:62) ~[?:1.8.0_171]
	at sun.reflect.DelegatingMethodAccessorImpl.invoke(DelegatingMethodAccessorImpl.java:43) ~[?:1.8.0_171]
	at java.lang.reflect.Method.invoke(Method.java:498) ~[?:1.8.0_171]
	at org.testng.internal.MethodInvocationHelper.invokeMethod(MethodInvocationHelper.java:108) [testng-6.11.jar:?]
	at org.testng.internal.Invoker.invokeMethod(Invoker.java:661) [testng-6.11.jar:?]
	at org.testng.internal.Invoker.invokeTestMethod(Invoker.java:869) [testng-6.11.jar:?]
	at org.testng.internal.Invoker.invokeTestMethods(Invoker.java:1193) [testng-6.11.jar:?]
	at org.testng.internal.TestMethodWorker.invokeTestMethods(TestMethodWorker.java:126) [testng-6.11.jar:?]
	at org.testng.internal.TestMethodWorker.run(TestMethodWorker.java:109) [testng-6.11.jar:?]
	at org.testng.TestRunner.privateRun(TestRunner.java:744) [testng-6.11.jar:?]
	at org.testng.TestRunner.run(TestRunner.java:602) [testng-6.11.jar:?]
	at org.testng.SuiteRunner.runTest(SuiteRunner.java:380) [testng-6.11.jar:?]
	at org.testng.SuiteRunner.runSequentially(SuiteRunner.java:375) [testng-6.11.jar:?]
	at org.testng.SuiteRunner.privateRun(SuiteRunner.java:340) [testng-6.11.jar:?]
	at org.testng.SuiteRunner.run(SuiteRunner.java:289) [testng-6.11.jar:?]
	at org.testng.SuiteRunnerWorker.runSuite(SuiteRunnerWorker.java:52) [testng-6.11.jar:?]
	at org.testng.SuiteRunnerWorker.run(SuiteRunnerWorker.java:86) [testng-6.11.jar:?]
	at org.testng.TestNG.runSuitesSequentially(TestNG.java:1301) [testng-6.11.jar:?]
	at org.testng.TestNG.runSuitesLocally(TestNG.java:1226) [testng-6.11.jar:?]
	at org.testng.TestNG.runSuites(TestNG.java:1144) [testng-6.11.jar:?]
	at org.testng.TestNG.run(TestNG.java:1115) [testng-6.11.jar:?]
	at org.apache.maven.surefire.testng.TestNGExecutor.run(TestNGExecutor.java:281) [surefire-testng-2.19.1.jar:2.19.1]
	at org.apache.maven.surefire.testng.TestNGXmlTestSuite.execute(TestNGXmlTestSuite.java:75) [surefire-testng-2.19.1.jar:2.19.1]
	at org.apache.maven.surefire.testng.TestNGProvider.invoke(TestNGProvider.java:121) [surefire-testng-2.19.1.jar:2.19.1]
	at org.apache.maven.surefire.booter.ForkedBooter.invokeProviderInSameClassLoader(ForkedBooter.java:290) [surefire-booter-2.19.1.jar:2.19.1]
	at org.apache.maven.surefire.booter.ForkedBooter.runSuitesInProcess(ForkedBooter.java:242) [surefire-booter-2.19.1.jar:2.19.1]
	at org.apache.maven.surefire.booter.ForkedBooter.main(ForkedBooter.java:121) [surefire-booter-2.19.1.jar:2.19.1]
[main] INFO  io.siddhi.core.util.EventPrinter [] - [Event{timestamp=1644933184134, data=[9003, 55.678, 100], isExpired=false}]
[main] ERROR io.siddhi.extension.map.keyvalue.sourcemapper.KeyValueSourceMapper [] - Stream "FooStream" has an attribute named "price", but the received event {volume=100, symbol=9004, price=55.678} does not has a value for that attribute. Hence dropping the message.
[main] ERROR io.siddhi.core.stream.input.source.SourceMapper [] - Error while processing '{volume=100, symbol=9004, price=55.678}', for the input Mapping 'keyvalue' for the stream 'FooStream'.
io.siddhi.core.exception.MappingFailedException: null
	at io.siddhi.extension.map.keyvalue.sourcemapper.KeyValueSourceMapper.mapAndProcess(KeyValueSourceMapper.java:172) ~[classes/:?]
	at io.siddhi.core.stream.input.source.SourceMapper.onEvent(SourceMapper.java:201) [siddhi-core-5.1.21.jar:?]
	at io.siddhi.core.stream.input.source.SourceMapper.onEvent(SourceMapper.java:145) [siddhi-core-5.1.21.jar:?]
	at io.siddhi.extension.map.keyvalue.sourcemapper.TestTrpInMemorySource$1.onMessage(TestTrpInMemorySource.java:79) [test-classes/:?]
	at io.siddhi.core.util.transport.InMemoryBroker$MessageBroker.broadcast(InMemoryBroker.java:110) [siddhi-core-5.1.21.jar:?]
	at io.siddhi.core.util.transport.InMemoryBroker$MessageBroker.publish(InMemoryBroker.java:118) [siddhi-core-5.1.21.jar:?]
	at io.siddhi.core.util.transport.InMemoryBroker.publish(InMemoryBroker.java:41) [siddhi-core-5.1.21.jar:?]
	at io.siddhi.extension.map.keyvalue.sourcemapper.KeyValueSourceMapperTestCase.keyvalueSourceMapperDefaultTest9(KeyValueSourceMapperTestCase.java:1074) [test-classes/:?]
	at sun.reflect.NativeMethodAccessorImpl.invoke0(Native Method) ~[?:1.8.0_171]
	at sun.reflect.NativeMethodAccessorImpl.invoke(NativeMethodAccessorImpl.java:62) ~[?:1.8.0_171]
	at sun.reflect.DelegatingMethodAccessorImpl.invoke(DelegatingMethodAccessorImpl.java:43) ~[?:1.8.0_171]
	at java.lang.reflect.Method.invoke(Method.java:498) ~[?:1.8.0_171]
	at org.testng.internal.MethodInvocationHelper.invokeMethod(MethodInvocationHelper.java:108) [testng-6.11.jar:?]
	at org.testng.internal.Invoker.invokeMethod(Invoker.java:661) [testng-6.11.jar:?]
	at org.testng.internal.Invoker.invokeTestMethod(Invoker.java:869) [testng-6.11.jar:?]
	at org.testng.internal.Invoker.invokeTestMethods(Invoker.java:1193) [testng-6.11.jar:?]
	at org.testng.internal.TestMethodWorker.invokeTestMethods(TestMethodWorker.java:126) [testng-6.11.jar:?]
	at org.testng.internal.TestMethodWorker.run(TestMethodWorker.java:109) [testng-6.11.jar:?]
	at org.testng.TestRunner.privateRun(TestRunner.java:744) [testng-6.11.jar:?]
	at org.testng.TestRunner.run(TestRunner.java:602) [testng-6.11.jar:?]
	at org.testng.SuiteRunner.runTest(SuiteRunner.java:380) [testng-6.11.jar:?]
	at org.testng.SuiteRunner.runSequentially(SuiteRunner.java:375) [testng-6.11.jar:?]
	at org.testng.SuiteRunner.privateRun(SuiteRunner.java:340) [testng-6.11.jar:?]
	at org.testng.SuiteRunner.run(SuiteRunner.java:289) [testng-6.11.jar:?]
	at org.testng.SuiteRunnerWorker.runSuite(SuiteRunnerWorker.java:52) [testng-6.11.jar:?]
	at org.testng.SuiteRunnerWorker.run(SuiteRunnerWorker.java:86) [testng-6.11.jar:?]
	at org.testng.TestNG.runSuitesSequentially(TestNG.java:1301) [testng-6.11.jar:?]
	at org.testng.TestNG.runSuitesLocally(TestNG.java:1226) [testng-6.11.jar:?]
	at org.testng.TestNG.runSuites(TestNG.java:1144) [testng-6.11.jar:?]
	at org.testng.TestNG.run(TestNG.java:1115) [testng-6.11.jar:?]
	at org.apache.maven.surefire.testng.TestNGExecutor.run(TestNGExecutor.java:281) [surefire-testng-2.19.1.jar:2.19.1]
	at org.apache.maven.surefire.testng.TestNGXmlTestSuite.execute(TestNGXmlTestSuite.java:75) [surefire-testng-2.19.1.jar:2.19.1]
	at org.apache.maven.surefire.testng.TestNGProvider.invoke(TestNGProvider.java:121) [surefire-testng-2.19.1.jar:2.19.1]
	at org.apache.maven.surefire.booter.ForkedBooter.invokeProviderInSameClassLoader(ForkedBooter.java:290) [surefire-booter-2.19.1.jar:2.19.1]
	at org.apache.maven.surefire.booter.ForkedBooter.runSuitesInProcess(ForkedBooter.java:242) [surefire-booter-2.19.1.jar:2.19.1]
	at org.apache.maven.surefire.booter.ForkedBooter.main(ForkedBooter.java:121) [surefire-booter-2.19.1.jar:2.19.1]
[main] ERROR io.siddhi.extension.map.keyvalue.sourcemapper.KeyValueSourceMapper [] - Stream "FooStream" has an attribute named "price", but the received event {volume=100, symbol=9004, price=55.678} does not has a value for that attribute. Hence dropping the message.
[main] ERROR io.siddhi.core.stream.input.source.SourceMapper [] - Error while processing '{volume=100, symbol=9004, price=55.678}', for the input Mapping 'keyvalue' for the stream 'FooStream'.
io.siddhi.core.exception.MappingFailedException: null
	at io.siddhi.extension.map.keyvalue.sourcemapper.KeyValueSourceMapper.mapAndProcess(KeyValueSourceMapper.java:172) ~[classes/:?]
	at io.siddhi.core.stream.input.source.SourceMapper.onEvent(SourceMapper.java:201) [siddhi-core-5.1.21.jar:?]
	at io.siddhi.core.stream.input.source.SourceMapper.onEvent(SourceMapper.java:145) [siddhi-core-5.1.21.jar:?]
	at io.siddhi.extension.map.keyvalue.sourcemapper.TestTrpInMemorySource$1.onMessage(TestTrpInMemorySource.java:79) [test-classes/:?]
	at io.siddhi.core.util.transport.InMemoryBroker$MessageBroker.broadcast(InMemoryBroker.java:110) [siddhi-core-5.1.21.jar:?]
	at io.siddhi.core.util.transport.InMemoryBroker$MessageBroker.publish(InMemoryBroker.java:118) [siddhi-core-5.1.21.jar:?]
	at io.siddhi.core.util.transport.InMemoryBroker.publish(InMemoryBroker.java:41) [siddhi-core-5.1.21.jar:?]
	at io.siddhi.extension.map.keyvalue.sourcemapper.KeyValueSourceMapperTestCase.keyvalueSourceMapperDefaultTest9(KeyValueSourceMapperTestCase.java:1074) [test-classes/:?]
	at sun.reflect.NativeMethodAccessorImpl.invoke0(Native Method) ~[?:1.8.0_171]
	at sun.reflect.NativeMethodAccessorImpl.invoke(NativeMethodAccessorImpl.java:62) ~[?:1.8.0_171]
	at sun.reflect.DelegatingMethodAccessorImpl.invoke(DelegatingMethodAccessorImpl.java:43) ~[?:1.8.0_171]
	at java.lang.reflect.Method.invoke(Method.java:498) ~[?:1.8.0_171]
	at org.testng.internal.MethodInvocationHelper.invokeMethod(MethodInvocationHelper.java:108) [testng-6.11.jar:?]
	at org.testng.internal.Invoker.invokeMethod(Invoker.java:661) [testng-6.11.jar:?]
	at org.testng.internal.Invoker.invokeTestMethod(Invoker.java:869) [testng-6.11.jar:?]
	at org.testng.internal.Invoker.invokeTestMethods(Invoker.java:1193) [testng-6.11.jar:?]
	at org.testng.internal.TestMethodWorker.invokeTestMethods(TestMethodWorker.java:126) [testng-6.11.jar:?]
	at org.testng.internal.TestMethodWorker.run(TestMethodWorker.java:109) [testng-6.11.jar:?]
	at org.testng.TestRunner.privateRun(TestRunner.java:744) [testng-6.11.jar:?]
	at org.testng.TestRunner.run(TestRunner.java:602) [testng-6.11.jar:?]
	at org.testng.SuiteRunner.runTest(SuiteRunner.java:380) [testng-6.11.jar:?]
	at org.testng.SuiteRunner.runSequentially(SuiteRunner.java:375) [testng-6.11.jar:?]
	at org.testng.SuiteRunner.privateRun(SuiteRunner.java:340) [testng-6.11.jar:?]
	at org.testng.SuiteRunner.run(SuiteRunner.java:289) [testng-6.11.jar:?]
	at org.testng.SuiteRunnerWorker.runSuite(SuiteRunnerWorker.java:52) [testng-6.11.jar:?]
	at org.testng.SuiteRunnerWorker.run(SuiteRunnerWorker.java:86) [testng-6.11.jar:?]
	at org.testng.TestNG.runSuitesSequentially(TestNG.java:1301) [testng-6.11.jar:?]
	at org.testng.TestNG.runSuitesLocally(TestNG.java:1226) [testng-6.11.jar:?]
	at org.testng.TestNG.runSuites(TestNG.java:1144) [testng-6.11.jar:?]
	at org.testng.TestNG.run(TestNG.java:1115) [testng-6.11.jar:?]
	at org.apache.maven.surefire.testng.TestNGExecutor.run(TestNGExecutor.java:281) [surefire-testng-2.19.1.jar:2.19.1]
	at org.apache.maven.surefire.testng.TestNGXmlTestSuite.execute(TestNGXmlTestSuite.java:75) [surefire-testng-2.19.1.jar:2.19.1]
	at org.apache.maven.surefire.testng.TestNGProvider.invoke(TestNGProvider.java:121) [surefire-testng-2.19.1.jar:2.19.1]
	at org.apache.maven.surefire.booter.ForkedBooter.invokeProviderInSameClassLoader(ForkedBooter.java:290) [surefire-booter-2.19.1.jar:2.19.1]
	at org.apache.maven.surefire.booter.ForkedBooter.runSuitesInProcess(ForkedBooter.java:242) [surefire-booter-2.19.1.jar:2.19.1]
	at org.apache.maven.surefire.booter.ForkedBooter.main(ForkedBooter.java:121) [surefire-booter-2.19.1.jar:2.19.1]
[main] ERROR io.siddhi.extension.map.keyvalue.sourcemapper.KeyValueSourceMapper [] - Stream "FooStream" has an attribute named "price", but the received event {volume=100, symbol=9004, price=55.678} does not has a value for that attribute. Hence dropping the message.
[main] ERROR io.siddhi.core.stream.input.source.SourceMapper [] - Error while processing '{volume=100, symbol=9004, price=55.678}', for the input Mapping 'keyvalue' for the stream 'FooStream'.
io.siddhi.core.exception.MappingFailedException: null
	at io.siddhi.extension.map.keyvalue.sourcemapper.KeyValueSourceMapper.mapAndProcess(KeyValueSourceMapper.java:172) ~[classes/:?]
	at io.siddhi.core.stream.input.source.SourceMapper.onEvent(SourceMapper.java:201) [siddhi-core-5.1.21.jar:?]
	at io.siddhi.core.stream.input.source.SourceMapper.onEvent(SourceMapper.java:145) [siddhi-core-5.1.21.jar:?]
	at io.siddhi.extension.map.keyvalue.sourcemapper.TestTrpInMemorySource$1.onMessage(TestTrpInMemorySource.java:79) [test-classes/:?]
	at io.siddhi.core.util.transport.InMemoryBroker$MessageBroker.broadcast(InMemoryBroker.java:110) [siddhi-core-5.1.21.jar:?]
	at io.siddhi.core.util.transport.InMemoryBroker$MessageBroker.publish(InMemoryBroker.java:118) [siddhi-core-5.1.21.jar:?]
	at io.siddhi.core.util.transport.InMemoryBroker.publish(InMemoryBroker.java:41) [siddhi-core-5.1.21.jar:?]
	at io.siddhi.extension.map.keyvalue.sourcemapper.KeyValueSourceMapperTestCase.keyvalueSourceMapperDefaultTest9(KeyValueSourceMapperTestCase.java:1074) [test-classes/:?]
	at sun.reflect.NativeMethodAccessorImpl.invoke0(Native Method) ~[?:1.8.0_171]
	at sun.reflect.NativeMethodAccessorImpl.invoke(NativeMethodAccessorImpl.java:62) ~[?:1.8.0_171]
	at sun.reflect.DelegatingMethodAccessorImpl.invoke(DelegatingMethodAccessorImpl.java:43) ~[?:1.8.0_171]
	at java.lang.reflect.Method.invoke(Method.java:498) ~[?:1.8.0_171]
	at org.testng.internal.MethodInvocationHelper.invokeMethod(MethodInvocationHelper.java:108) [testng-6.11.jar:?]
	at org.testng.internal.Invoker.invokeMethod(Invoker.java:661) [testng-6.11.jar:?]
	at org.testng.internal.Invoker.invokeTestMethod(Invoker.java:869) [testng-6.11.jar:?]
	at org.testng.internal.Invoker.invokeTestMethods(Invoker.java:1193) [testng-6.11.jar:?]
	at org.testng.internal.TestMethodWorker.invokeTestMethods(TestMethodWorker.java:126) [testng-6.11.jar:?]
	at org.testng.internal.TestMethodWorker.run(TestMethodWorker.java:109) [testng-6.11.jar:?]
	at org.testng.TestRunner.privateRun(TestRunner.java:744) [testng-6.11.jar:?]
	at org.testng.TestRunner.run(TestRunner.java:602) [testng-6.11.jar:?]
	at org.testng.SuiteRunner.runTest(SuiteRunner.java:380) [testng-6.11.jar:?]
	at org.testng.SuiteRunner.runSequentially(SuiteRunner.java:375) [testng-6.11.jar:?]
	at org.testng.SuiteRunner.privateRun(SuiteRunner.java:340) [testng-6.11.jar:?]
	at org.testng.SuiteRunner.run(SuiteRunner.java:289) [testng-6.11.jar:?]
	at org.testng.SuiteRunnerWorker.runSuite(SuiteRunnerWorker.java:52) [testng-6.11.jar:?]
	at org.testng.SuiteRunnerWorker.run(SuiteRunnerWorker.java:86) [testng-6.11.jar:?]
	at org.testng.TestNG.runSuitesSequentially(TestNG.java:1301) [testng-6.11.jar:?]
	at org.testng.TestNG.runSuitesLocally(TestNG.java:1226) [testng-6.11.jar:?]
	at org.testng.TestNG.runSuites(TestNG.java:1144) [testng-6.11.jar:?]
	at org.testng.TestNG.run(TestNG.java:1115) [testng-6.11.jar:?]
	at org.apache.maven.surefire.testng.TestNGExecutor.run(TestNGExecutor.java:281) [surefire-testng-2.19.1.jar:2.19.1]
	at org.apache.maven.surefire.testng.TestNGXmlTestSuite.execute(TestNGXmlTestSuite.java:75) [surefire-testng-2.19.1.jar:2.19.1]
	at org.apache.maven.surefire.testng.TestNGProvider.invoke(TestNGProvider.java:121) [surefire-testng-2.19.1.jar:2.19.1]
	at org.apache.maven.surefire.booter.ForkedBooter.invokeProviderInSameClassLoader(ForkedBooter.java:290) [surefire-booter-2.19.1.jar:2.19.1]
	at org.apache.maven.surefire.booter.ForkedBooter.runSuitesInProcess(ForkedBooter.java:242) [surefire-booter-2.19.1.jar:2.19.1]
	at org.apache.maven.surefire.booter.ForkedBooter.main(ForkedBooter.java:121) [surefire-booter-2.19.1.jar:2.19.1]
[main] INFO  io.siddhi.core.util.EventPrinter [] - [Event{timestamp=1644933184135, data=[9004, 55.678, 100], isExpired=false}]
Tests run: 25, Failures: 0, Errors: 0, Skipped: 0, Time elapsed: 1.764 sec - in TestSuite

Results :

Tests run: 25, Failures: 0, Errors: 0, Skipped: 0

[JENKINS] Recording test results
[INFO] 
[INFO] --- maven-bundle-plugin:3.0.1:bundle (default-bundle) @ siddhi-map-keyvalue ---
[WARNING] Include-Resource: overriding log4j2.properties=src/main/resources/log4j2.properties,META-INF/NOTICE=target/maven-shared-archive-resources/META-INF/NOTICE,META-INF/LICENSE=target/maven-shared-archive-resources/META-INF/LICENSE,META-INF/DEPENDENCIES=target/maven-shared-archive-resources/META-INF/DEPENDENCIES with META-INF=target/classes/META-INF (add {maven-resources} if you want to include the maven resources)
[INFO] 
[INFO] --- jacoco-maven-plugin:0.7.9:report (jacoco-site) @ siddhi-map-keyvalue ---
[INFO] Loading execution data file /home/jenkins/workspace/sonar/sonar-siddhi-map-keyvalue/component/target/coverage-reports/jacoco.exec
[INFO] Analyzed bundle 'Siddhi Extension - KeyValue Mapper' with 4 classes
[INFO] 
[INFO] --- maven-install-plugin:2.5.2:install (default-install) @ siddhi-map-keyvalue ---
[INFO] Installing /home/jenkins/workspace/sonar/sonar-siddhi-map-keyvalue/component/target/siddhi-map-keyvalue-2.1.3-SNAPSHOT.jar to /home/jenkins/workspace/sonar/sonar-siddhi-map-keyvalue/.repository/io/siddhi/extension/map/keyvalue/siddhi-map-keyvalue/2.1.3-SNAPSHOT/siddhi-map-keyvalue-2.1.3-SNAPSHOT.jar
[INFO] Installing /home/jenkins/workspace/sonar/sonar-siddhi-map-keyvalue/component/pom.xml to /home/jenkins/workspace/sonar/sonar-siddhi-map-keyvalue/.repository/io/siddhi/extension/map/keyvalue/siddhi-map-keyvalue/2.1.3-SNAPSHOT/siddhi-map-keyvalue-2.1.3-SNAPSHOT.pom
[INFO] 
[INFO] --- maven-bundle-plugin:3.0.1:install (default-install) @ siddhi-map-keyvalue ---
[INFO] Local OBR update disabled (enable with -DobrRepository)
[JENKINS] Archiving disabled