Started 3 mo 2 days ago
Took 8 hr 4 min on ECS_PRODUCTION-2dc4e094f36ea5

Failed Build #423 (Jun 27, 2022 6:36:17 PM)

Build Artifacts
dependency-updates-report.xml387.28 KB view
Changes
  1. Update issue template (commit: 386d619) (details)

Started by an SCM change

Revision: 525dad3dcebe90af89936da1ea06ef9825419930
  • refs/remotes/origin/master
Test Result (5 failures / ±0)Show all failed tests >>>

Identified problems

testCopyFile

java.lang.AssertionError: expected:<200> but was:<202> at org.testng.Assert.fail(Assert.java:89) at org.testng.Assert.failNotEquals(Assert.java:489) at org.testng.Assert.assertEquals(Assert.java:118) at org.testng.Assert.assertEquals(Assert.java:365) at org.testng.Assert.assertEquals(Assert.java:375) at org.wso2.carbon.ei.tests.connectors.FileConnectorIntegrationTest.testCopyFile(FileConnectorIntegrationTest.java:77)

xsltTransformationFromUrl

org.apache.axis2.AxisFault: org.apache.synapse.SynapseException: Content-Type:text/xml; charset=UTF-8,Host:localhost:8480,SOAPAction:"urn:getQuote", Unexpected error sending message back at org.apache.axis2.util.Utils.getInboundFaultFromMessageContext(Utils.java:531) at org.apache.axis2.description.OutInAxisOperationClient.handleResponse(OutInAxisOperation.java:382) at org.apache.axis2.description.OutInAxisOperationClient.send(OutInAxisOperation.java:457) at org.apache.axis2.description.OutInAxisOperationClient.executeImpl(OutInAxisOperation.java:228) at org.apache.axis2.client.OperationClient.execute(OperationClient.java:149) at org.apache.axis2.client.ServiceClient.sendReceive(ServiceClient.java:554) at org.apache.axis2.client.ServiceClient.sendReceive(ServiceClient.java:530) at org.wso2.esb.integration.common.utils.clients.stockquoteclient.StockQuoteClient.sendCustomQuoteRequest(StockQuoteClient.java:166) at org.wso2.carbon.esb.mediator.test.xslt.XsltTransformationFromUrlTestCase.xsltTransformationFromUrl(XsltTransformationFromUrlTestCase.java:42)

testMessagesInMessageProcessor

java.lang.AssertionError: Message Processor : mspAdminTestInMemoryMessageProcessor did not de-activate after failed delivery attempts with OUT_ONLY property. expected: but was: at org.testng.Assert.fail(Assert.java:89) at org.testng.Assert.failNotEquals(Assert.java:489) at org.testng.Assert.assertFalse(Assert.java:58) at org.wso2.carbon.esb.message.processor.test.MessageProcessorAdminTestCase.testMessagesInMessageProcessor(MessageProcessorAdminTestCase.java:191)

testPreserveContentTypeHeader

java.lang.AssertionError: Response header modified at org.junit.Assert.fail(Assert.java:88) at org.junit.Assert.assertTrue(Assert.java:41) at org.wso2.carbon.esb.passthru.transport.test.PreseveResponseHeaderTestCase.testPreserveContentTypeHeader(PreseveResponseHeaderTestCase.java:57)

testMalformedJSONPayloadInFaultySequence

java.lang.AssertionError: The status code set in the faulty sequence is not received expected:<500> but was:<202> at org.testng.Assert.fail(Assert.java:89) at org.testng.Assert.failNotEquals(Assert.java:489) at org.testng.Assert.assertEquals(Assert.java:118) at org.testng.Assert.assertEquals(Assert.java:365) at org.wso2.carbon.esb.json.EI2757MalformedJSONPayloadFaultyTestCase.testMalformedJSONPayloadInFaultySequence(EI2757MalformedJSONPayloadFaultyTestCase.java:44)

Environment Variables(63)18 different
Slave Information(87)10 different
Project Information(15)0 different

Module Builds

 AdminApiHelper (didn’t run)
Success EI Integration Test Admin Clients1 min 18 sec
Success WSO2 Enterprise Integrator - Automation Extensions1 min 33 sec
Success WSO2 BPS Samples1 min 20 sec
Success DataServices Clients1 min 36 sec
Success WSO2 Enterprise Integrator - Data Service Hosting Integration Tests1 min 11 sec
Success WSO2 DataServices Integration Test1 min 10 sec
Success WSO2 DataServices Integration Test Common1 min 10 sec
Success WSO2 DataServices Samples Parent1 min 12 sec
Success WSO2 Enterprise Integrator - Component Parent1 min 15 sec
Success WSO2 Enterprise Integrator - P2 Profile Generation2 min 25 sec
Success WSO2 Enterprise Integrator - Samples Parent1 min 11 sec
Success EI Test Common Module1 min 22 sec
Success EI Integration Test Common Utils1 min 23 sec
Success WSO2 Enterprise Integrator - Integration Tests1 min 11 sec
Success WSO2 Enterprise Integrator - Feature Aggregator Module1 min 11 sec
Success JAX-RS Basic Demo3.9 sec
 WSO2 Enterprise Integrator - Lightweight P2 Profile Generation (didn’t run)
Success Integration Test Module1 min 12 sec
Success WSO2 MB - Integration Tests1 min 15 sec
Success WSO2 Enterprise Integrator - Mediation Integration Tests1 min 11 sec
 WSO2 Enterprise Integrator - micro-integrator P2 Profile Generation (didn’t run)
 WSO2 Enterprise Integrator - microIntegrator P2 Profile Generation (didn’t run)
 WSO2 MSF4J Runtime (didn’t run)
Success WSO2 Business Process Server Integration Tests - HumanTask Coordination12 min
Success Integration Test Reporting1 min 29 sec
Success org.wso2.carbon.ei.migration1 min 20 sec
Unstable EI test Module - Test Connectors2 min 20 sec
Success EI test Module-mediator-129 min
Unstable EI test Module-mediator-216 min
Success EI test Module-Other16 min
Unstable EI test Module - Test Patches21 min
Success EI Test Module - Platform1 min 11 sec
Success EI test Module - Platform - RabbitMQ Transport1 min 14 sec
Success EI test Module - Platform - with WSO2MB1 min 17 sec
Success EI test Module - Sample9 min 59 sec
Success EI test Module-Service20 min
Success EI test Module-Transport28 min
Success EI test Module - UI1 min 17 sec
 WSO2 Enterprise Integrator - Core Component (didn’t run)
 WSO2 Enterprise Integrator - Core Server Feature (didn’t run)
 org.wso2.carbon.micro.integrator.admin.api (didn’t run)
 org.wso2.carbon.micro.integrator.admin.apis (didn’t run)
 org.wso2.carbon.micro.integrator.admin.apis.esb (didn’t run)
 WSO2 Enterprise Integrator - Micro Core Component (didn’t run)
 WSO2 Enterprise Integrator - Micro Extensions (didn’t run)
 org.wso2.carbon.micro.integrator.security (didn’t run)
 WSO2 Enterprise Integrator - Micro server Component (didn’t run)
 WSO2 Enterprise Integrator - Micro Core Server Feature (didn’t run)
Success WSO2 Carbon - Server Administration UI1 min 14 sec
Success WSO2 Enterprise Integrator - Admin Console feature1 min 11 sec
Success WSO2 Enterprise Integrator - Analytics ELK1 min 51 sec
Success WSO2 Enterprise Integrator - Analytics ELK Feature1 min 13 sec
Success WSO2 Enterprise Integrator - Analytics Feature1 min 14 sec
Success WSO2 Enterprise Integrator - Analytics Styles1 min 12 sec
Success WSO2 Enterprise Integrator Analytics - Styles Features1 min 12 sec
Success WSO2 Carbon - BPMN Analytics Core Extension1 min 17 sec
Success WSO2 ei bpmn Analytics - UDF1 min 14 sec
Success WSO2 EI Message Broker - Dashboard UI1 min 12 sec
Success WSO2 EI Broker - Tenant Dashboard UI1 min 12 sec
Success WSO2 EI Broker Styles1 min 12 sec
Success WSO2 EI Broker - Styles Features1 min 11 sec
Success WSO2 EI Business-Process - Tenant Dashboard UI1 min 22 sec
Success WSO2 EI Business-Process - Tenant Dashboard UI1 min 12 sec
Success WSO2 EI Business-Process - UI styles1 min 12 sec
Success WSO2 EI Business Process - Style Features1 min 11 sec
Success WSO2 BPS - Integration Test Common Module1 min 14 sec
Success WSO2 BPS - Integration Test Utils1 min 13 sec
Success WSO2 Business Process Server Integration Tests - BPS Test Reporting Module1 min 12 sec
Success WSO2 Business Process Server Integration Tests - BPEL11 min
Success WSO2 Business Process Server Integration Tests - BPMN8 min 42 sec
Success WSO2 Business Process Server Integration Tests - HumanTask9 min 12 sec
Success WSO2 Business Process Server Tests Patches - BPEL2 min 12 sec
Success WSO2 BPS - Integration UI Pages1 min 16 sec
Success admin-clents1 min 14 sec
Success integration-test-utils1 min 14 sec
Success integration-test-ui-pages1 min 14 sec
Success DataService Integration test UI module1 min 14 sec
Success org.wso2.ei.integration.test26 min
Success MB AMQP based Test Module2 hr 27 min
Success WSO2 MB - Integration Test Common Module1 min 14 sec
Success WSO2 MB - Integration Test Common Utils Module1 min 15 sec
Success UI Integration Test Module1 min 15 sec
Success MB Patch based Test Module1 min 58 sec
Success WSO2 MB - platform Test Common Utils Module1 min 14 sec
Success WSO2 EI - Samples1 min 16 sec
Success WSO2 Enterprise Integrator - Samples Features1 min 12 sec
Success WSO2 Enterprise Integrator - Styles1 min 16 sec
Success WSO2 Enterprise Integrator - Styles Features1 min 16 sec
Success WSO2 Enterprise Integrator - P2 Profile Module1 min 11 sec
Success WSO2 BPS - Tools1 min 35 sec
Success WSO2 BPS - Client for Samples1 min 13 sec
Success WSO2 BPS - Utilities for Samples1 min 14 sec
Success WSO2 BPS - Sample Utilities and Jars to use with BPS Testing1 min 11 sec
Success MB Server Test Module1 min 44 sec
Success EI Test Service Module2 min 14 sec
Success EI Integration Test UI Pages1 min 17 sec
 WSO2 Enterprise Integrator - Analytics P2 Profile Generation (didn’t run)
Success >WSO2 Enterprise Integrator - Analytics Profile Generation2 min 21 sec
Success WSO2 BPS - Integration Parent1 min 11 sec
Success WSO2 BPS - Integration Parent1 min 11 sec
Success WSO2 BPS - Integration Parent1 min 11 sec
Success WSO2 BPS - Integration Parent1 min 10 sec
Success WSO2 BPS - P2 Profile Generation1 min 46 sec
Success WSO2 BPS - Distribution Parent1 min 11 sec
Success WSO2 Broker - P2 Profile Generation1 min 35 sec
Success WSO2 Enterprise Integrator - Distribution2 min 26 sec
Success WSO2 Enterprise Integrator1 min 43 sec
Success WSO2 Enterprise Integrator - Web App Samples4.5 sec