FailedConsole Output

Skipping 801 KB.. Full Log
tNG.java:1031)
	at org.apache.maven.surefire.testng.TestNGExecutor.run(TestNGExecutor.java:178)
	at org.apache.maven.surefire.testng.TestNGXmlTestSuite.execute(TestNGXmlTestSuite.java:92)
	at org.apache.maven.surefire.testng.TestNGProvider.invoke(TestNGProvider.java:96)
	at sun.reflect.NativeMethodAccessorImpl.invoke0(Native Method)
	at sun.reflect.NativeMethodAccessorImpl.invoke(NativeMethodAccessorImpl.java:62)
	at sun.reflect.DelegatingMethodAccessorImpl.invoke(DelegatingMethodAccessorImpl.java:43)
	at java.lang.reflect.Method.invoke(Method.java:498)
	at org.apache.maven.surefire.util.ReflectionUtils.invokeMethodWithArray(ReflectionUtils.java:189)
	at org.apache.maven.surefire.booter.ProviderFactory$ProviderProxy.invoke(ProviderFactory.java:165)
	at org.apache.maven.surefire.booter.ProviderFactory.invokeProvider(ProviderFactory.java:85)
	at org.apache.maven.surefire.booter.ForkedBooter.runSuitesInProcess(ForkedBooter.java:115)
	at org.apache.maven.surefire.booter.ForkedBooter.main(ForkedBooter.java:75)
Caused by: org.h2.jdbc.JdbcSQLException: Table "AC_TRANSPORT" not found; SQL statement:
SELECT name, port, protocol, service_prefix FROM AC_TRANSPORT WHERE id IN (SELECT transport_id FROM AC_RUNTIME_TRANSPORT WHERE runtime_id=?) [42102-175]
	at org.h2.message.DbException.getJdbcSQLException(DbException.java:332)
	at org.h2.message.DbException.get(DbException.java:172)
	at org.h2.message.DbException.get(DbException.java:149)
	at org.h2.command.Parser.readTableOrView(Parser.java:5071)
	at org.h2.command.Parser.readTableFilter(Parser.java:1188)
	at org.h2.command.Parser.parseSelectSimpleFromPart(Parser.java:1813)
	at org.h2.command.Parser.parseSelectSimple(Parser.java:1921)
	at org.h2.command.Parser.parseSelectSub(Parser.java:1807)
	at org.h2.command.Parser.parseSelectUnion(Parser.java:1631)
	at org.h2.command.Parser.parseSelect(Parser.java:1619)
	at org.h2.command.Parser.parsePrepared(Parser.java:426)
	at org.h2.command.Parser.parse(Parser.java:298)
	at org.h2.command.Parser.parse(Parser.java:270)
	at org.h2.command.Parser.prepareCommand(Parser.java:235)
	at org.h2.engine.Session.prepareLocal(Session.java:436)
	at org.h2.engine.Session.prepareCommand(Session.java:379)
	at org.h2.jdbc.JdbcConnection.prepareCommand(JdbcConnection.java:1138)
	at org.h2.jdbc.JdbcPreparedStatement.<init>(JdbcPreparedStatement.java:70)
	at org.h2.jdbc.JdbcConnection.prepareStatement(JdbcConnection.java:267)
	at sun.reflect.GeneratedMethodAccessor2.invoke(Unknown Source)
	at sun.reflect.DelegatingMethodAccessorImpl.invoke(DelegatingMethodAccessorImpl.java:43)
	at java.lang.reflect.Method.invoke(Method.java:498)
	at org.apache.tomcat.jdbc.pool.ProxyConnection.invoke(ProxyConnection.java:126)
	at org.apache.tomcat.jdbc.pool.JdbcInterceptor.invoke(JdbcInterceptor.java:109)
	at org.apache.tomcat.jdbc.pool.DisposableConnectionFacade.invoke(DisposableConnectionFacade.java:80)
	at com.sun.proxy.$Proxy5.prepareStatement(Unknown Source)
	at org.wso2.appcloud.core.dao.ApplicationDAO.getTransportsForRuntime(ApplicationDAO.java:1466)
	... 35 more
Error while retrieving TRIAL application versions which was created before 5 hours 
org.wso2.appcloud.common.AppCloudException: Error while retrieving TRIAL application versions which was created before 5 hours 
	at org.wso2.appcloud.core.dao.ApplicationDAO.getTrialApplicationVersionsByRunningTimePeriod(ApplicationDAO.java:2791)
	at org.wso2.appcloud.core.ApplicationManager.getTrialApplicationVersionsByRunningTimePeriod(ApplicationManager.java:1764)
	at org.wso2.appcloud.core.ApplicationManagerTest.testGetTrialApplicationVersionsByRunningTimePeriod_shouldThrowException(ApplicationManagerTest.java:164)
	at sun.reflect.NativeMethodAccessorImpl.invoke0(Native Method)
	at sun.reflect.NativeMethodAccessorImpl.invoke(NativeMethodAccessorImpl.java:62)
	at sun.reflect.DelegatingMethodAccessorImpl.invoke(DelegatingMethodAccessorImpl.java:43)
	at java.lang.reflect.Method.invoke(Method.java:498)
	at org.testng.internal.MethodInvocationHelper.invokeMethod(MethodInvocationHelper.java:80)
	at org.testng.internal.Invoker.invokeMethod(Invoker.java:714)
	at org.testng.internal.Invoker.invokeTestMethod(Invoker.java:901)
	at org.testng.internal.Invoker.invokeTestMethods(Invoker.java:1231)
	at org.testng.internal.TestMethodWorker.invokeTestMethods(TestMethodWorker.java:127)
	at org.testng.internal.TestMethodWorker.run(TestMethodWorker.java:111)
	at org.testng.TestRunner.privateRun(TestRunner.java:767)
	at org.testng.TestRunner.run(TestRunner.java:617)
	at org.testng.SuiteRunner.runTest(SuiteRunner.java:334)
	at org.testng.SuiteRunner.runSequentially(SuiteRunner.java:329)
	at org.testng.SuiteRunner.privateRun(SuiteRunner.java:291)
	at org.testng.SuiteRunner.run(SuiteRunner.java:240)
	at org.testng.SuiteRunnerWorker.runSuite(SuiteRunnerWorker.java:52)
	at org.testng.SuiteRunnerWorker.run(SuiteRunnerWorker.java:86)
	at org.testng.TestNG.runSuitesSequentially(TestNG.java:1198)
	at org.testng.TestNG.runSuitesLocally(TestNG.java:1123)
	at org.testng.TestNG.run(TestNG.java:1031)
	at org.apache.maven.surefire.testng.TestNGExecutor.run(TestNGExecutor.java:178)
	at org.apache.maven.surefire.testng.TestNGXmlTestSuite.execute(TestNGXmlTestSuite.java:92)
	at org.apache.maven.surefire.testng.TestNGProvider.invoke(TestNGProvider.java:96)
	at sun.reflect.NativeMethodAccessorImpl.invoke0(Native Method)
	at sun.reflect.NativeMethodAccessorImpl.invoke(NativeMethodAccessorImpl.java:62)
	at sun.reflect.DelegatingMethodAccessorImpl.invoke(DelegatingMethodAccessorImpl.java:43)
	at java.lang.reflect.Method.invoke(Method.java:498)
	at org.apache.maven.surefire.util.ReflectionUtils.invokeMethodWithArray(ReflectionUtils.java:189)
	at org.apache.maven.surefire.booter.ProviderFactory$ProviderProxy.invoke(ProviderFactory.java:165)
	at org.apache.maven.surefire.booter.ProviderFactory.invokeProvider(ProviderFactory.java:85)
	at org.apache.maven.surefire.booter.ForkedBooter.runSuitesInProcess(ForkedBooter.java:115)
	at org.apache.maven.surefire.booter.ForkedBooter.main(ForkedBooter.java:75)
Caused by: org.h2.jdbc.JdbcSQLException: Table "AC_VERSION" not found; SQL statement:
SELECT * from AC_VERSION JOIN AC_TENANT_SUBSCRIPTION WHERE AC_VERSION.tenant_id = AC_TENANT_SUBSCRIPTION.tenant_id AND AC_VERSION.status = 'running' AND (AC_TENANT_SUBSCRIPTION.plan='TRIAL' AND AC_VERSION.timestamp <  timestampadd(HOUR, -?, now())) [42102-175]
	at org.h2.message.DbException.getJdbcSQLException(DbException.java:332)
	at org.h2.message.DbException.get(DbException.java:172)
	at org.h2.message.DbException.get(DbException.java:149)
	at org.h2.command.Parser.readTableOrView(Parser.java:5071)
	at org.h2.command.Parser.readTableFilter(Parser.java:1188)
	at org.h2.command.Parser.parseSelectSimpleFromPart(Parser.java:1813)
	at org.h2.command.Parser.parseSelectSimple(Parser.java:1921)
	at org.h2.command.Parser.parseSelectSub(Parser.java:1807)
	at org.h2.command.Parser.parseSelectUnion(Parser.java:1631)
	at org.h2.command.Parser.parseSelect(Parser.java:1619)
	at org.h2.command.Parser.parsePrepared(Parser.java:426)
	at org.h2.command.Parser.parse(Parser.java:298)
	at org.h2.command.Parser.parse(Parser.java:270)
	at org.h2.command.Parser.prepareCommand(Parser.java:235)
	at org.h2.engine.Session.prepareLocal(Session.java:436)
	at org.h2.engine.Session.prepareCommand(Session.java:379)
	at org.h2.jdbc.JdbcConnection.prepareCommand(JdbcConnection.java:1138)
	at org.h2.jdbc.JdbcPreparedStatement.<init>(JdbcPreparedStatement.java:70)
	at org.h2.jdbc.JdbcConnection.prepareStatement(JdbcConnection.java:267)
	at sun.reflect.GeneratedMethodAccessor2.invoke(Unknown Source)
	at sun.reflect.DelegatingMethodAccessorImpl.invoke(DelegatingMethodAccessorImpl.java:43)
	at java.lang.reflect.Method.invoke(Method.java:498)
	at org.apache.tomcat.jdbc.pool.ProxyConnection.invoke(ProxyConnection.java:126)
	at org.apache.tomcat.jdbc.pool.JdbcInterceptor.invoke(JdbcInterceptor.java:109)
	at org.apache.tomcat.jdbc.pool.DisposableConnectionFacade.invoke(DisposableConnectionFacade.java:80)
	at com.sun.proxy.$Proxy5.prepareStatement(Unknown Source)
	at org.wso2.appcloud.core.dao.ApplicationDAO.getTrialApplicationVersionsByRunningTimePeriod(ApplicationDAO.java:2773)
	... 35 more
Error while retrieving version info for version hash id : 112233
org.wso2.appcloud.common.AppCloudException: Error while retrieving version detail for vershion hash Id : 112233
	at org.wso2.appcloud.core.dao.ApplicationDAO.getVersionByHashId(ApplicationDAO.java:2707)
	at org.wso2.appcloud.core.ApplicationManager.getVersionByHashId(ApplicationManager.java:1720)
	at org.wso2.appcloud.core.ApplicationManagerTest.testGetVersionByHashId_shouldThrowException(ApplicationManagerTest.java:1033)
	at sun.reflect.NativeMethodAccessorImpl.invoke0(Native Method)
	at sun.reflect.NativeMethodAccessorImpl.invoke(NativeMethodAccessorImpl.java:62)
	at sun.reflect.DelegatingMethodAccessorImpl.invoke(DelegatingMethodAccessorImpl.java:43)
	at java.lang.reflect.Method.invoke(Method.java:498)
	at org.testng.internal.MethodInvocationHelper.invokeMethod(MethodInvocationHelper.java:80)
	at org.testng.internal.Invoker.invokeMethod(Invoker.java:714)
	at org.testng.internal.Invoker.invokeTestMethod(Invoker.java:901)
	at org.testng.internal.Invoker.invokeTestMethods(Invoker.java:1231)
	at org.testng.internal.TestMethodWorker.invokeTestMethods(TestMethodWorker.java:127)
	at org.testng.internal.TestMethodWorker.run(TestMethodWorker.java:111)
	at org.testng.TestRunner.privateRun(TestRunner.java:767)
	at org.testng.TestRunner.run(TestRunner.java:617)
	at org.testng.SuiteRunner.runTest(SuiteRunner.java:334)
	at org.testng.SuiteRunner.runSequentially(SuiteRunner.java:329)
	at org.testng.SuiteRunner.privateRun(SuiteRunner.java:291)
	at org.testng.SuiteRunner.run(SuiteRunner.java:240)
	at org.testng.SuiteRunnerWorker.runSuite(SuiteRunnerWorker.java:52)
	at org.testng.SuiteRunnerWorker.run(SuiteRunnerWorker.java:86)
	at org.testng.TestNG.runSuitesSequentially(TestNG.java:1198)
	at org.testng.TestNG.runSuitesLocally(TestNG.java:1123)
	at org.testng.TestNG.run(TestNG.java:1031)
	at org.apache.maven.surefire.testng.TestNGExecutor.run(TestNGExecutor.java:178)
	at org.apache.maven.surefire.testng.TestNGXmlTestSuite.execute(TestNGXmlTestSuite.java:92)
	at org.apache.maven.surefire.testng.TestNGProvider.invoke(TestNGProvider.java:96)
	at sun.reflect.NativeMethodAccessorImpl.invoke0(Native Method)
	at sun.reflect.NativeMethodAccessorImpl.invoke(NativeMethodAccessorImpl.java:62)
	at sun.reflect.DelegatingMethodAccessorImpl.invoke(DelegatingMethodAccessorImpl.java:43)
	at java.lang.reflect.Method.invoke(Method.java:498)
	at org.apache.maven.surefire.util.ReflectionUtils.invokeMethodWithArray(ReflectionUtils.java:189)
	at org.apache.maven.surefire.booter.ProviderFactory$ProviderProxy.invoke(ProviderFactory.java:165)
	at org.apache.maven.surefire.booter.ProviderFactory.invokeProvider(ProviderFactory.java:85)
	at org.apache.maven.surefire.booter.ForkedBooter.runSuitesInProcess(ForkedBooter.java:115)
	at org.apache.maven.surefire.booter.ForkedBooter.main(ForkedBooter.java:75)
Caused by: org.h2.jdbc.JdbcSQLException: Table "AC_VERSION" not found; SQL statement:
SELECT * FROM AC_VERSION WHERE hash_id = ? [42102-175]
	at org.h2.message.DbException.getJdbcSQLException(DbException.java:332)
	at org.h2.message.DbException.get(DbException.java:172)
	at org.h2.message.DbException.get(DbException.java:149)
	at org.h2.command.Parser.readTableOrView(Parser.java:5071)
	at org.h2.command.Parser.readTableFilter(Parser.java:1188)
	at org.h2.command.Parser.parseSelectSimpleFromPart(Parser.java:1813)
	at org.h2.command.Parser.parseSelectSimple(Parser.java:1921)
	at org.h2.command.Parser.parseSelectSub(Parser.java:1807)
	at org.h2.command.Parser.parseSelectUnion(Parser.java:1631)
	at org.h2.command.Parser.parseSelect(Parser.java:1619)
	at org.h2.command.Parser.parsePrepared(Parser.java:426)
	at org.h2.command.Parser.parse(Parser.java:298)
	at org.h2.command.Parser.parse(Parser.java:270)
	at org.h2.command.Parser.prepareCommand(Parser.java:235)
	at org.h2.engine.Session.prepareLocal(Session.java:436)
	at org.h2.engine.Session.prepareCommand(Session.java:379)
	at org.h2.jdbc.JdbcConnection.prepareCommand(JdbcConnection.java:1138)
	at org.h2.jdbc.JdbcPreparedStatement.<init>(JdbcPreparedStatement.java:70)
	at org.h2.jdbc.JdbcConnection.prepareStatement(JdbcConnection.java:267)
	at sun.reflect.GeneratedMethodAccessor2.invoke(Unknown Source)
	at sun.reflect.DelegatingMethodAccessorImpl.invoke(DelegatingMethodAccessorImpl.java:43)
	at java.lang.reflect.Method.invoke(Method.java:498)
	at org.apache.tomcat.jdbc.pool.ProxyConnection.invoke(ProxyConnection.java:126)
	at org.apache.tomcat.jdbc.pool.JdbcInterceptor.invoke(JdbcInterceptor.java:109)
	at org.apache.tomcat.jdbc.pool.DisposableConnectionFacade.invoke(DisposableConnectionFacade.java:80)
	at com.sun.proxy.$Proxy5.prepareStatement(Unknown Source)
	at org.wso2.appcloud.core.dao.ApplicationDAO.getVersionByHashId(ApplicationDAO.java:2690)
	... 35 more
Error occured while getting version id for version hash id : 112233 for tenant id : 1
org.wso2.appcloud.common.AppCloudException: Error while retreiving id of version with hash value : 112233 in tenant : 1
	at org.wso2.appcloud.core.dao.ApplicationDAO.getVersionId(ApplicationDAO.java:1215)
	at org.wso2.appcloud.core.ApplicationManager.getVersionId(ApplicationManager.java:1319)
	at org.wso2.appcloud.core.ApplicationManagerTest.testGetVersionId_shouldThrowException(ApplicationManagerTest.java:1190)
	at sun.reflect.NativeMethodAccessorImpl.invoke0(Native Method)
	at sun.reflect.NativeMethodAccessorImpl.invoke(NativeMethodAccessorImpl.java:62)
	at sun.reflect.DelegatingMethodAccessorImpl.invoke(DelegatingMethodAccessorImpl.java:43)
	at java.lang.reflect.Method.invoke(Method.java:498)
	at org.testng.internal.MethodInvocationHelper.invokeMethod(MethodInvocationHelper.java:80)
	at org.testng.internal.Invoker.invokeMethod(Invoker.java:714)
	at org.testng.internal.Invoker.invokeTestMethod(Invoker.java:901)
	at org.testng.internal.Invoker.invokeTestMethods(Invoker.java:1231)
	at org.testng.internal.TestMethodWorker.invokeTestMethods(TestMethodWorker.java:127)
	at org.testng.internal.TestMethodWorker.run(TestMethodWorker.java:111)
	at org.testng.TestRunner.privateRun(TestRunner.java:767)
	at org.testng.TestRunner.run(TestRunner.java:617)
	at org.testng.SuiteRunner.runTest(SuiteRunner.java:334)
	at org.testng.SuiteRunner.runSequentially(SuiteRunner.java:329)
	at org.testng.SuiteRunner.privateRun(SuiteRunner.java:291)
	at org.testng.SuiteRunner.run(SuiteRunner.java:240)
	at org.testng.SuiteRunnerWorker.runSuite(SuiteRunnerWorker.java:52)
	at org.testng.SuiteRunnerWorker.run(SuiteRunnerWorker.java:86)
	at org.testng.TestNG.runSuitesSequentially(TestNG.java:1198)
	at org.testng.TestNG.runSuitesLocally(TestNG.java:1123)
	at org.testng.TestNG.run(TestNG.java:1031)
	at org.apache.maven.surefire.testng.TestNGExecutor.run(TestNGExecutor.java:178)
	at org.apache.maven.surefire.testng.TestNGXmlTestSuite.execute(TestNGXmlTestSuite.java:92)
	at org.apache.maven.surefire.testng.TestNGProvider.invoke(TestNGProvider.java:96)
	at sun.reflect.NativeMethodAccessorImpl.invoke0(Native Method)
	at sun.reflect.NativeMethodAccessorImpl.invoke(NativeMethodAccessorImpl.java:62)
	at sun.reflect.DelegatingMethodAccessorImpl.invoke(DelegatingMethodAccessorImpl.java:43)
	at java.lang.reflect.Method.invoke(Method.java:498)
	at org.apache.maven.surefire.util.ReflectionUtils.invokeMethodWithArray(ReflectionUtils.java:189)
	at org.apache.maven.surefire.booter.ProviderFactory$ProviderProxy.invoke(ProviderFactory.java:165)
	at org.apache.maven.surefire.booter.ProviderFactory.invokeProvider(ProviderFactory.java:85)
	at org.apache.maven.surefire.booter.ForkedBooter.runSuitesInProcess(ForkedBooter.java:115)
	at org.apache.maven.surefire.booter.ForkedBooter.main(ForkedBooter.java:75)
Caused by: org.h2.jdbc.JdbcSQLException: Table "AC_VERSION" not found; SQL statement:
SELECT id FROM AC_VERSION WHERE hash_id=? AND tenant_id=? [42102-175]
	at org.h2.message.DbException.getJdbcSQLException(DbException.java:332)
	at org.h2.message.DbException.get(DbException.java:172)
	at org.h2.message.DbException.get(DbException.java:149)
	at org.h2.command.Parser.readTableOrView(Parser.java:5071)
	at org.h2.command.Parser.readTableFilter(Parser.java:1188)
	at org.h2.command.Parser.parseSelectSimpleFromPart(Parser.java:1813)
	at org.h2.command.Parser.parseSelectSimple(Parser.java:1921)
	at org.h2.command.Parser.parseSelectSub(Parser.java:1807)
	at org.h2.command.Parser.parseSelectUnion(Parser.java:1631)
	at org.h2.command.Parser.parseSelect(Parser.java:1619)
	at org.h2.command.Parser.parsePrepared(Parser.java:426)
	at org.h2.command.Parser.parse(Parser.java:298)
	at org.h2.command.Parser.parse(Parser.java:270)
	at org.h2.command.Parser.prepareCommand(Parser.java:235)
	at org.h2.engine.Session.prepareLocal(Session.java:436)
	at org.h2.engine.Session.prepareCommand(Session.java:379)
	at org.h2.jdbc.JdbcConnection.prepareCommand(JdbcConnection.java:1138)
	at org.h2.jdbc.JdbcPreparedStatement.<init>(JdbcPreparedStatement.java:70)
	at org.h2.jdbc.JdbcConnection.prepareStatement(JdbcConnection.java:267)
	at sun.reflect.GeneratedMethodAccessor2.invoke(Unknown Source)
	at sun.reflect.DelegatingMethodAccessorImpl.invoke(DelegatingMethodAccessorImpl.java:43)
	at java.lang.reflect.Method.invoke(Method.java:498)
	at org.apache.tomcat.jdbc.pool.ProxyConnection.invoke(ProxyConnection.java:126)
	at org.apache.tomcat.jdbc.pool.JdbcInterceptor.invoke(JdbcInterceptor.java:109)
	at org.apache.tomcat.jdbc.pool.DisposableConnectionFacade.invoke(DisposableConnectionFacade.java:80)
	at com.sun.proxy.$Proxy5.prepareStatement(Unknown Source)
	at org.wso2.appcloud.core.dao.ApplicationDAO.getVersionId(ApplicationDAO.java:1205)
	... 35 more
Error while getting URL scheme with version : 112233
org.wso2.appcloud.common.AppCloudException: Error while retrieving the exposed transport type  for version :112233
	at org.wso2.appcloud.core.dao.ApplicationDAO.getVersionURLScheme(ApplicationDAO.java:1860)
	at org.wso2.appcloud.core.ApplicationManager.getVersionURLScheme(ApplicationManager.java:962)
	at org.wso2.appcloud.core.ApplicationManagerTest.testGetVersionURLScheme_shouldThrowException(ApplicationManagerTest.java:549)
	at sun.reflect.NativeMethodAccessorImpl.invoke0(Native Method)
	at sun.reflect.NativeMethodAccessorImpl.invoke(NativeMethodAccessorImpl.java:62)
	at sun.reflect.DelegatingMethodAccessorImpl.invoke(DelegatingMethodAccessorImpl.java:43)
	at java.lang.reflect.Method.invoke(Method.java:498)
	at org.testng.internal.MethodInvocationHelper.invokeMethod(MethodInvocationHelper.java:80)
	at org.testng.internal.Invoker.invokeMethod(Invoker.java:714)
	at org.testng.internal.Invoker.invokeTestMethod(Invoker.java:901)
	at org.testng.internal.Invoker.invokeTestMethods(Invoker.java:1231)
	at org.testng.internal.TestMethodWorker.invokeTestMethods(TestMethodWorker.java:127)
	at org.testng.internal.TestMethodWorker.run(TestMethodWorker.java:111)
	at org.testng.TestRunner.privateRun(TestRunner.java:767)
	at org.testng.TestRunner.run(TestRunner.java:617)
	at org.testng.SuiteRunner.runTest(SuiteRunner.java:334)
	at org.testng.SuiteRunner.runSequentially(SuiteRunner.java:329)
	at org.testng.SuiteRunner.privateRun(SuiteRunner.java:291)
	at org.testng.SuiteRunner.run(SuiteRunner.java:240)
	at org.testng.SuiteRunnerWorker.runSuite(SuiteRunnerWorker.java:52)
	at org.testng.SuiteRunnerWorker.run(SuiteRunnerWorker.java:86)
	at org.testng.TestNG.runSuitesSequentially(TestNG.java:1198)
	at org.testng.TestNG.runSuitesLocally(TestNG.java:1123)
	at org.testng.TestNG.run(TestNG.java:1031)
	at org.apache.maven.surefire.testng.TestNGExecutor.run(TestNGExecutor.java:178)
	at org.apache.maven.surefire.testng.TestNGXmlTestSuite.execute(TestNGXmlTestSuite.java:92)
	at org.apache.maven.surefire.testng.TestNGProvider.invoke(TestNGProvider.java:96)
	at sun.reflect.NativeMethodAccessorImpl.invoke0(Native Method)
	at sun.reflect.NativeMethodAccessorImpl.invoke(NativeMethodAccessorImpl.java:62)
	at sun.reflect.DelegatingMethodAccessorImpl.invoke(DelegatingMethodAccessorImpl.java:43)
	at java.lang.reflect.Method.invoke(Method.java:498)
	at org.apache.maven.surefire.util.ReflectionUtils.invokeMethodWithArray(ReflectionUtils.java:189)
	at org.apache.maven.surefire.booter.ProviderFactory$ProviderProxy.invoke(ProviderFactory.java:165)
	at org.apache.maven.surefire.booter.ProviderFactory.invokeProvider(ProviderFactory.java:85)
	at org.apache.maven.surefire.booter.ForkedBooter.runSuitesInProcess(ForkedBooter.java:115)
	at org.apache.maven.surefire.booter.ForkedBooter.main(ForkedBooter.java:75)
Caused by: org.h2.jdbc.JdbcSQLException: Table "AC_VERSION" not found; SQL statement:
SELECT exposed_transport as EXPOSED_TRANSPORT FROM AC_VERSION WHERE hash_id=? AND tenant_id=? [42102-175]
	at org.h2.message.DbException.getJdbcSQLException(DbException.java:332)
	at org.h2.message.DbException.get(DbException.java:172)
	at org.h2.message.DbException.get(DbException.java:149)
	at org.h2.command.Parser.readTableOrView(Parser.java:5071)
	at org.h2.command.Parser.readTableFilter(Parser.java:1188)
	at org.h2.command.Parser.parseSelectSimpleFromPart(Parser.java:1813)
	at org.h2.command.Parser.parseSelectSimple(Parser.java:1921)
	at org.h2.command.Parser.parseSelectSub(Parser.java:1807)
	at org.h2.command.Parser.parseSelectUnion(Parser.java:1631)
	at org.h2.command.Parser.parseSelect(Parser.java:1619)
	at org.h2.command.Parser.parsePrepared(Parser.java:426)
	at org.h2.command.Parser.parse(Parser.java:298)
	at org.h2.command.Parser.parse(Parser.java:270)
	at org.h2.command.Parser.prepareCommand(Parser.java:235)
	at org.h2.engine.Session.prepareLocal(Session.java:436)
	at org.h2.engine.Session.prepareCommand(Session.java:379)
	at org.h2.jdbc.JdbcConnection.prepareCommand(JdbcConnection.java:1138)
	at org.h2.jdbc.JdbcPreparedStatement.<init>(JdbcPreparedStatement.java:70)
	at org.h2.jdbc.JdbcConnection.prepareStatement(JdbcConnection.java:267)
	at sun.reflect.GeneratedMethodAccessor2.invoke(Unknown Source)
	at sun.reflect.DelegatingMethodAccessorImpl.invoke(DelegatingMethodAccessorImpl.java:43)
	at java.lang.reflect.Method.invoke(Method.java:498)
	at org.apache.tomcat.jdbc.pool.ProxyConnection.invoke(ProxyConnection.java:126)
	at org.apache.tomcat.jdbc.pool.JdbcInterceptor.invoke(JdbcInterceptor.java:109)
	at org.apache.tomcat.jdbc.pool.DisposableConnectionFacade.invoke(DisposableConnectionFacade.java:80)
	at com.sun.proxy.$Proxy5.prepareStatement(Unknown Source)
	at org.wso2.appcloud.core.dao.ApplicationDAO.getVersionURLScheme(ApplicationDAO.java:1851)
	... 35 more
Error while getting if version is a single version for version with hash id : 112233 for tenant id : 1
org.wso2.appcloud.common.AppCloudException: Error while retrieving the data for checking whether an application has multiple versions in tenant : 1
	at org.wso2.appcloud.core.dao.ApplicationDAO.isSingleVersion(ApplicationDAO.java:673)
	at org.wso2.appcloud.core.ApplicationManager.isSingleVersion(ApplicationManager.java:253)
	at org.wso2.appcloud.core.ApplicationManagerTest.testIsSingleVersion_shouldThrowException(ApplicationManagerTest.java:1099)
	at sun.reflect.NativeMethodAccessorImpl.invoke0(Native Method)
	at sun.reflect.NativeMethodAccessorImpl.invoke(NativeMethodAccessorImpl.java:62)
	at sun.reflect.DelegatingMethodAccessorImpl.invoke(DelegatingMethodAccessorImpl.java:43)
	at java.lang.reflect.Method.invoke(Method.java:498)
	at org.testng.internal.MethodInvocationHelper.invokeMethod(MethodInvocationHelper.java:80)
	at org.testng.internal.Invoker.invokeMethod(Invoker.java:714)
	at org.testng.internal.Invoker.invokeTestMethod(Invoker.java:901)
	at org.testng.internal.Invoker.invokeTestMethods(Invoker.java:1231)
	at org.testng.internal.TestMethodWorker.invokeTestMethods(TestMethodWorker.java:127)
	at org.testng.internal.TestMethodWorker.run(TestMethodWorker.java:111)
	at org.testng.TestRunner.privateRun(TestRunner.java:767)
	at org.testng.TestRunner.run(TestRunner.java:617)
	at org.testng.SuiteRunner.runTest(SuiteRunner.java:334)
	at org.testng.SuiteRunner.runSequentially(SuiteRunner.java:329)
	at org.testng.SuiteRunner.privateRun(SuiteRunner.java:291)
	at org.testng.SuiteRunner.run(SuiteRunner.java:240)
	at org.testng.SuiteRunnerWorker.runSuite(SuiteRunnerWorker.java:52)
	at org.testng.SuiteRunnerWorker.run(SuiteRunnerWorker.java:86)
	at org.testng.TestNG.runSuitesSequentially(TestNG.java:1198)
	at org.testng.TestNG.runSuitesLocally(TestNG.java:1123)
	at org.testng.TestNG.run(TestNG.java:1031)
	at org.apache.maven.surefire.testng.TestNGExecutor.run(TestNGExecutor.java:178)
	at org.apache.maven.surefire.testng.TestNGXmlTestSuite.execute(TestNGXmlTestSuite.java:92)
	at org.apache.maven.surefire.testng.TestNGProvider.invoke(TestNGProvider.java:96)
	at sun.reflect.NativeMethodAccessorImpl.invoke0(Native Method)
	at sun.reflect.NativeMethodAccessorImpl.invoke(NativeMethodAccessorImpl.java:62)
	at sun.reflect.DelegatingMethodAccessorImpl.invoke(DelegatingMethodAccessorImpl.java:43)
	at java.lang.reflect.Method.invoke(Method.java:498)
	at org.apache.maven.surefire.util.ReflectionUtils.invokeMethodWithArray(ReflectionUtils.java:189)
	at org.apache.maven.surefire.booter.ProviderFactory$ProviderProxy.invoke(ProviderFactory.java:165)
	at org.apache.maven.surefire.booter.ProviderFactory.invokeProvider(ProviderFactory.java:85)
	at org.apache.maven.surefire.booter.ForkedBooter.runSuitesInProcess(ForkedBooter.java:115)
	at org.apache.maven.surefire.booter.ForkedBooter.main(ForkedBooter.java:75)
Caused by: org.h2.jdbc.JdbcSQLException: Table "AC_VERSION" not found; SQL statement:
SELECT hash_id FROM AC_VERSION WHERE application_id = (SELECT application_id FROM AC_VERSION WHERE hash_id=? AND tenant_id=?) [42102-175]
	at org.h2.message.DbException.getJdbcSQLException(DbException.java:332)
	at org.h2.message.DbException.get(DbException.java:172)
	at org.h2.message.DbException.get(DbException.java:149)
	at org.h2.command.Parser.readTableOrView(Parser.java:5071)
	at org.h2.command.Parser.readTableFilter(Parser.java:1188)
	at org.h2.command.Parser.parseSelectSimpleFromPart(Parser.java:1813)
	at org.h2.command.Parser.parseSelectSimple(Parser.java:1921)
	at org.h2.command.Parser.parseSelectSub(Parser.java:1807)
	at org.h2.command.Parser.parseSelectUnion(Parser.java:1631)
	at org.h2.command.Parser.parseSelect(Parser.java:1619)
	at org.h2.command.Parser.parsePrepared(Parser.java:426)
	at org.h2.command.Parser.parse(Parser.java:298)
	at org.h2.command.Parser.parse(Parser.java:270)
	at org.h2.command.Parser.prepareCommand(Parser.java:235)
	at org.h2.engine.Session.prepareLocal(Session.java:436)
	at org.h2.engine.Session.prepareCommand(Session.java:379)
	at org.h2.jdbc.JdbcConnection.prepareCommand(JdbcConnection.java:1138)
	at org.h2.jdbc.JdbcPreparedStatement.<init>(JdbcPreparedStatement.java:70)
	at org.h2.jdbc.JdbcConnection.prepareStatement(JdbcConnection.java:267)
	at sun.reflect.GeneratedMethodAccessor2.invoke(Unknown Source)
	at sun.reflect.DelegatingMethodAccessorImpl.invoke(DelegatingMethodAccessorImpl.java:43)
	at java.lang.reflect.Method.invoke(Method.java:498)
	at org.apache.tomcat.jdbc.pool.ProxyConnection.invoke(ProxyConnection.java:126)
	at org.apache.tomcat.jdbc.pool.JdbcInterceptor.invoke(JdbcInterceptor.java:109)
	at org.apache.tomcat.jdbc.pool.DisposableConnectionFacade.invoke(DisposableConnectionFacade.java:80)
	at com.sun.proxy.$Proxy5.prepareStatement(Unknown Source)
	at org.wso2.appcloud.core.dao.ApplicationDAO.isSingleVersion(ApplicationDAO.java:661)
	... 35 more
Error while updating the custom domain with application hash id : 11223344 for tenant id : 1
org.wso2.appcloud.common.AppCloudException: Error occurred while updating custom domain : custom_domain with application hash id : 11223344 in tenant : 1
	at org.wso2.appcloud.core.dao.ApplicationDAO.updateCustomDomain(ApplicationDAO.java:1796)
	at org.wso2.appcloud.core.ApplicationManager.updateCustomDomain(ApplicationManager.java:1095)
	at org.wso2.appcloud.core.ApplicationManagerTest.testUpdateCustomDomain_shouldThrowException(ApplicationManagerTest.java:436)
	at sun.reflect.NativeMethodAccessorImpl.invoke0(Native Method)
	at sun.reflect.NativeMethodAccessorImpl.invoke(NativeMethodAccessorImpl.java:62)
	at sun.reflect.DelegatingMethodAccessorImpl.invoke(DelegatingMethodAccessorImpl.java:43)
	at java.lang.reflect.Method.invoke(Method.java:498)
	at org.testng.internal.MethodInvocationHelper.invokeMethod(MethodInvocationHelper.java:80)
	at org.testng.internal.Invoker.invokeMethod(Invoker.java:714)
	at org.testng.internal.Invoker.invokeTestMethod(Invoker.java:901)
	at org.testng.internal.Invoker.invokeTestMethods(Invoker.java:1231)
	at org.testng.internal.TestMethodWorker.invokeTestMethods(TestMethodWorker.java:127)
	at org.testng.internal.TestMethodWorker.run(TestMethodWorker.java:111)
	at org.testng.TestRunner.privateRun(TestRunner.java:767)
	at org.testng.TestRunner.run(TestRunner.java:617)
	at org.testng.SuiteRunner.runTest(SuiteRunner.java:334)
	at org.testng.SuiteRunner.runSequentially(SuiteRunner.java:329)
	at org.testng.SuiteRunner.privateRun(SuiteRunner.java:291)
	at org.testng.SuiteRunner.run(SuiteRunner.java:240)
	at org.testng.SuiteRunnerWorker.runSuite(SuiteRunnerWorker.java:52)
	at org.testng.SuiteRunnerWorker.run(SuiteRunnerWorker.java:86)
	at org.testng.TestNG.runSuitesSequentially(TestNG.java:1198)
	at org.testng.TestNG.runSuitesLocally(TestNG.java:1123)
	at org.testng.TestNG.run(TestNG.java:1031)
	at org.apache.maven.surefire.testng.TestNGExecutor.run(TestNGExecutor.java:178)
	at org.apache.maven.surefire.testng.TestNGXmlTestSuite.execute(TestNGXmlTestSuite.java:92)
	at org.apache.maven.surefire.testng.TestNGProvider.invoke(TestNGProvider.java:96)
	at sun.reflect.NativeMethodAccessorImpl.invoke0(Native Method)
	at sun.reflect.NativeMethodAccessorImpl.invoke(NativeMethodAccessorImpl.java:62)
	at sun.reflect.DelegatingMethodAccessorImpl.invoke(DelegatingMethodAccessorImpl.java:43)
	at java.lang.reflect.Method.invoke(Method.java:498)
	at org.apache.maven.surefire.util.ReflectionUtils.invokeMethodWithArray(ReflectionUtils.java:189)
	at org.apache.maven.surefire.booter.ProviderFactory$ProviderProxy.invoke(ProviderFactory.java:165)
	at org.apache.maven.surefire.booter.ProviderFactory.invokeProvider(ProviderFactory.java:85)
	at org.apache.maven.surefire.booter.ForkedBooter.runSuitesInProcess(ForkedBooter.java:115)
	at org.apache.maven.surefire.booter.ForkedBooter.main(ForkedBooter.java:75)
Caused by: org.h2.jdbc.JdbcSQLException: Table "AC_APPLICATION" not found; SQL statement:
UPDATE AC_APPLICATION SET custom_domain=? WHERE hash_id=?  AND AC_APPLICATION.tenant_id=? [42102-175]
	at org.h2.message.DbException.getJdbcSQLException(DbException.java:332)
	at org.h2.message.DbException.get(DbException.java:172)
	at org.h2.message.DbException.get(DbException.java:149)
	at org.h2.command.Parser.readTableOrView(Parser.java:5071)
	at org.h2.command.Parser.readTableOrView(Parser.java:5049)
	at org.h2.command.Parser.readSimpleTableFilter(Parser.java:737)
	at org.h2.command.Parser.parseUpdate(Parser.java:686)
	at org.h2.command.Parser.parsePrepared(Parser.java:448)
	at org.h2.command.Parser.parse(Parser.java:298)
	at org.h2.command.Parser.parse(Parser.java:270)
	at org.h2.command.Parser.prepareCommand(Parser.java:235)
	at org.h2.engine.Session.prepareLocal(Session.java:436)
	at org.h2.engine.Session.prepareCommand(Session.java:379)
	at org.h2.jdbc.JdbcConnection.prepareCommand(JdbcConnection.java:1138)
	at org.h2.jdbc.JdbcPreparedStatement.<init>(JdbcPreparedStatement.java:70)
	at org.h2.jdbc.JdbcConnection.prepareStatement(JdbcConnection.java:267)
	at sun.reflect.GeneratedMethodAccessor2.invoke(Unknown Source)
	at sun.reflect.DelegatingMethodAccessorImpl.invoke(DelegatingMethodAccessorImpl.java:43)
	at java.lang.reflect.Method.invoke(Method.java:498)
	at org.apache.tomcat.jdbc.pool.ProxyConnection.invoke(ProxyConnection.java:126)
	at org.apache.tomcat.jdbc.pool.JdbcInterceptor.invoke(JdbcInterceptor.java:109)
	at org.apache.tomcat.jdbc.pool.DisposableConnectionFacade.invoke(DisposableConnectionFacade.java:80)
	at com.sun.proxy.$Proxy5.prepareStatement(Unknown Source)
	at org.wso2.appcloud.core.dao.ApplicationDAO.updateCustomDomain(ApplicationDAO.java:1788)
	... 35 more
Error while updating default version with application hash id : 11223344 for tenant id : 1
org.wso2.appcloud.common.AppCloudException: Error while updating default version with application hash id : 11223344 in tenant : 1
	at org.wso2.appcloud.core.dao.ApplicationDAO.updateDefaultVersion(ApplicationDAO.java:1921)
	at org.wso2.appcloud.core.ApplicationManager.updateDefaultVersion(ApplicationManager.java:1127)
	at org.wso2.appcloud.core.ApplicationManagerTest.testUpdateDefaultVersion_shouldThrowException(ApplicationManagerTest.java:469)
	at sun.reflect.NativeMethodAccessorImpl.invoke0(Native Method)
	at sun.reflect.NativeMethodAccessorImpl.invoke(NativeMethodAccessorImpl.java:62)
	at sun.reflect.DelegatingMethodAccessorImpl.invoke(DelegatingMethodAccessorImpl.java:43)
	at java.lang.reflect.Method.invoke(Method.java:498)
	at org.testng.internal.MethodInvocationHelper.invokeMethod(MethodInvocationHelper.java:80)
	at org.testng.internal.Invoker.invokeMethod(Invoker.java:714)
	at org.testng.internal.Invoker.invokeTestMethod(Invoker.java:901)
	at org.testng.internal.Invoker.invokeTestMethods(Invoker.java:1231)
	at org.testng.internal.TestMethodWorker.invokeTestMethods(TestMethodWorker.java:127)
	at org.testng.internal.TestMethodWorker.run(TestMethodWorker.java:111)
	at org.testng.TestRunner.privateRun(TestRunner.java:767)
	at org.testng.TestRunner.run(TestRunner.java:617)
	at org.testng.SuiteRunner.runTest(SuiteRunner.java:334)
	at org.testng.SuiteRunner.runSequentially(SuiteRunner.java:329)
	at org.testng.SuiteRunner.privateRun(SuiteRunner.java:291)
	at org.testng.SuiteRunner.run(SuiteRunner.java:240)
	at org.testng.SuiteRunnerWorker.runSuite(SuiteRunnerWorker.java:52)
	at org.testng.SuiteRunnerWorker.run(SuiteRunnerWorker.java:86)
	at org.testng.TestNG.runSuitesSequentially(TestNG.java:1198)
	at org.testng.TestNG.runSuitesLocally(TestNG.java:1123)
	at org.testng.TestNG.run(TestNG.java:1031)
	at org.apache.maven.surefire.testng.TestNGExecutor.run(TestNGExecutor.java:178)
	at org.apache.maven.surefire.testng.TestNGXmlTestSuite.execute(TestNGXmlTestSuite.java:92)
	at org.apache.maven.surefire.testng.TestNGProvider.invoke(TestNGProvider.java:96)
	at sun.reflect.NativeMethodAccessorImpl.invoke0(Native Method)
	at sun.reflect.NativeMethodAccessorImpl.invoke(NativeMethodAccessorImpl.java:62)
	at sun.reflect.DelegatingMethodAccessorImpl.invoke(DelegatingMethodAccessorImpl.java:43)
	at java.lang.reflect.Method.invoke(Method.java:498)
	at org.apache.maven.surefire.util.ReflectionUtils.invokeMethodWithArray(ReflectionUtils.java:189)
	at org.apache.maven.surefire.booter.ProviderFactory$ProviderProxy.invoke(ProviderFactory.java:165)
	at org.apache.maven.surefire.booter.ProviderFactory.invokeProvider(ProviderFactory.java:85)
	at org.apache.maven.surefire.booter.ForkedBooter.runSuitesInProcess(ForkedBooter.java:115)
	at org.apache.maven.surefire.booter.ForkedBooter.main(ForkedBooter.java:75)
Caused by: org.h2.jdbc.JdbcSQLException: Table "AC_APPLICATION" not found; SQL statement:
UPDATE AC_APPLICATION SET default_version=? WHERE hash_id=? AND tenant_id=? [42102-175]
	at org.h2.message.DbException.getJdbcSQLException(DbException.java:332)
	at org.h2.message.DbException.get(DbException.java:172)
	at org.h2.message.DbException.get(DbException.java:149)
	at org.h2.command.Parser.readTableOrView(Parser.java:5071)
	at org.h2.command.Parser.readTableOrView(Parser.java:5049)
	at org.h2.command.Parser.readSimpleTableFilter(Parser.java:737)
	at org.h2.command.Parser.parseUpdate(Parser.java:686)
	at org.h2.command.Parser.parsePrepared(Parser.java:448)
	at org.h2.command.Parser.parse(Parser.java:298)
	at org.h2.command.Parser.parse(Parser.java:270)
	at org.h2.command.Parser.prepareCommand(Parser.java:235)
	at org.h2.engine.Session.prepareLocal(Session.java:436)
	at org.h2.engine.Session.prepareCommand(Session.java:379)
	at org.h2.jdbc.JdbcConnection.prepareCommand(JdbcConnection.java:1138)
	at org.h2.jdbc.JdbcPreparedStatement.<init>(JdbcPreparedStatement.java:70)
	at org.h2.jdbc.JdbcConnection.prepareStatement(JdbcConnection.java:267)
	at sun.reflect.GeneratedMethodAccessor2.invoke(Unknown Source)
	at sun.reflect.DelegatingMethodAccessorImpl.invoke(DelegatingMethodAccessorImpl.java:43)
	at java.lang.reflect.Method.invoke(Method.java:498)
	at org.apache.tomcat.jdbc.pool.ProxyConnection.invoke(ProxyConnection.java:126)
	at org.apache.tomcat.jdbc.pool.JdbcInterceptor.invoke(JdbcInterceptor.java:109)
	at org.apache.tomcat.jdbc.pool.DisposableConnectionFacade.invoke(DisposableConnectionFacade.java:80)
	at com.sun.proxy.$Proxy5.prepareStatement(Unknown Source)
	at org.wso2.appcloud.core.dao.ApplicationDAO.updateDefaultVersion(ApplicationDAO.java:1913)
	... 35 more
Error while updating database for scaling deployment: 112233 and tenant id: 1.
org.wso2.appcloud.common.AppCloudException: Error while updating database for scaling deployment : 112233 in tenant : 1
	at org.wso2.appcloud.core.dao.ApplicationDAO.updateReplicationCountForDeployment(ApplicationDAO.java:2515)
	at org.wso2.appcloud.core.ApplicationManager.updateReplicationCountForDeployment(ApplicationManager.java:1573)
	at org.wso2.appcloud.core.ApplicationManagerTest.testUpdateReplicationCountForDeployment_shouldThrowException(ApplicationManagerTest.java:1327)
	at sun.reflect.NativeMethodAccessorImpl.invoke0(Native Method)
	at sun.reflect.NativeMethodAccessorImpl.invoke(NativeMethodAccessorImpl.java:62)
	at sun.reflect.DelegatingMethodAccessorImpl.invoke(DelegatingMethodAccessorImpl.java:43)
	at java.lang.reflect.Method.invoke(Method.java:498)
	at org.testng.internal.MethodInvocationHelper.invokeMethod(MethodInvocationHelper.java:80)
	at org.testng.internal.Invoker.invokeMethod(Invoker.java:714)
	at org.testng.internal.Invoker.invokeTestMethod(Invoker.java:901)
	at org.testng.internal.Invoker.invokeTestMethods(Invoker.java:1231)
	at org.testng.internal.TestMethodWorker.invokeTestMethods(TestMethodWorker.java:127)
	at org.testng.internal.TestMethodWorker.run(TestMethodWorker.java:111)
	at org.testng.TestRunner.privateRun(TestRunner.java:767)
	at org.testng.TestRunner.run(TestRunner.java:617)
	at org.testng.SuiteRunner.runTest(SuiteRunner.java:334)
	at org.testng.SuiteRunner.runSequentially(SuiteRunner.java:329)
	at org.testng.SuiteRunner.privateRun(SuiteRunner.java:291)
	at org.testng.SuiteRunner.run(SuiteRunner.java:240)
	at org.testng.SuiteRunnerWorker.runSuite(SuiteRunnerWorker.java:52)
	at org.testng.SuiteRunnerWorker.run(SuiteRunnerWorker.java:86)
	at org.testng.TestNG.runSuitesSequentially(TestNG.java:1198)
	at org.testng.TestNG.runSuitesLocally(TestNG.java:1123)
	at org.testng.TestNG.run(TestNG.java:1031)
	at org.apache.maven.surefire.testng.TestNGExecutor.run(TestNGExecutor.java:178)
	at org.apache.maven.surefire.testng.TestNGXmlTestSuite.execute(TestNGXmlTestSuite.java:92)
	at org.apache.maven.surefire.testng.TestNGProvider.invoke(TestNGProvider.java:96)
	at sun.reflect.NativeMethodAccessorImpl.invoke0(Native Method)
	at sun.reflect.NativeMethodAccessorImpl.invoke(NativeMethodAccessorImpl.java:62)
	at sun.reflect.DelegatingMethodAccessorImpl.invoke(DelegatingMethodAccessorImpl.java:43)
	at java.lang.reflect.Method.invoke(Method.java:498)
	at org.apache.maven.surefire.util.ReflectionUtils.invokeMethodWithArray(ReflectionUtils.java:189)
	at org.apache.maven.surefire.booter.ProviderFactory$ProviderProxy.invoke(ProviderFactory.java:165)
	at org.apache.maven.surefire.booter.ProviderFactory.invokeProvider(ProviderFactory.java:85)
	at org.apache.maven.surefire.booter.ForkedBooter.runSuitesInProcess(ForkedBooter.java:115)
	at org.apache.maven.surefire.booter.ForkedBooter.main(ForkedBooter.java:75)
Caused by: org.h2.jdbc.JdbcSQLException: Table "AC_DEPLOYMENT" not found; SQL statement:
UPDATE AC_DEPLOYMENT SET replicas=? WHERE name=? AND tenant_id=? [42102-175]
	at org.h2.message.DbException.getJdbcSQLException(DbException.java:332)
	at org.h2.message.DbException.get(DbException.java:172)
	at org.h2.message.DbException.get(DbException.java:149)
	at org.h2.command.Parser.readTableOrView(Parser.java:5071)
	at org.h2.command.Parser.readTableOrView(Parser.java:5049)
	at org.h2.command.Parser.readSimpleTableFilter(Parser.java:737)
	at org.h2.command.Parser.parseUpdate(Parser.java:686)
	at org.h2.command.Parser.parsePrepared(Parser.java:448)
	at org.h2.command.Parser.parse(Parser.java:298)
	at org.h2.command.Parser.parse(Parser.java:270)
	at org.h2.command.Parser.prepareCommand(Parser.java:235)
	at org.h2.engine.Session.prepareLocal(Session.java:436)
	at org.h2.engine.Session.prepareCommand(Session.java:379)
	at org.h2.jdbc.JdbcConnection.prepareCommand(JdbcConnection.java:1138)
	at org.h2.jdbc.JdbcPreparedStatement.<init>(JdbcPreparedStatement.java:70)
	at org.h2.jdbc.JdbcConnection.prepareStatement(JdbcConnection.java:267)
	at sun.reflect.GeneratedMethodAccessor2.invoke(Unknown Source)
	at sun.reflect.DelegatingMethodAccessorImpl.invoke(DelegatingMethodAccessorImpl.java:43)
	at java.lang.reflect.Method.invoke(Method.java:498)
	at org.apache.tomcat.jdbc.pool.ProxyConnection.invoke(ProxyConnection.java:126)
	at org.apache.tomcat.jdbc.pool.JdbcInterceptor.invoke(JdbcInterceptor.java:109)
	at org.apache.tomcat.jdbc.pool.DisposableConnectionFacade.invoke(DisposableConnectionFacade.java:80)
	at com.sun.proxy.$Proxy5.prepareStatement(Unknown Source)
	at org.wso2.appcloud.core.dao.ApplicationDAO.updateReplicationCountForDeployment(ApplicationDAO.java:2506)
	... 35 more
Error while adding runtime property with key : LOG4J_PROPERTIES for version with hash id : 112233 for tenant id : 1
org.wso2.appcloud.common.AppCloudException: Error while updating runtime property Key : LOG4J_PROPERTIES for version with hash id : 112233 in tenant : 1
	at org.wso2.appcloud.core.dao.ApplicationDAO.updateRuntimeProperty(ApplicationDAO.java:496)
	at org.wso2.appcloud.core.ApplicationManager.updateRuntimeProperty(ApplicationManager.java:543)
	at org.wso2.appcloud.core.ApplicationManagerTest.testUpdateRuntimeProperty_shouldThrowException(ApplicationManagerTest.java:714)
	at sun.reflect.NativeMethodAccessorImpl.invoke0(Native Method)
	at sun.reflect.NativeMethodAccessorImpl.invoke(NativeMethodAccessorImpl.java:62)
	at sun.reflect.DelegatingMethodAccessorImpl.invoke(DelegatingMethodAccessorImpl.java:43)
	at java.lang.reflect.Method.invoke(Method.java:498)
	at org.testng.internal.MethodInvocationHelper.invokeMethod(MethodInvocationHelper.java:80)
	at org.testng.internal.Invoker.invokeMethod(Invoker.java:714)
	at org.testng.internal.Invoker.invokeTestMethod(Invoker.java:901)
	at org.testng.internal.Invoker.invokeTestMethods(Invoker.java:1231)
	at org.testng.internal.TestMethodWorker.invokeTestMethods(TestMethodWorker.java:127)
	at org.testng.internal.TestMethodWorker.run(TestMethodWorker.java:111)
	at org.testng.TestRunner.privateRun(TestRunner.java:767)
	at org.testng.TestRunner.run(TestRunner.java:617)
	at org.testng.SuiteRunner.runTest(SuiteRunner.java:334)
	at org.testng.SuiteRunner.runSequentially(SuiteRunner.java:329)
	at org.testng.SuiteRunner.privateRun(SuiteRunner.java:291)
	at org.testng.SuiteRunner.run(SuiteRunner.java:240)
	at org.testng.SuiteRunnerWorker.runSuite(SuiteRunnerWorker.java:52)
	at org.testng.SuiteRunnerWorker.run(SuiteRunnerWorker.java:86)
	at org.testng.TestNG.runSuitesSequentially(TestNG.java:1198)
	at org.testng.TestNG.runSuitesLocally(TestNG.java:1123)
	at org.testng.TestNG.run(TestNG.java:1031)
	at org.apache.maven.surefire.testng.TestNGExecutor.run(TestNGExecutor.java:178)
	at org.apache.maven.surefire.testng.TestNGXmlTestSuite.execute(TestNGXmlTestSuite.java:92)
	at org.apache.maven.surefire.testng.TestNGProvider.invoke(TestNGProvider.java:96)
	at sun.reflect.NativeMethodAccessorImpl.invoke0(Native Method)
	at sun.reflect.NativeMethodAccessorImpl.invoke(NativeMethodAccessorImpl.java:62)
	at sun.reflect.DelegatingMethodAccessorImpl.invoke(DelegatingMethodAccessorImpl.java:43)
	at java.lang.reflect.Method.invoke(Method.java:498)
	at org.apache.maven.surefire.util.ReflectionUtils.invokeMethodWithArray(ReflectionUtils.java:189)
	at org.apache.maven.surefire.booter.ProviderFactory$ProviderProxy.invoke(ProviderFactory.java:165)
	at org.apache.maven.surefire.booter.ProviderFactory.invokeProvider(ProviderFactory.java:85)
	at org.apache.maven.surefire.booter.ForkedBooter.runSuitesInProcess(ForkedBooter.java:115)
	at org.apache.maven.surefire.booter.ForkedBooter.main(ForkedBooter.java:75)
Caused by: org.h2.jdbc.JdbcSQLException: Table "AC_RUNTIME_PROPERTY" not found; SQL statement:
UPDATE AC_RUNTIME_PROPERTY SET name=?, value=? WHERE version_id=(SELECT id FROM AC_VERSION WHERE hash_id=?) AND name=? AND tenant_id=? [42102-175]
	at org.h2.message.DbException.getJdbcSQLException(DbException.java:332)
	at org.h2.message.DbException.get(DbException.java:172)
	at org.h2.message.DbException.get(DbException.java:149)
	at org.h2.command.Parser.readTableOrView(Parser.java:5071)
	at org.h2.command.Parser.readTableOrView(Parser.java:5049)
	at org.h2.command.Parser.readSimpleTableFilter(Parser.java:737)
	at org.h2.command.Parser.parseUpdate(Parser.java:686)
	at org.h2.command.Parser.parsePrepared(Parser.java:448)
	at org.h2.command.Parser.parse(Parser.java:298)
	at org.h2.command.Parser.parse(Parser.java:270)
	at org.h2.command.Parser.prepareCommand(Parser.java:235)
	at org.h2.engine.Session.prepareLocal(Session.java:436)
	at org.h2.engine.Session.prepareCommand(Session.java:379)
	at org.h2.jdbc.JdbcConnection.prepareCommand(JdbcConnection.java:1138)
	at org.h2.jdbc.JdbcPreparedStatement.<init>(JdbcPreparedStatement.java:70)
	at org.h2.jdbc.JdbcConnection.prepareStatement(JdbcConnection.java:267)
	at sun.reflect.GeneratedMethodAccessor2.invoke(Unknown Source)
	at sun.reflect.DelegatingMethodAccessorImpl.invoke(DelegatingMethodAccessorImpl.java:43)
	at java.lang.reflect.Method.invoke(Method.java:498)
	at org.apache.tomcat.jdbc.pool.ProxyConnection.invoke(ProxyConnection.java:126)
	at org.apache.tomcat.jdbc.pool.JdbcInterceptor.invoke(JdbcInterceptor.java:109)
	at org.apache.tomcat.jdbc.pool.DisposableConnectionFacade.invoke(DisposableConnectionFacade.java:80)
	at com.sun.proxy.$Proxy5.prepareStatement(Unknown Source)
	at org.wso2.appcloud.core.dao.ApplicationDAO.updateRuntimeProperty(ApplicationDAO.java:485)
	... 35 more
Error while updating subscription resources for tenant id: 0, cloud : null
org.wso2.appcloud.common.AppCloudException: Error occurred while updating subscription resources  to database in tenant : 0 and cloud : null
	at org.wso2.appcloud.core.dao.ApplicationDAO.updateSubscriptionResources(ApplicationDAO.java:2864)
	at org.wso2.appcloud.core.ApplicationManager.updateSubscriptionResources(ApplicationManager.java:1679)
	at org.wso2.appcloud.core.ApplicationManagerTest.testUpdateSubscriptionResources_shouldThrowException(ApplicationManagerTest.java:408)
	at sun.reflect.NativeMethodAccessorImpl.invoke0(Native Method)
	at sun.reflect.NativeMethodAccessorImpl.invoke(NativeMethodAccessorImpl.java:62)
	at sun.reflect.DelegatingMethodAccessorImpl.invoke(DelegatingMethodAccessorImpl.java:43)
	at java.lang.reflect.Method.invoke(Method.java:498)
	at org.testng.internal.MethodInvocationHelper.invokeMethod(MethodInvocationHelper.java:80)
	at org.testng.internal.Invoker.invokeMethod(Invoker.java:714)
	at org.testng.internal.Invoker.invokeTestMethod(Invoker.java:901)
	at org.testng.internal.Invoker.invokeTestMethods(Invoker.java:1231)
	at org.testng.internal.TestMethodWorker.invokeTestMethods(TestMethodWorker.java:127)
	at org.testng.internal.TestMethodWorker.run(TestMethodWorker.java:111)
	at org.testng.TestRunner.privateRun(TestRunner.java:767)
	at org.testng.TestRunner.run(TestRunner.java:617)
	at org.testng.SuiteRunner.runTest(SuiteRunner.java:334)
	at org.testng.SuiteRunner.runSequentially(SuiteRunner.java:329)
	at org.testng.SuiteRunner.privateRun(SuiteRunner.java:291)
	at org.testng.SuiteRunner.run(SuiteRunner.java:240)
	at org.testng.SuiteRunnerWorker.runSuite(SuiteRunnerWorker.java:52)
	at org.testng.SuiteRunnerWorker.run(SuiteRunnerWorker.java:86)
	at org.testng.TestNG.runSuitesSequentially(TestNG.java:1198)
	at org.testng.TestNG.runSuitesLocally(TestNG.java:1123)
	at org.testng.TestNG.run(TestNG.java:1031)
	at org.apache.maven.surefire.testng.TestNGExecutor.run(TestNGExecutor.java:178)
	at org.apache.maven.surefire.testng.TestNGXmlTestSuite.execute(TestNGXmlTestSuite.java:92)
	at org.apache.maven.surefire.testng.TestNGProvider.invoke(TestNGProvider.java:96)
	at sun.reflect.NativeMethodAccessorImpl.invoke0(Native Method)
	at sun.reflect.NativeMethodAccessorImpl.invoke(NativeMethodAccessorImpl.java:62)
	at sun.reflect.DelegatingMethodAccessorImpl.invoke(DelegatingMethodAccessorImpl.java:43)
	at java.lang.reflect.Method.invoke(Method.java:498)
	at org.apache.maven.surefire.util.ReflectionUtils.invokeMethodWithArray(ReflectionUtils.java:189)
	at org.apache.maven.surefire.booter.ProviderFactory$ProviderProxy.invoke(ProviderFactory.java:165)
	at org.apache.maven.surefire.booter.ProviderFactory.invokeProvider(ProviderFactory.java:85)
	at org.apache.maven.surefire.booter.ForkedBooter.runSuitesInProcess(ForkedBooter.java:115)
	at org.apache.maven.surefire.booter.ForkedBooter.main(ForkedBooter.java:75)
Caused by: org.h2.jdbc.JdbcSQLException: Table "AC_TENANT_SUBSCRIPTION" not found; SQL statement:
UPDATE AC_TENANT_SUBSCRIPTION set max_app_count = ?, max_database_count = ?, max_replica_count = ?, max_memory = ?, max_cpu = ? WHERE tenant_id = ? AND cloud_id = ? [42102-175]
	at org.h2.message.DbException.getJdbcSQLException(DbException.java:332)
	at org.h2.message.DbException.get(DbException.java:172)
	at org.h2.message.DbException.get(DbException.java:149)
	at org.h2.command.Parser.readTableOrView(Parser.java:5071)
	at org.h2.command.Parser.readTableOrView(Parser.java:5049)
	at org.h2.command.Parser.readSimpleTableFilter(Parser.java:737)
	at org.h2.command.Parser.parseUpdate(Parser.java:686)
	at org.h2.command.Parser.parsePrepared(Parser.java:448)
	at org.h2.command.Parser.parse(Parser.java:298)
	at org.h2.command.Parser.parse(Parser.java:270)
	at org.h2.command.Parser.prepareCommand(Parser.java:235)
	at org.h2.engine.Session.prepareLocal(Session.java:436)
	at org.h2.engine.Session.prepareCommand(Session.java:379)
	at org.h2.jdbc.JdbcConnection.prepareCommand(JdbcConnection.java:1138)
	at org.h2.jdbc.JdbcPreparedStatement.<init>(JdbcPreparedStatement.java:70)
	at org.h2.jdbc.JdbcConnection.prepareStatement(JdbcConnection.java:267)
	at sun.reflect.GeneratedMethodAccessor2.invoke(Unknown Source)
	at sun.reflect.DelegatingMethodAccessorImpl.invoke(DelegatingMethodAccessorImpl.java:43)
	at java.lang.reflect.Method.invoke(Method.java:498)
	at org.apache.tomcat.jdbc.pool.ProxyConnection.invoke(ProxyConnection.java:126)
	at org.apache.tomcat.jdbc.pool.JdbcInterceptor.invoke(JdbcInterceptor.java:109)
	at org.apache.tomcat.jdbc.pool.DisposableConnectionFacade.invoke(DisposableConnectionFacade.java:80)
	at com.sun.proxy.$Proxy5.prepareStatement(Unknown Source)
	at org.wso2.appcloud.core.dao.ApplicationDAO.updateSubscriptionResources(ApplicationDAO.java:2849)
	... 35 more
Error while updating subscription for tenant id: 0, cloud : null
org.wso2.appcloud.common.AppCloudException: Error occurred while updating subscription : null to database in tenant : 0 and cloud : null
	at org.wso2.appcloud.core.dao.ApplicationDAO.updateSubscription(ApplicationDAO.java:2669)
	at org.wso2.appcloud.core.ApplicationManager.updateSubscription(ApplicationManager.java:1659)
	at org.wso2.appcloud.core.ApplicationManagerTest.testUpdateSubscription_shouldThrowException(ApplicationManagerTest.java:258)
	at sun.reflect.NativeMethodAccessorImpl.invoke0(Native Method)
	at sun.reflect.NativeMethodAccessorImpl.invoke(NativeMethodAccessorImpl.java:62)
	at sun.reflect.DelegatingMethodAccessorImpl.invoke(DelegatingMethodAccessorImpl.java:43)
	at java.lang.reflect.Method.invoke(Method.java:498)
	at org.testng.internal.MethodInvocationHelper.invokeMethod(MethodInvocationHelper.java:80)
	at org.testng.internal.Invoker.invokeMethod(Invoker.java:714)
	at org.testng.internal.Invoker.invokeTestMethod(Invoker.java:901)
	at org.testng.internal.Invoker.invokeTestMethods(Invoker.java:1231)
	at org.testng.internal.TestMethodWorker.invokeTestMethods(TestMethodWorker.java:127)
	at org.testng.internal.TestMethodWorker.run(TestMethodWorker.java:111)
	at org.testng.TestRunner.privateRun(TestRunner.java:767)
	at org.testng.TestRunner.run(TestRunner.java:617)
	at org.testng.SuiteRunner.runTest(SuiteRunner.java:334)
	at org.testng.SuiteRunner.runSequentially(SuiteRunner.java:329)
	at org.testng.SuiteRunner.privateRun(SuiteRunner.java:291)
	at org.testng.SuiteRunner.run(SuiteRunner.java:240)
	at org.testng.SuiteRunnerWorker.runSuite(SuiteRunnerWorker.java:52)
	at org.testng.SuiteRunnerWorker.run(SuiteRunnerWorker.java:86)
	at org.testng.TestNG.runSuitesSequentially(TestNG.java:1198)
	at org.testng.TestNG.runSuitesLocally(TestNG.java:1123)
	at org.testng.TestNG.run(TestNG.java:1031)
	at org.apache.maven.surefire.testng.TestNGExecutor.run(TestNGExecutor.java:178)
	at org.apache.maven.surefire.testng.TestNGXmlTestSuite.execute(TestNGXmlTestSuite.java:92)
	at org.apache.maven.surefire.testng.TestNGProvider.invoke(TestNGProvider.java:96)
	at sun.reflect.NativeMethodAccessorImpl.invoke0(Native Method)
	at sun.reflect.NativeMethodAccessorImpl.invoke(NativeMethodAccessorImpl.java:62)
	at sun.reflect.DelegatingMethodAccessorImpl.invoke(DelegatingMethodAccessorImpl.java:43)
	at java.lang.reflect.Method.invoke(Method.java:498)
	at org.apache.maven.surefire.util.ReflectionUtils.invokeMethodWithArray(ReflectionUtils.java:189)
	at org.apache.maven.surefire.booter.ProviderFactory$ProviderProxy.invoke(ProviderFactory.java:165)
	at org.apache.maven.surefire.booter.ProviderFactory.invokeProvider(ProviderFactory.java:85)
	at org.apache.maven.surefire.booter.ForkedBooter.runSuitesInProcess(ForkedBooter.java:115)
	at org.apache.maven.surefire.booter.ForkedBooter.main(ForkedBooter.java:75)
Caused by: org.h2.jdbc.JdbcSQLException: Table "AC_TENANT_SUBSCRIPTION" not found; SQL statement:
UPDATE AC_TENANT_SUBSCRIPTION set plan = ?, max_app_count = ?, max_database_count = ?, max_replica_count = ?, max_memory = ?, max_cpu = ?, start_date = ?, end_date = ?, is_white_listed = ?, status = ? WHERE tenant_id = ? AND cloud_id = ? [42102-175]
	at org.h2.message.DbException.getJdbcSQLException(DbException.java:332)
	at org.h2.message.DbException.get(DbException.java:172)
	at org.h2.message.DbException.get(DbException.java:149)
	at org.h2.command.Parser.readTableOrView(Parser.java:5071)
	at org.h2.command.Parser.readTableOrView(Parser.java:5049)
	at org.h2.command.Parser.readSimpleTableFilter(Parser.java:737)
	at org.h2.command.Parser.parseUpdate(Parser.java:686)
	at org.h2.command.Parser.parsePrepared(Parser.java:448)
	at org.h2.command.Parser.parse(Parser.java:298)
	at org.h2.command.Parser.parse(Parser.java:270)
	at org.h2.command.Parser.prepareCommand(Parser.java:235)
	at org.h2.engine.Session.prepareLocal(Session.java:436)
	at org.h2.engine.Session.prepareCommand(Session.java:379)
	at org.h2.jdbc.JdbcConnection.prepareCommand(JdbcConnection.java:1138)
	at org.h2.jdbc.JdbcPreparedStatement.<init>(JdbcPreparedStatement.java:70)
	at org.h2.jdbc.JdbcConnection.prepareStatement(JdbcConnection.java:267)
	at sun.reflect.GeneratedMethodAccessor2.invoke(Unknown Source)
	at sun.reflect.DelegatingMethodAccessorImpl.invoke(DelegatingMethodAccessorImpl.java:43)
	at java.lang.reflect.Method.invoke(Method.java:498)
	at org.apache.tomcat.jdbc.pool.ProxyConnection.invoke(ProxyConnection.java:126)
	at org.apache.tomcat.jdbc.pool.JdbcInterceptor.invoke(JdbcInterceptor.java:109)
	at org.apache.tomcat.jdbc.pool.DisposableConnectionFacade.invoke(DisposableConnectionFacade.java:80)
	at com.sun.proxy.$Proxy5.prepareStatement(Unknown Source)
	at org.wso2.appcloud.core.dao.ApplicationDAO.updateSubscription(ApplicationDAO.java:2648)
	... 35 more
Error while updating tag with the key : developer for version with hash id : 112233 for tenant id : 1
org.wso2.appcloud.common.AppCloudException: Error while updating tag Key : developer for version with hash id : 112233 in tenant : 1
	at org.wso2.appcloud.core.dao.ApplicationDAO.updateTag(ApplicationDAO.java:529)
	at org.wso2.appcloud.core.ApplicationManager.updateTag(ApplicationManager.java:574)
	at org.wso2.appcloud.core.ApplicationManagerTest.testUpdateTag_shouldThrowException(ApplicationManagerTest.java:748)
	at sun.reflect.NativeMethodAccessorImpl.invoke0(Native Method)
	at sun.reflect.NativeMethodAccessorImpl.invoke(NativeMethodAccessorImpl.java:62)
	at sun.reflect.DelegatingMethodAccessorImpl.invoke(DelegatingMethodAccessorImpl.java:43)
	at java.lang.reflect.Method.invoke(Method.java:498)
	at org.testng.internal.MethodInvocationHelper.invokeMethod(MethodInvocationHelper.java:80)
	at org.testng.internal.Invoker.invokeMethod(Invoker.java:714)
	at org.testng.internal.Invoker.invokeTestMethod(Invoker.java:901)
	at org.testng.internal.Invoker.invokeTestMethods(Invoker.java:1231)
	at org.testng.internal.TestMethodWorker.invokeTestMethods(TestMethodWorker.java:127)
	at org.testng.internal.TestMethodWorker.run(TestMethodWorker.java:111)
	at org.testng.TestRunner.privateRun(TestRunner.java:767)
	at org.testng.TestRunner.run(TestRunner.java:617)
	at org.testng.SuiteRunner.runTest(SuiteRunner.java:334)
	at org.testng.SuiteRunner.runSequentially(SuiteRunner.java:329)
	at org.testng.SuiteRunner.privateRun(SuiteRunner.java:291)
	at org.testng.SuiteRunner.run(SuiteRunner.java:240)
	at org.testng.SuiteRunnerWorker.runSuite(SuiteRunnerWorker.java:52)
	at org.testng.SuiteRunnerWorker.run(SuiteRunnerWorker.java:86)
	at org.testng.TestNG.runSuitesSequentially(TestNG.java:1198)
	at org.testng.TestNG.runSuitesLocally(TestNG.java:1123)
	at org.testng.TestNG.run(TestNG.java:1031)
	at org.apache.maven.surefire.testng.TestNGExecutor.run(TestNGExecutor.java:178)
	at org.apache.maven.surefire.testng.TestNGXmlTestSuite.execute(TestNGXmlTestSuite.java:92)
	at org.apache.maven.surefire.testng.TestNGProvider.invoke(TestNGProvider.java:96)
	at sun.reflect.NativeMethodAccessorImpl.invoke0(Native Method)
	at sun.reflect.NativeMethodAccessorImpl.invoke(NativeMethodAccessorImpl.java:62)
	at sun.reflect.DelegatingMethodAccessorImpl.invoke(DelegatingMethodAccessorImpl.java:43)
	at java.lang.reflect.Method.invoke(Method.java:498)
	at org.apache.maven.surefire.util.ReflectionUtils.invokeMethodWithArray(ReflectionUtils.java:189)
	at org.apache.maven.surefire.booter.ProviderFactory$ProviderProxy.invoke(ProviderFactory.java:165)
	at org.apache.maven.surefire.booter.ProviderFactory.invokeProvider(ProviderFactory.java:85)
	at org.apache.maven.surefire.booter.ForkedBooter.runSuitesInProcess(ForkedBooter.java:115)
	at org.apache.maven.surefire.booter.ForkedBooter.main(ForkedBooter.java:75)
Caused by: org.h2.jdbc.JdbcSQLException: Table "AC_TAG" not found; SQL statement:
UPDATE AC_TAG SET name=?, value=? WHERE version_id=(SELECT id FROM AC_VERSION WHERE hash_id=?) AND name=? AND tenant_id=? [42102-175]
	at org.h2.message.DbException.getJdbcSQLException(DbException.java:332)
	at org.h2.message.DbException.get(DbException.java:172)
	at org.h2.message.DbException.get(DbException.java:149)
	at org.h2.command.Parser.readTableOrView(Parser.java:5071)
	at org.h2.command.Parser.readTableOrView(Parser.java:5049)
	at org.h2.command.Parser.readSimpleTableFilter(Parser.java:737)
	at org.h2.command.Parser.parseUpdate(Parser.java:686)
	at org.h2.command.Parser.parsePrepared(Parser.java:448)
	at org.h2.command.Parser.parse(Parser.java:298)
	at org.h2.command.Parser.parse(Parser.java:270)
	at org.h2.command.Parser.prepareCommand(Parser.java:235)
	at org.h2.engine.Session.prepareLocal(Session.java:436)
	at org.h2.engine.Session.prepareCommand(Session.java:379)
	at org.h2.jdbc.JdbcConnection.prepareCommand(JdbcConnection.java:1138)
	at org.h2.jdbc.JdbcPreparedStatement.<init>(JdbcPreparedStatement.java:70)
	at org.h2.jdbc.JdbcConnection.prepareStatement(JdbcConnection.java:267)
	at sun.reflect.GeneratedMethodAccessor2.invoke(Unknown Source)
	at sun.reflect.DelegatingMethodAccessorImpl.invoke(DelegatingMethodAccessorImpl.java:43)
	at java.lang.reflect.Method.invoke(Method.java:498)
	at org.apache.tomcat.jdbc.pool.ProxyConnection.invoke(ProxyConnection.java:126)
	at org.apache.tomcat.jdbc.pool.JdbcInterceptor.invoke(JdbcInterceptor.java:109)
	at org.apache.tomcat.jdbc.pool.DisposableConnectionFacade.invoke(DisposableConnectionFacade.java:80)
	at com.sun.proxy.$Proxy5.prepareStatement(Unknown Source)
	at org.wso2.appcloud.core.dao.ApplicationDAO.updateTag(ApplicationDAO.java:518)
	... 35 more
Error while checking for the exposure level for application version: 112233 and tenant id: 1.
org.wso2.appcloud.common.AppCloudException: Error while updating application exposure level : private for version with the hash id : 112233 in tenant : 1
	at org.wso2.appcloud.core.dao.ApplicationDAO.updateVersionExposureLevel(ApplicationDAO.java:2423)
	at org.wso2.appcloud.core.ApplicationManager.updateVersionExposureLevel(ApplicationManager.java:1506)
	at org.wso2.appcloud.core.ApplicationManagerTest.testUpdateVersionExposureLevel_shouldThrowException(ApplicationManagerTest.java:292)
	at sun.reflect.NativeMethodAccessorImpl.invoke0(Native Method)
	at sun.reflect.NativeMethodAccessorImpl.invoke(NativeMethodAccessorImpl.java:62)
	at sun.reflect.DelegatingMethodAccessorImpl.invoke(DelegatingMethodAccessorImpl.java:43)
	at java.lang.reflect.Method.invoke(Method.java:498)
	at org.testng.internal.MethodInvocationHelper.invokeMethod(MethodInvocationHelper.java:80)
	at org.testng.internal.Invoker.invokeMethod(Invoker.java:714)
	at org.testng.internal.Invoker.invokeTestMethod(Invoker.java:901)
	at org.testng.internal.Invoker.invokeTestMethods(Invoker.java:1231)
	at org.testng.internal.TestMethodWorker.invokeTestMethods(TestMethodWorker.java:127)
	at org.testng.internal.TestMethodWorker.run(TestMethodWorker.java:111)
	at org.testng.TestRunner.privateRun(TestRunner.java:767)
	at org.testng.TestRunner.run(TestRunner.java:617)
	at org.testng.SuiteRunner.runTest(SuiteRunner.java:334)
	at org.testng.SuiteRunner.runSequentially(SuiteRunner.java:329)
	at org.testng.SuiteRunner.privateRun(SuiteRunner.java:291)
	at org.testng.SuiteRunner.run(SuiteRunner.java:240)
	at org.testng.SuiteRunnerWorker.runSuite(SuiteRunnerWorker.java:52)
	at org.testng.SuiteRunnerWorker.run(SuiteRunnerWorker.java:86)
	at org.testng.TestNG.runSuitesSequentially(TestNG.java:1198)
	at org.testng.TestNG.runSuitesLocally(TestNG.java:1123)
	at org.testng.TestNG.run(TestNG.java:1031)
	at org.apache.maven.surefire.testng.TestNGExecutor.run(TestNGExecutor.java:178)
	at org.apache.maven.surefire.testng.TestNGXmlTestSuite.execute(TestNGXmlTestSuite.java:92)
	at org.apache.maven.surefire.testng.TestNGProvider.invoke(TestNGProvider.java:96)
	at sun.reflect.NativeMethodAccessorImpl.invoke0(Native Method)
	at sun.reflect.NativeMethodAccessorImpl.invoke(NativeMethodAccessorImpl.java:62)
	at sun.reflect.DelegatingMethodAccessorImpl.invoke(DelegatingMethodAccessorImpl.java:43)
	at java.lang.reflect.Method.invoke(Method.java:498)
	at org.apache.maven.surefire.util.ReflectionUtils.invokeMethodWithArray(ReflectionUtils.java:189)
	at org.apache.maven.surefire.booter.ProviderFactory$ProviderProxy.invoke(ProviderFactory.java:165)
	at org.apache.maven.surefire.booter.ProviderFactory.invokeProvider(ProviderFactory.java:85)
	at org.apache.maven.surefire.booter.ForkedBooter.runSuitesInProcess(ForkedBooter.java:115)
	at org.apache.maven.surefire.booter.ForkedBooter.main(ForkedBooter.java:75)
Caused by: org.h2.jdbc.JdbcSQLException: Table "AC_VERSION" not found; SQL statement:
UPDATE AC_VERSION SET exposure_level=? WHERE hash_id=? AND tenant_id=? [42102-175]
	at org.h2.message.DbException.getJdbcSQLException(DbException.java:332)
	at org.h2.message.DbException.get(DbException.java:172)
	at org.h2.message.DbException.get(DbException.java:149)
	at org.h2.command.Parser.readTableOrView(Parser.java:5071)
	at org.h2.command.Parser.readTableOrView(Parser.java:5049)
	at org.h2.command.Parser.readSimpleTableFilter(Parser.java:737)
	at org.h2.command.Parser.parseUpdate(Parser.java:686)
	at org.h2.command.Parser.parsePrepared(Parser.java:448)
	at org.h2.command.Parser.parse(Parser.java:298)
	at org.h2.command.Parser.parse(Parser.java:270)
	at org.h2.command.Parser.prepareCommand(Parser.java:235)
	at org.h2.engine.Session.prepareLocal(Session.java:436)
	at org.h2.engine.Session.prepareCommand(Session.java:379)
	at org.h2.jdbc.JdbcConnection.prepareCommand(JdbcConnection.java:1138)
	at org.h2.jdbc.JdbcPreparedStatement.<init>(JdbcPreparedStatement.java:70)
	at org.h2.jdbc.JdbcConnection.prepareStatement(JdbcConnection.java:267)
	at sun.reflect.GeneratedMethodAccessor2.invoke(Unknown Source)
	at sun.reflect.DelegatingMethodAccessorImpl.invoke(DelegatingMethodAccessorImpl.java:43)
	at java.lang.reflect.Method.invoke(Method.java:498)
	at org.apache.tomcat.jdbc.pool.ProxyConnection.invoke(ProxyConnection.java:126)
	at org.apache.tomcat.jdbc.pool.JdbcInterceptor.invoke(JdbcInterceptor.java:109)
	at org.apache.tomcat.jdbc.pool.DisposableConnectionFacade.invoke(DisposableConnectionFacade.java:80)
	at com.sun.proxy.$Proxy5.prepareStatement(Unknown Source)
	at org.wso2.appcloud.core.dao.ApplicationDAO.updateVersionExposureLevel(ApplicationDAO.java:2414)
	... 35 more
Error while updating version status with status : stopped for version with hash id : 112233 for tenant id : 1
org.wso2.appcloud.common.AppCloudException: Error while updating application status : stopped for version with the hash id : 112233 in tenant : 1
	at org.wso2.appcloud.core.dao.ApplicationDAO.updateVersionStatus(ApplicationDAO.java:464)
	at org.wso2.appcloud.core.ApplicationManager.updateVersionStatus(ApplicationManager.java:755)
	at org.wso2.appcloud.core.ApplicationManagerTest.testUpdateVersionStatus_shouldThrowException(ApplicationManagerTest.java:681)
	at sun.reflect.NativeMethodAccessorImpl.invoke0(Native Method)
	at sun.reflect.NativeMethodAccessorImpl.invoke(NativeMethodAccessorImpl.java:62)
	at sun.reflect.DelegatingMethodAccessorImpl.invoke(DelegatingMethodAccessorImpl.java:43)
	at java.lang.reflect.Method.invoke(Method.java:498)
	at org.testng.internal.MethodInvocationHelper.invokeMethod(MethodInvocationHelper.java:80)
	at org.testng.internal.Invoker.invokeMethod(Invoker.java:714)
	at org.testng.internal.Invoker.invokeTestMethod(Invoker.java:901)
	at org.testng.internal.Invoker.invokeTestMethods(Invoker.java:1231)
	at org.testng.internal.TestMethodWorker.invokeTestMethods(TestMethodWorker.java:127)
	at org.testng.internal.TestMethodWorker.run(TestMethodWorker.java:111)
	at org.testng.TestRunner.privateRun(TestRunner.java:767)
	at org.testng.TestRunner.run(TestRunner.java:617)
	at org.testng.SuiteRunner.runTest(SuiteRunner.java:334)
	at org.testng.SuiteRunner.runSequentially(SuiteRunner.java:329)
	at org.testng.SuiteRunner.privateRun(SuiteRunner.java:291)
	at org.testng.SuiteRunner.run(SuiteRunner.java:240)
	at org.testng.SuiteRunnerWorker.runSuite(SuiteRunnerWorker.java:52)
	at org.testng.SuiteRunnerWorker.run(SuiteRunnerWorker.java:86)
	at org.testng.TestNG.runSuitesSequentially(TestNG.java:1198)
	at org.testng.TestNG.runSuitesLocally(TestNG.java:1123)
	at org.testng.TestNG.run(TestNG.java:1031)
	at org.apache.maven.surefire.testng.TestNGExecutor.run(TestNGExecutor.java:178)
	at org.apache.maven.surefire.testng.TestNGXmlTestSuite.execute(TestNGXmlTestSuite.java:92)
	at org.apache.maven.surefire.testng.TestNGProvider.invoke(TestNGProvider.java:96)
	at sun.reflect.NativeMethodAccessorImpl.invoke0(Native Method)
	at sun.reflect.NativeMethodAccessorImpl.invoke(NativeMethodAccessorImpl.java:62)
	at sun.reflect.DelegatingMethodAccessorImpl.invoke(DelegatingMethodAccessorImpl.java:43)
	at java.lang.reflect.Method.invoke(Method.java:498)
	at org.apache.maven.surefire.util.ReflectionUtils.invokeMethodWithArray(ReflectionUtils.java:189)
	at org.apache.maven.surefire.booter.ProviderFactory$ProviderProxy.invoke(ProviderFactory.java:165)
	at org.apache.maven.surefire.booter.ProviderFactory.invokeProvider(ProviderFactory.java:85)
	at org.apache.maven.surefire.booter.ForkedBooter.runSuitesInProcess(ForkedBooter.java:115)
	at org.apache.maven.surefire.booter.ForkedBooter.main(ForkedBooter.java:75)
Caused by: org.h2.jdbc.JdbcSQLException: Table "AC_VERSION" not found; SQL statement:
UPDATE AC_VERSION SET status=? WHERE hash_id=? AND tenant_id=? [42102-175]
	at org.h2.message.DbException.getJdbcSQLException(DbException.java:332)
	at org.h2.message.DbException.get(DbException.java:172)
	at org.h2.message.DbException.get(DbException.java:149)
	at org.h2.command.Parser.readTableOrView(Parser.java:5071)
	at org.h2.command.Parser.readTableOrView(Parser.java:5049)
	at org.h2.command.Parser.readSimpleTableFilter(Parser.java:737)
	at org.h2.command.Parser.parseUpdate(Parser.java:686)
	at org.h2.command.Parser.parsePrepared(Parser.java:448)
	at org.h2.command.Parser.parse(Parser.java:298)
	at org.h2.command.Parser.parse(Parser.java:270)
	at org.h2.command.Parser.prepareCommand(Parser.java:235)
	at org.h2.engine.Session.prepareLocal(Session.java:436)
	at org.h2.engine.Session.prepareCommand(Session.java:379)
	at org.h2.jdbc.JdbcConnection.prepareCommand(JdbcConnection.java:1138)
	at org.h2.jdbc.JdbcPreparedStatement.<init>(JdbcPreparedStatement.java:70)
	at org.h2.jdbc.JdbcConnection.prepareStatement(JdbcConnection.java:267)
	at sun.reflect.GeneratedMethodAccessor2.invoke(Unknown Source)
	at sun.reflect.DelegatingMethodAccessorImpl.invoke(DelegatingMethodAccessorImpl.java:43)
	at java.lang.reflect.Method.invoke(Method.java:498)
	at org.apache.tomcat.jdbc.pool.ProxyConnection.invoke(ProxyConnection.java:126)
	at org.apache.tomcat.jdbc.pool.JdbcInterceptor.invoke(JdbcInterceptor.java:109)
	at org.apache.tomcat.jdbc.pool.DisposableConnectionFacade.invoke(DisposableConnectionFacade.java:80)
	at com.sun.proxy.$Proxy5.prepareStatement(Unknown Source)
	at org.wso2.appcloud.core.dao.ApplicationDAO.updateVersionStatus(ApplicationDAO.java:455)
	... 35 more
Error while upgrading subscription for tenant id: 0, cloud : null
org.wso2.appcloud.common.AppCloudException: Error occurred while upgrading tenant subscription to database in tenant : 0 and cloud : null
	at org.wso2.appcloud.core.dao.ApplicationDAO.upgradeSubscriptionPlan(ApplicationDAO.java:2892)
	at org.wso2.appcloud.core.ApplicationManager.upgradeSubscriptionPlan(ApplicationManager.java:1699)
	at org.wso2.appcloud.core.ApplicationManagerTest.testUpgradeSubscriptionPlan_shouldThrowException(ApplicationManagerTest.java:215)
	at sun.reflect.NativeMethodAccessorImpl.invoke0(Native Method)
	at sun.reflect.NativeMethodAccessorImpl.invoke(NativeMethodAccessorImpl.java:62)
	at sun.reflect.DelegatingMethodAccessorImpl.invoke(DelegatingMethodAccessorImpl.java:43)
	at java.lang.reflect.Method.invoke(Method.java:498)
	at org.testng.internal.MethodInvocationHelper.invokeMethod(MethodInvocationHelper.java:80)
	at org.testng.internal.Invoker.invokeMethod(Invoker.java:714)
	at org.testng.internal.Invoker.invokeTestMethod(Invoker.java:901)
	at org.testng.internal.Invoker.invokeTestMethods(Invoker.java:1231)
	at org.testng.internal.TestMethodWorker.invokeTestMethods(TestMethodWorker.java:127)
	at org.testng.internal.TestMethodWorker.run(TestMethodWorker.java:111)
	at org.testng.TestRunner.privateRun(TestRunner.java:767)
	at org.testng.TestRunner.run(TestRunner.java:617)
	at org.testng.SuiteRunner.runTest(SuiteRunner.java:334)
	at org.testng.SuiteRunner.runSequentially(SuiteRunner.java:329)
	at org.testng.SuiteRunner.privateRun(SuiteRunner.java:291)
	at org.testng.SuiteRunner.run(SuiteRunner.java:240)
	at org.testng.SuiteRunnerWorker.runSuite(SuiteRunnerWorker.java:52)
	at org.testng.SuiteRunnerWorker.run(SuiteRunnerWorker.java:86)
	at org.testng.TestNG.runSuitesSequentially(TestNG.java:1198)
	at org.testng.TestNG.runSuitesLocally(TestNG.java:1123)
	at org.testng.TestNG.run(TestNG.java:1031)
	at org.apache.maven.surefire.testng.TestNGExecutor.run(TestNGExecutor.java:178)
	at org.apache.maven.surefire.testng.TestNGXmlTestSuite.execute(TestNGXmlTestSuite.java:92)
	at org.apache.maven.surefire.testng.TestNGProvider.invoke(TestNGProvider.java:96)
	at sun.reflect.NativeMethodAccessorImpl.invoke0(Native Method)
	at sun.reflect.NativeMethodAccessorImpl.invoke(NativeMethodAccessorImpl.java:62)
	at sun.reflect.DelegatingMethodAccessorImpl.invoke(DelegatingMethodAccessorImpl.java:43)
	at java.lang.reflect.Method.invoke(Method.java:498)
	at org.apache.maven.surefire.util.ReflectionUtils.invokeMethodWithArray(ReflectionUtils.java:189)
	at org.apache.maven.surefire.booter.ProviderFactory$ProviderProxy.invoke(ProviderFactory.java:165)
	at org.apache.maven.surefire.booter.ProviderFactory.invokeProvider(ProviderFactory.java:85)
	at org.apache.maven.surefire.booter.ForkedBooter.runSuitesInProcess(ForkedBooter.java:115)
	at org.apache.maven.surefire.booter.ForkedBooter.main(ForkedBooter.java:75)
Caused by: org.h2.jdbc.JdbcSQLException: Table "AC_TENANT_SUBSCRIPTION" not found; SQL statement:
UPDATE AC_TENANT_SUBSCRIPTION set plan = ?, end_date = ? WHERE tenant_id = ? AND cloud_id = ? [42102-175]
	at org.h2.message.DbException.getJdbcSQLException(DbException.java:332)
	at org.h2.message.DbException.get(DbException.java:172)
	at org.h2.message.DbException.get(DbException.java:149)
	at org.h2.command.Parser.readTableOrView(Parser.java:5071)
	at org.h2.command.Parser.readTableOrView(Parser.java:5049)
	at org.h2.command.Parser.readSimpleTableFilter(Parser.java:737)
	at org.h2.command.Parser.parseUpdate(Parser.java:686)
	at org.h2.command.Parser.parsePrepared(Parser.java:448)
	at org.h2.command.Parser.parse(Parser.java:298)
	at org.h2.command.Parser.parse(Parser.java:270)
	at org.h2.command.Parser.prepareCommand(Parser.java:235)
	at org.h2.engine.Session.prepareLocal(Session.java:436)
	at org.h2.engine.Session.prepareCommand(Session.java:379)
	at org.h2.jdbc.JdbcConnection.prepareCommand(JdbcConnection.java:1138)
	at org.h2.jdbc.JdbcPreparedStatement.<init>(JdbcPreparedStatement.java:70)
	at org.h2.jdbc.JdbcConnection.prepareStatement(JdbcConnection.java:267)
	at sun.reflect.GeneratedMethodAccessor2.invoke(Unknown Source)
	at sun.reflect.DelegatingMethodAccessorImpl.invoke(DelegatingMethodAccessorImpl.java:43)
	at java.lang.reflect.Method.invoke(Method.java:498)
	at org.apache.tomcat.jdbc.pool.ProxyConnection.invoke(ProxyConnection.java:126)
	at org.apache.tomcat.jdbc.pool.JdbcInterceptor.invoke(JdbcInterceptor.java:109)
	at org.apache.tomcat.jdbc.pool.DisposableConnectionFacade.invoke(DisposableConnectionFacade.java:80)
	at com.sun.proxy.$Proxy5.prepareStatement(Unknown Source)
	at org.wso2.appcloud.core.dao.ApplicationDAO.upgradeSubscriptionPlan(ApplicationDAO.java:2880)
	... 35 more
Tests run: 109, Failures: 0, Errors: 0, Skipped: 0, Time elapsed: 2.25 sec

Results :

Tests run: 109, Failures: 0, Errors: 0, Skipped: 0

[JENKINS] Recording test results
[INFO] 
[INFO] --- jacoco-maven-plugin:0.8.7:report (jacoco-site) @ org.wso2.appcloud.core ---
[INFO] Loading execution data file /home/jenkins/workspace/sonar-app-cloud/modules/components/org.wso2.appcloud.core/target/coverage-reports/jacoco-unit.exec
[INFO] Analyzed bundle 'WSO2 AppCloud Components - Core' with 35 classes
[INFO] 
[INFO] --- maven-bundle-plugin:2.3.5:bundle (default-bundle) @ org.wso2.appcloud.core ---
[INFO] 
[INFO] --- maven-install-plugin:2.5.2:install (default-install) @ org.wso2.appcloud.core ---
[INFO] Installing /home/jenkins/workspace/sonar-app-cloud/modules/components/org.wso2.appcloud.core/target/org.wso2.appcloud.core-3.0.0-SNAPSHOT.jar to /home/jenkins/workspace/sonar-app-cloud/.repository/org/wso2/appcloud/org.wso2.appcloud.core/3.0.0-SNAPSHOT/org.wso2.appcloud.core-3.0.0-SNAPSHOT.jar
[INFO] Installing /home/jenkins/workspace/sonar-app-cloud/modules/components/org.wso2.appcloud.core/pom.xml to /home/jenkins/workspace/sonar-app-cloud/.repository/org/wso2/appcloud/org.wso2.appcloud.core/3.0.0-SNAPSHOT/org.wso2.appcloud.core-3.0.0-SNAPSHOT.pom
[INFO] 
[INFO] --- maven-bundle-plugin:2.3.5:install (default-install) @ org.wso2.appcloud.core ---
[INFO] Local OBR update disabled (enable with -DobrRepository)
[INFO] 
[INFO] ------< org.wso2.appcloud:org.wso2.appcloud.provisioning.runtime >------
[INFO] Building WSO2 AppCloud Components - Runtime provisioning 3.0.0-SNAPSHOT [4/6]
[INFO] -------------------------------[ bundle ]-------------------------------
[INFO] Downloading from wso2.releases: http://maven.wso2.org/nexus/content/repositories/releases/org/apache/maven/plugins/maven-compiler-plugin/3.8.1/maven-compiler-plugin-3.8.1.pom
[INFO] Downloading from wso2-nexus: http://maven.wso2.org/nexus/content/groups/wso2-public/org/apache/maven/plugins/maven-compiler-plugin/3.8.1/maven-compiler-plugin-3.8.1.pom
[INFO] Downloaded from wso2-nexus: http://maven.wso2.org/nexus/content/groups/wso2-public/org/apache/maven/plugins/maven-compiler-plugin/3.8.1/maven-compiler-plugin-3.8.1.pom (12 kB at 2.5 MB/s)
[INFO] Downloading from wso2.releases: http://maven.wso2.org/nexus/content/repositories/releases/org/apache/maven/plugins/maven-plugins/33/maven-plugins-33.pom
[INFO] Downloading from wso2-nexus: http://maven.wso2.org/nexus/content/groups/wso2-public/org/apache/maven/plugins/maven-plugins/33/maven-plugins-33.pom
[INFO] Downloaded from wso2-nexus: http://maven.wso2.org/nexus/content/groups/wso2-public/org/apache/maven/plugins/maven-plugins/33/maven-plugins-33.pom (11 kB at 2.7 MB/s)
[INFO] Downloading from wso2.releases: http://maven.wso2.org/nexus/content/repositories/releases/org/apache/maven/maven-parent/33/maven-parent-33.pom
[INFO] Downloading from wso2-nexus: http://maven.wso2.org/nexus/content/groups/wso2-public/org/apache/maven/maven-parent/33/maven-parent-33.pom
[INFO] Downloaded from wso2-nexus: http://maven.wso2.org/nexus/content/groups/wso2-public/org/apache/maven/maven-parent/33/maven-parent-33.pom (44 kB at 8.8 MB/s)
[INFO] Downloading from wso2.releases: http://maven.wso2.org/nexus/content/repositories/releases/org/apache/maven/plugins/maven-compiler-plugin/3.8.1/maven-compiler-plugin-3.8.1.jar
[INFO] Downloading from wso2-nexus: http://maven.wso2.org/nexus/content/groups/wso2-public/org/apache/maven/plugins/maven-compiler-plugin/3.8.1/maven-compiler-plugin-3.8.1.jar
[INFO] Downloaded from wso2-nexus: http://maven.wso2.org/nexus/content/groups/wso2-public/org/apache/maven/plugins/maven-compiler-plugin/3.8.1/maven-compiler-plugin-3.8.1.jar (62 kB at 12 MB/s)
[INFO] Downloading from wso2.releases: http://maven.wso2.org/nexus/content/repositories/releases/org/apache/maven/plugins/maven-surefire-plugin/2.18/maven-surefire-plugin-2.18.pom
[INFO] Downloading from wso2-nexus: http://maven.wso2.org/nexus/content/groups/wso2-public/org/apache/maven/plugins/maven-surefire-plugin/2.18/maven-surefire-plugin-2.18.pom
[INFO] Downloaded from wso2-nexus: http://maven.wso2.org/nexus/content/groups/wso2-public/org/apache/maven/plugins/maven-surefire-plugin/2.18/maven-surefire-plugin-2.18.pom (5.6 kB at 1.4 MB/s)
[INFO] Downloading from wso2.releases: http://maven.wso2.org/nexus/content/repositories/releases/org/apache/maven/surefire/surefire/2.18/surefire-2.18.pom
[INFO] Downloading from wso2-nexus: http://maven.wso2.org/nexus/content/groups/wso2-public/org/apache/maven/surefire/surefire/2.18/surefire-2.18.pom
[INFO] Downloaded from wso2-nexus: http://maven.wso2.org/nexus/content/groups/wso2-public/org/apache/maven/surefire/surefire/2.18/surefire-2.18.pom (17 kB at 5.6 MB/s)
[INFO] Downloading from wso2.releases: http://maven.wso2.org/nexus/content/repositories/releases/org/apache/maven/plugins/maven-surefire-plugin/2.18/maven-surefire-plugin-2.18.jar
[INFO] Downloading from wso2-nexus: http://maven.wso2.org/nexus/content/groups/wso2-public/org/apache/maven/plugins/maven-surefire-plugin/2.18/maven-surefire-plugin-2.18.jar
[INFO] Downloaded from wso2-nexus: http://maven.wso2.org/nexus/content/groups/wso2-public/org/apache/maven/plugins/maven-surefire-plugin/2.18/maven-surefire-plugin-2.18.jar (36 kB at 7.3 MB/s)
[INFO] Downloading from wso2.releases: https://maven.wso2.org/nexus/content/repositories/releases/org/testng/testng/6.8.1/testng-6.8.1.pom
[INFO] Downloading from wso2-nexus: https://maven.wso2.org/nexus/content/groups/wso2-public/org/testng/testng/6.8.1/testng-6.8.1.pom
[INFO] Downloaded from wso2-nexus: https://maven.wso2.org/nexus/content/groups/wso2-public/org/testng/testng/6.8.1/testng-6.8.1.pom (7.2 kB at 106 kB/s)
[INFO] Downloading from wso2.releases: https://maven.wso2.org/nexus/content/repositories/releases/com/google/cloud/google-cloud-logging/1.8.0/google-cloud-logging-1.8.0.pom
[INFO] Downloading from wso2-nexus: https://maven.wso2.org/nexus/content/groups/wso2-public/com/google/cloud/google-cloud-logging/1.8.0/google-cloud-logging-1.8.0.pom
[INFO] Downloaded from wso2-nexus: https://maven.wso2.org/nexus/content/groups/wso2-public/com/google/cloud/google-cloud-logging/1.8.0/google-cloud-logging-1.8.0.pom (5.5 kB at 14 kB/s)
[INFO] Downloading from wso2.releases: https://maven.wso2.org/nexus/content/repositories/releases/com/google/cloud/google-cloud-pom/0.26.0-alpha/google-cloud-pom-0.26.0-alpha.pom
[INFO] Downloading from wso2-nexus: https://maven.wso2.org/nexus/content/groups/wso2-public/com/google/cloud/google-cloud-pom/0.26.0-alpha/google-cloud-pom-0.26.0-alpha.pom
[INFO] Downloaded from wso2-nexus: https://maven.wso2.org/nexus/content/groups/wso2-public/com/google/cloud/google-cloud-pom/0.26.0-alpha/google-cloud-pom-0.26.0-alpha.pom (49 kB at 263 kB/s)
[INFO] Downloading from wso2.releases: https://maven.wso2.org/nexus/content/repositories/releases/io/netty/netty-tcnative-boringssl-static/2.0.3.Final/netty-tcnative-boringssl-static-2.0.3.Final.pom
[INFO] Downloading from wso2-nexus: https://maven.wso2.org/nexus/content/groups/wso2-public/io/netty/netty-tcnative-boringssl-static/2.0.3.Final/netty-tcnative-boringssl-static-2.0.3.Final.pom
[INFO] Downloaded from wso2-nexus: https://maven.wso2.org/nexus/content/groups/wso2-public/io/netty/netty-tcnative-boringssl-static/2.0.3.Final/netty-tcnative-boringssl-static-2.0.3.Final.pom (22 kB at 1.2 MB/s)
[INFO] Downloading from wso2.releases: https://maven.wso2.org/nexus/content/repositories/releases/io/netty/netty-tcnative-parent/2.0.3.Final/netty-tcnative-parent-2.0.3.Final.pom
[INFO] Downloading from wso2-nexus: https://maven.wso2.org/nexus/content/groups/wso2-public/io/netty/netty-tcnative-parent/2.0.3.Final/netty-tcnative-parent-2.0.3.Final.pom
[INFO] Downloaded from wso2-nexus: https://maven.wso2.org/nexus/content/groups/wso2-public/io/netty/netty-tcnative-parent/2.0.3.Final/netty-tcnative-parent-2.0.3.Final.pom (20 kB at 1.2 MB/s)
[INFO] Downloading from wso2.releases: https://maven.wso2.org/nexus/content/repositories/releases/io/netty/netty-parent/4.0.18.Final/netty-parent-4.0.18.Final.pom
[INFO] Downloading from wso2-nexus: https://maven.wso2.org/nexus/content/groups/wso2-public/io/netty/netty-parent/4.0.18.Final/netty-parent-4.0.18.Final.pom
[INFO] Downloaded from wso2-nexus: https://maven.wso2.org/nexus/content/groups/wso2-public/io/netty/netty-parent/4.0.18.Final/netty-parent-4.0.18.Final.pom (32 kB at 2.3 MB/s)
[INFO] Downloading from wso2.releases: https://maven.wso2.org/nexus/content/repositories/releases/com/google/cloud/google-cloud-core/1.8.0/google-cloud-core-1.8.0.pom
[INFO] Downloading from wso2-nexus: https://maven.wso2.org/nexus/content/groups/wso2-public/com/google/cloud/google-cloud-core/1.8.0/google-cloud-core-1.8.0.pom
[INFO] Downloaded from wso2-nexus: https://maven.wso2.org/nexus/content/groups/wso2-public/com/google/cloud/google-cloud-core/1.8.0/google-cloud-core-1.8.0.pom (4.1 kB at 75 kB/s)
[INFO] Downloading from wso2.releases: https://maven.wso2.org/nexus/content/repositories/releases/com/google/guava/guava/20.0/guava-20.0.pom
[INFO] Downloading from wso2-nexus: https://maven.wso2.org/nexus/content/groups/wso2-public/com/google/guava/guava/20.0/guava-20.0.pom
[INFO] Downloaded from wso2-nexus: https://maven.wso2.org/nexus/content/groups/wso2-public/com/google/guava/guava/20.0/guava-20.0.pom (6.8 kB at 526 kB/s)
[INFO] Downloading from wso2.releases: https://maven.wso2.org/nexus/content/repositories/releases/com/google/guava/guava-parent/20.0/guava-parent-20.0.pom
[INFO] Downloading from wso2-nexus: https://maven.wso2.org/nexus/content/groups/wso2-public/com/google/guava/guava-parent/20.0/guava-parent-20.0.pom
[INFO] Downloaded from wso2-nexus: https://maven.wso2.org/nexus/content/groups/wso2-public/com/google/guava/guava-parent/20.0/guava-parent-20.0.pom (9.9 kB at 761 kB/s)
[INFO] Downloading from wso2.releases: https://maven.wso2.org/nexus/content/repositories/releases/joda-time/joda-time/2.9.2/joda-time-2.9.2.pom
[INFO] Downloading from wso2-nexus: https://maven.wso2.org/nexus/content/groups/wso2-public/joda-time/joda-time/2.9.2/joda-time-2.9.2.pom
[INFO] Downloaded from wso2-nexus: https://maven.wso2.org/nexus/content/groups/wso2-public/joda-time/joda-time/2.9.2/joda-time-2.9.2.pom (30 kB at 542 kB/s)
[INFO] Downloading from wso2.releases: https://maven.wso2.org/nexus/content/repositories/releases/org/json/json/20160212/json-20160212.pom
[INFO] Downloading from wso2-nexus: https://maven.wso2.org/nexus/content/groups/wso2-public/org/json/json/20160212/json-20160212.pom
[INFO] Downloaded from wso2-nexus: https://maven.wso2.org/nexus/content/groups/wso2-public/org/json/json/20160212/json-20160212.pom (5.7 kB at 80 kB/s)
[INFO] Downloading from wso2.releases: https://maven.wso2.org/nexus/content/repositories/releases/com/google/http-client/google-http-client/1.22.0/google-http-client-1.22.0.pom
[INFO] Downloading from wso2-nexus: https://maven.wso2.org/nexus/content/groups/wso2-public/com/google/http-client/google-http-client/1.22.0/google-http-client-1.22.0.pom
[INFO] Downloaded from wso2-nexus: https://maven.wso2.org/nexus/content/groups/wso2-public/com/google/http-client/google-http-client/1.22.0/google-http-client-1.22.0.pom (5.1 kB at 54 kB/s)
[INFO] Downloading from wso2.releases: https://maven.wso2.org/nexus/content/repositories/releases/com/google/http-client/google-http-client-parent/1.22.0/google-http-client-parent-1.22.0.pom
[INFO] Downloading from wso2-nexus: https://maven.wso2.org/nexus/content/groups/wso2-public/com/google/http-client/google-http-client-parent/1.22.0/google-http-client-parent-1.22.0.pom
[INFO] Downloaded from wso2-nexus: https://maven.wso2.org/nexus/content/groups/wso2-public/com/google/http-client/google-http-client-parent/1.22.0/google-http-client-parent-1.22.0.pom (25 kB at 271 kB/s)
[INFO] Downloading from wso2.releases: https://maven.wso2.org/nexus/content/repositories/releases/org/apache/httpcomponents/httpclient/4.0.1/httpclient-4.0.1.pom
[INFO] Downloading from wso2-nexus: https://maven.wso2.org/nexus/content/groups/wso2-public/org/apache/httpcomponents/httpclient/4.0.1/httpclient-4.0.1.pom
[INFO] Downloaded from wso2-nexus: https://maven.wso2.org/nexus/content/groups/wso2-public/org/apache/httpcomponents/httpclient/4.0.1/httpclient-4.0.1.pom (6.8 kB at 94 kB/s)
[INFO] Downloading from wso2.releases: https://maven.wso2.org/nexus/content/repositories/releases/org/apache/httpcomponents/httpcomponents-client/4.0.1/httpcomponents-client-4.0.1.pom
[INFO] Downloading from wso2-nexus: https://maven.wso2.org/nexus/content/groups/wso2-public/org/apache/httpcomponents/httpcomponents-client/4.0.1/httpcomponents-client-4.0.1.pom
[INFO] Downloaded from wso2-nexus: https://maven.wso2.org/nexus/content/groups/wso2-public/org/apache/httpcomponents/httpcomponents-client/4.0.1/httpcomponents-client-4.0.1.pom (9.2 kB at 173 kB/s)
[INFO] Downloading from wso2.releases: https://maven.wso2.org/nexus/content/repositories/releases/com/google/code/findbugs/jsr305/3.0.0/jsr305-3.0.0.pom
[INFO] Downloading from wso2-nexus: https://maven.wso2.org/nexus/content/groups/wso2-public/com/google/code/findbugs/jsr305/3.0.0/jsr305-3.0.0.pom
[INFO] Downloaded from wso2-nexus: https://maven.wso2.org/nexus/content/groups/wso2-public/com/google/code/findbugs/jsr305/3.0.0/jsr305-3.0.0.pom (3.9 kB at 275 kB/s)
[INFO] Downloading from wso2.releases: https://maven.wso2.org/nexus/content/repositories/releases/com/google/api/api-common/1.1.0/api-common-1.1.0.pom
[INFO] Downloading from wso2-nexus: https://maven.wso2.org/nexus/content/groups/wso2-public/com/google/api/api-common/1.1.0/api-common-1.1.0.pom
[INFO] Downloaded from wso2-nexus: https://maven.wso2.org/nexus/content/groups/wso2-public/com/google/api/api-common/1.1.0/api-common-1.1.0.pom (2.3 kB at 14 kB/s)
[INFO] Downloading from wso2.releases: https://maven.wso2.org/nexus/content/repositories/releases/com/google/guava/guava/19.0/guava-19.0.pom
[INFO] Downloading from wso2-nexus: https://maven.wso2.org/nexus/content/groups/wso2-public/com/google/guava/guava/19.0/guava-19.0.pom
[INFO] Downloaded from wso2-nexus: https://maven.wso2.org/nexus/content/groups/wso2-public/com/google/guava/guava/19.0/guava-19.0.pom (6.8 kB at 522 kB/s)
[INFO] Downloading from wso2.releases: https://maven.wso2.org/nexus/content/repositories/releases/com/google/guava/guava-parent/19.0/guava-parent-19.0.pom
[INFO] Downloading from wso2-nexus: https://maven.wso2.org/nexus/content/groups/wso2-public/com/google/guava/guava-parent/19.0/guava-parent-19.0.pom
[INFO] Downloaded from wso2-nexus: https://maven.wso2.org/nexus/content/groups/wso2-public/com/google/guava/guava-parent/19.0/guava-parent-19.0.pom (9.9 kB at 760 kB/s)
[INFO] Downloading from wso2.releases: https://maven.wso2.org/nexus/content/repositories/releases/com/google/api/gax/1.9.0/gax-1.9.0.pom
[INFO] Downloading from wso2-nexus: https://maven.wso2.org/nexus/content/groups/wso2-public/com/google/api/gax/1.9.0/gax-1.9.0.pom
[INFO] Downloaded from wso2-nexus: https://maven.wso2.org/nexus/content/groups/wso2-public/com/google/api/gax/1.9.0/gax-1.9.0.pom (3.9 kB at 74 kB/s)
[INFO] Downloading from wso2.releases: https://maven.wso2.org/nexus/content/repositories/releases/com/google/auto/value/auto-value/1.2/auto-value-1.2.pom
[INFO] Downloading from wso2-nexus: https://maven.wso2.org/nexus/content/groups/wso2-public/com/google/auto/value/auto-value/1.2/auto-value-1.2.pom
[INFO] Downloaded from wso2-nexus: https://maven.wso2.org/nexus/content/groups/wso2-public/com/google/auto/value/auto-value/1.2/auto-value-1.2.pom (5.0 kB at 54 kB/s)
[INFO] Downloading from wso2.releases: https://maven.wso2.org/nexus/content/repositories/releases/com/google/auto/auto-parent/3/auto-parent-3.pom
[INFO] Downloading from wso2-nexus: https://maven.wso2.org/nexus/content/groups/wso2-public/com/google/auto/auto-parent/3/auto-parent-3.pom
[INFO] Downloaded from wso2-nexus: https://maven.wso2.org/nexus/content/groups/wso2-public/com/google/auto/auto-parent/3/auto-parent-3.pom (3.8 kB at 67 kB/s)
[INFO] Downloading from wso2.releases: https://maven.wso2.org/nexus/content/repositories/releases/org/threeten/threetenbp/1.3.3/threetenbp-1.3.3.pom
[INFO] Downloading from wso2-nexus: https://maven.wso2.org/nexus/content/groups/wso2-public/org/threeten/threetenbp/1.3.3/threetenbp-1.3.3.pom
[INFO] Downloaded from wso2-nexus: https://maven.wso2.org/nexus/content/groups/wso2-public/org/threeten/threetenbp/1.3.3/threetenbp-1.3.3.pom (28 kB at 417 kB/s)
[INFO] Downloading from wso2.releases: https://maven.wso2.org/nexus/content/repositories/releases/com/google/auth/google-auth-library-oauth2-http/0.8.0/google-auth-library-oauth2-http-0.8.0.pom
[INFO] Downloading from wso2-nexus: https://maven.wso2.org/nexus/content/groups/wso2-public/com/google/auth/google-auth-library-oauth2-http/0.8.0/google-auth-library-oauth2-http-0.8.0.pom
[INFO] Downloaded from wso2-nexus: https://maven.wso2.org/nexus/content/groups/wso2-public/com/google/auth/google-auth-library-oauth2-http/0.8.0/google-auth-library-oauth2-http-0.8.0.pom (2.2 kB at 20 kB/s)
[INFO] Downloading from wso2.releases: https://maven.wso2.org/nexus/content/repositories/releases/com/google/auth/google-auth-library-parent/0.8.0/google-auth-library-parent-0.8.0.pom
[INFO] Downloading from wso2-nexus: https://maven.wso2.org/nexus/content/groups/wso2-public/com/google/auth/google-auth-library-parent/0.8.0/google-auth-library-parent-0.8.0.pom
[INFO] Downloaded from wso2-nexus: https://maven.wso2.org/nexus/content/groups/wso2-public/com/google/auth/google-auth-library-parent/0.8.0/google-auth-library-parent-0.8.0.pom (8.1 kB at 166 kB/s)
[INFO] Downloading from wso2.releases: https://maven.wso2.org/nexus/content/repositories/releases/com/google/auth/google-auth-library-credentials/0.8.0/google-auth-library-credentials-0.8.0.pom
[INFO] Downloading from wso2-nexus: https://maven.wso2.org/nexus/content/groups/wso2-public/com/google/auth/google-auth-library-credentials/0.8.0/google-auth-library-credentials-0.8.0.pom
[INFO] Downloaded from wso2-nexus: https://maven.wso2.org/nexus/content/groups/wso2-public/com/google/auth/google-auth-library-credentials/0.8.0/google-auth-library-credentials-0.8.0.pom (1.5 kB at 64 kB/s)
[INFO] Downloading from wso2.releases: https://maven.wso2.org/nexus/content/repositories/releases/com/google/http-client/google-http-client/1.19.0/google-http-client-1.19.0.pom
[INFO] Downloading from wso2-nexus: https://maven.wso2.org/nexus/content/groups/wso2-public/com/google/http-client/google-http-client/1.19.0/google-http-client-1.19.0.pom
[INFO] Downloaded from wso2-nexus: https://maven.wso2.org/nexus/content/groups/wso2-public/com/google/http-client/google-http-client/1.19.0/google-http-client-1.19.0.pom (5.1 kB at 147 kB/s)
[INFO] Downloading from wso2.releases: https://maven.wso2.org/nexus/content/repositories/releases/com/google/http-client/google-http-client-parent/1.19.0/google-http-client-parent-1.19.0.pom
[INFO] Downloading from wso2-nexus: https://maven.wso2.org/nexus/content/groups/wso2-public/com/google/http-client/google-http-client-parent/1.19.0/google-http-client-parent-1.19.0.pom
[INFO] Downloaded from wso2-nexus: https://maven.wso2.org/nexus/content/groups/wso2-public/com/google/http-client/google-http-client-parent/1.19.0/google-http-client-parent-1.19.0.pom (23 kB at 1.1 MB/s)
[INFO] Downloading from wso2.releases: https://maven.wso2.org/nexus/content/repositories/releases/com/google/http-client/google-http-client-jackson2/1.19.0/google-http-client-jackson2-1.19.0.pom
[INFO] Downloading from wso2-nexus: https://maven.wso2.org/nexus/content/groups/wso2-public/com/google/http-client/google-http-client-jackson2/1.19.0/google-http-client-jackson2-1.19.0.pom
[INFO] Downloaded from wso2-nexus: https://maven.wso2.org/nexus/content/groups/wso2-public/com/google/http-client/google-http-client-jackson2/1.19.0/google-http-client-jackson2-1.19.0.pom (2.8 kB at 53 kB/s)
[INFO] Downloading from wso2.releases: https://maven.wso2.org/nexus/content/repositories/releases/com/fasterxml/jackson/core/jackson-core/2.1.3/jackson-core-2.1.3.pom
[INFO] Downloading from wso2-nexus: https://maven.wso2.org/nexus/content/groups/wso2-public/com/fasterxml/jackson/core/jackson-core/2.1.3/jackson-core-2.1.3.pom
[INFO] Downloaded from wso2-nexus: https://maven.wso2.org/nexus/content/groups/wso2-public/com/fasterxml/jackson/core/jackson-core/2.1.3/jackson-core-2.1.3.pom (5.6 kB at 188 kB/s)
[INFO] Downloading from wso2.releases: https://maven.wso2.org/nexus/content/repositories/releases/com/fasterxml/oss-parent/4/oss-parent-4.pom
[INFO] Downloading from wso2-nexus: https://maven.wso2.org/nexus/content/groups/wso2-public/com/fasterxml/oss-parent/4/oss-parent-4.pom
[INFO] Downloaded from wso2-nexus: https://maven.wso2.org/nexus/content/groups/wso2-public/com/fasterxml/oss-parent/4/oss-parent-4.pom (18 kB at 439 kB/s)
[INFO] Downloading from wso2.releases: https://maven.wso2.org/nexus/content/repositories/releases/com/google/protobuf/protobuf-java-util/3.3.1/protobuf-java-util-3.3.1.pom
[INFO] Downloading from wso2-nexus: https://maven.wso2.org/nexus/content/groups/wso2-public/com/google/protobuf/protobuf-java-util/3.3.1/protobuf-java-util-3.3.1.pom
[INFO] Downloaded from wso2-nexus: https://maven.wso2.org/nexus/content/groups/wso2-public/com/google/protobuf/protobuf-java-util/3.3.1/protobuf-java-util-3.3.1.pom (4.2 kB at 43 kB/s)
[INFO] Downloading from wso2.releases: https://maven.wso2.org/nexus/content/repositories/releases/com/google/protobuf/protobuf-parent/3.3.1/protobuf-parent-3.3.1.pom
[INFO] Downloading from wso2-nexus: https://maven.wso2.org/nexus/content/groups/wso2-public/com/google/protobuf/protobuf-parent/3.3.1/protobuf-parent-3.3.1.pom
[INFO] Downloaded from wso2-nexus: https://maven.wso2.org/nexus/content/groups/wso2-public/com/google/protobuf/protobuf-parent/3.3.1/protobuf-parent-3.3.1.pom (6.8 kB at 99 kB/s)
[INFO] Downloading from wso2.releases: https://maven.wso2.org/nexus/content/repositories/releases/com/google/protobuf/protobuf-java/3.3.1/protobuf-java-3.3.1.pom
[INFO] Downloading from wso2-nexus: https://maven.wso2.org/nexus/content/groups/wso2-public/com/google/protobuf/protobuf-java/3.3.1/protobuf-java-3.3.1.pom
[INFO] Downloaded from wso2-nexus: https://maven.wso2.org/nexus/content/groups/wso2-public/com/google/protobuf/protobuf-java/3.3.1/protobuf-java-3.3.1.pom (4.7 kB at 125 kB/s)
[INFO] Downloading from wso2.releases: https://maven.wso2.org/nexus/content/repositories/releases/com/google/code/gson/gson/2.7/gson-2.7.pom
[INFO] Downloading from wso2-nexus: https://maven.wso2.org/nexus/content/groups/wso2-public/com/google/code/gson/gson/2.7/gson-2.7.pom
[INFO] Downloaded from wso2-nexus: https://maven.wso2.org/nexus/content/groups/wso2-public/com/google/code/gson/gson/2.7/gson-2.7.pom (1.4 kB at 111 kB/s)
[INFO] Downloading from wso2.releases: https://maven.wso2.org/nexus/content/repositories/releases/com/google/code/gson/gson-parent/2.7/gson-parent-2.7.pom
[INFO] Downloading from wso2-nexus: https://maven.wso2.org/nexus/content/groups/wso2-public/com/google/code/gson/gson-parent/2.7/gson-parent-2.7.pom
[INFO] Downloaded from wso2-nexus: https://maven.wso2.org/nexus/content/groups/wso2-public/com/google/code/gson/gson-parent/2.7/gson-parent-2.7.pom (3.6 kB at 224 kB/s)
[INFO] Downloading from wso2.releases: https://maven.wso2.org/nexus/content/repositories/releases/com/google/api/grpc/proto-google-common-protos/0.1.21/proto-google-common-protos-0.1.21.pom
[INFO] Downloading from wso2-nexus: https://maven.wso2.org/nexus/content/groups/wso2-public/com/google/api/grpc/proto-google-common-protos/0.1.21/proto-google-common-protos-0.1.21.pom
[INFO] Downloaded from wso2-nexus: https://maven.wso2.org/nexus/content/groups/wso2-public/com/google/api/grpc/proto-google-common-protos/0.1.21/proto-google-common-protos-0.1.21.pom (2.5 kB at 25 kB/s)
[INFO] Downloading from wso2.releases: https://maven.wso2.org/nexus/content/repositories/releases/com/google/protobuf/protobuf-java/3.3.0/protobuf-java-3.3.0.pom
[INFO] Downloading from wso2-nexus: https://maven.wso2.org/nexus/content/groups/wso2-public/com/google/protobuf/protobuf-java/3.3.0/protobuf-java-3.3.0.pom
[INFO] Downloaded from wso2-nexus: https://maven.wso2.org/nexus/content/groups/wso2-public/com/google/protobuf/protobuf-java/3.3.0/protobuf-java-3.3.0.pom (4.9 kB at 56 kB/s)
[INFO] Downloading from wso2.releases: https://maven.wso2.org/nexus/content/repositories/releases/com/google/protobuf/protobuf-parent/3.3.0/protobuf-parent-3.3.0.pom
[INFO] Downloading from wso2-nexus: https://maven.wso2.org/nexus/content/groups/wso2-public/com/google/protobuf/protobuf-parent/3.3.0/protobuf-parent-3.3.0.pom
[INFO] Downloaded from wso2-nexus: https://maven.wso2.org/nexus/content/groups/wso2-public/com/google/protobuf/protobuf-parent/3.3.0/protobuf-parent-3.3.0.pom (7.0 kB at 160 kB/s)
[INFO] Downloading from wso2.releases: https://maven.wso2.org/nexus/content/repositories/releases/com/google/api/grpc/proto-google-iam-v1/0.1.21/proto-google-iam-v1-0.1.21.pom
[INFO] Downloading from wso2-nexus: https://maven.wso2.org/nexus/content/groups/wso2-public/com/google/api/grpc/proto-google-iam-v1/0.1.21/proto-google-iam-v1-0.1.21.pom
[INFO] Downloaded from wso2-nexus: https://maven.wso2.org/nexus/content/groups/wso2-public/com/google/api/grpc/proto-google-iam-v1/0.1.21/proto-google-iam-v1-0.1.21.pom (2.7 kB at 29 kB/s)
[INFO] Downloading from wso2.releases: https://maven.wso2.org/nexus/content/repositories/releases/com/google/cloud/google-cloud-core-grpc/1.8.0/google-cloud-core-grpc-1.8.0.pom
[INFO] Downloading from wso2-nexus: https://maven.wso2.org/nexus/content/groups/wso2-public/com/google/cloud/google-cloud-core-grpc/1.8.0/google-cloud-core-grpc-1.8.0.pom
[INFO] Downloaded from wso2-nexus: https://maven.wso2.org/nexus/content/groups/wso2-public/com/google/cloud/google-cloud-core-grpc/1.8.0/google-cloud-core-grpc-1.8.0.pom (3.1 kB at 46 kB/s)
[INFO] Downloading from wso2.releases: https://maven.wso2.org/nexus/content/repositories/releases/io/grpc/grpc-protobuf/1.6.1/grpc-protobuf-1.6.1.pom
[INFO] Downloading from wso2-nexus: https://maven.wso2.org/nexus/content/groups/wso2-public/io/grpc/grpc-protobuf/1.6.1/grpc-protobuf-1.6.1.pom
[INFO] Downloaded from wso2-nexus: https://maven.wso2.org/nexus/content/groups/wso2-public/io/grpc/grpc-protobuf/1.6.1/grpc-protobuf-1.6.1.pom (3.0 kB at 112 kB/s)
[INFO] Downloading from wso2.releases: https://maven.wso2.org/nexus/content/repositories/releases/io/grpc/grpc-core/1.6.1/grpc-core-1.6.1.pom
[INFO] Downloading from wso2-nexus: https://maven.wso2.org/nexus/content/groups/wso2-public/io/grpc/grpc-core/1.6.1/grpc-core-1.6.1.pom
[INFO] Downloaded from wso2-nexus: https://maven.wso2.org/nexus/content/groups/wso2-public/io/grpc/grpc-core/1.6.1/grpc-core-1.6.1.pom (2.8 kB at 105 kB/s)
[INFO] Downloading from wso2.releases: https://maven.wso2.org/nexus/content/repositories/releases/io/grpc/grpc-context/1.6.1/grpc-context-1.6.1.pom
[INFO] Downloading from wso2-nexus: https://maven.wso2.org/nexus/content/groups/wso2-public/io/grpc/grpc-context/1.6.1/grpc-context-1.6.1.pom
[INFO] Downloaded from wso2-nexus: https://maven.wso2.org/nexus/content/groups/wso2-public/io/grpc/grpc-context/1.6.1/grpc-context-1.6.1.pom (1.7 kB at 37 kB/s)
[INFO] Downloading from wso2.releases: https://maven.wso2.org/nexus/content/repositories/releases/com/google/errorprone/error_prone_annotations/2.0.19/error_prone_annotations-2.0.19.pom
[INFO] Downloading from wso2-nexus: https://maven.wso2.org/nexus/content/groups/wso2-public/com/google/errorprone/error_prone_annotations/2.0.19/error_prone_annotations-2.0.19.pom
[INFO] Downloaded from wso2-nexus: https://maven.wso2.org/nexus/content/groups/wso2-public/com/google/errorprone/error_prone_annotations/2.0.19/error_prone_annotations-2.0.19.pom (1.6 kB at 21 kB/s)
[INFO] Downloading from wso2.releases: https://maven.wso2.org/nexus/content/repositories/releases/com/google/errorprone/error_prone_parent/2.0.19/error_prone_parent-2.0.19.pom
[INFO] Downloading from wso2-nexus: https://maven.wso2.org/nexus/content/groups/wso2-public/com/google/errorprone/error_prone_parent/2.0.19/error_prone_parent-2.0.19.pom
[INFO] Downloaded from wso2-nexus: https://maven.wso2.org/nexus/content/groups/wso2-public/com/google/errorprone/error_prone_parent/2.0.19/error_prone_parent-2.0.19.pom (5.0 kB at 148 kB/s)
[INFO] Downloading from wso2.releases: https://maven.wso2.org/nexus/content/repositories/releases/com/google/instrumentation/instrumentation-api/0.4.3/instrumentation-api-0.4.3.pom
[INFO] Downloading from wso2-nexus: https://maven.wso2.org/nexus/content/groups/wso2-public/com/google/instrumentation/instrumentation-api/0.4.3/instrumentation-api-0.4.3.pom
[INFO] Downloaded from wso2-nexus: https://maven.wso2.org/nexus/content/groups/wso2-public/com/google/instrumentation/instrumentation-api/0.4.3/instrumentation-api-0.4.3.pom (2.7 kB at 25 kB/s)
[INFO] Downloading from wso2.releases: https://maven.wso2.org/nexus/content/repositories/releases/com/google/errorprone/error_prone_annotations/2.0.11/error_prone_annotations-2.0.11.pom
[INFO] Downloading from wso2-nexus: https://maven.wso2.org/nexus/content/groups/wso2-public/com/google/errorprone/error_prone_annotations/2.0.11/error_prone_annotations-2.0.11.pom
[INFO] Downloaded from wso2-nexus: https://maven.wso2.org/nexus/content/groups/wso2-public/com/google/errorprone/error_prone_annotations/2.0.11/error_prone_annotations-2.0.11.pom (1.3 kB at 34 kB/s)
[INFO] Downloading from wso2.releases: https://maven.wso2.org/nexus/content/repositories/releases/com/google/errorprone/error_prone_parent/2.0.11/error_prone_parent-2.0.11.pom
[INFO] Downloading from wso2-nexus: https://maven.wso2.org/nexus/content/groups/wso2-public/com/google/errorprone/error_prone_parent/2.0.11/error_prone_parent-2.0.11.pom
[INFO] Downloaded from wso2-nexus: https://maven.wso2.org/nexus/content/groups/wso2-public/com/google/errorprone/error_prone_parent/2.0.11/error_prone_parent-2.0.11.pom (4.9 kB at 71 kB/s)
[INFO] Downloading from wso2.releases: https://maven.wso2.org/nexus/content/repositories/releases/io/grpc/grpc-context/1.2.0/grpc-context-1.2.0.pom
[INFO] Downloading from wso2-nexus: https://maven.wso2.org/nexus/content/groups/wso2-public/io/grpc/grpc-context/1.2.0/grpc-context-1.2.0.pom
[INFO] Downloaded from wso2-nexus: https://maven.wso2.org/nexus/content/groups/wso2-public/io/grpc/grpc-context/1.2.0/grpc-context-1.2.0.pom (1.7 kB at 87 kB/s)
[INFO] Downloading from wso2.releases: https://maven.wso2.org/nexus/content/repositories/releases/io/opencensus/opencensus-api/0.5.1/opencensus-api-0.5.1.pom
[INFO] Downloading from wso2-nexus: https://maven.wso2.org/nexus/content/groups/wso2-public/io/opencensus/opencensus-api/0.5.1/opencensus-api-0.5.1.pom
[INFO] Downloaded from wso2-nexus: https://maven.wso2.org/nexus/content/groups/wso2-public/io/opencensus/opencensus-api/0.5.1/opencensus-api-0.5.1.pom (2.8 kB at 56 kB/s)
[INFO] Downloading from wso2.releases: https://maven.wso2.org/nexus/content/repositories/releases/io/grpc/grpc-context/1.4.0/grpc-context-1.4.0.pom
[INFO] Downloading from wso2-nexus: https://maven.wso2.org/nexus/content/groups/wso2-public/io/grpc/grpc-context/1.4.0/grpc-context-1.4.0.pom
[INFO] Downloaded from wso2-nexus: https://maven.wso2.org/nexus/content/groups/wso2-public/io/grpc/grpc-context/1.4.0/grpc-context-1.4.0.pom (1.7 kB at 117 kB/s)
[INFO] Downloading from wso2.releases: https://maven.wso2.org/nexus/content/repositories/releases/com/google/api/grpc/proto-google-common-protos/0.1.9/proto-google-common-protos-0.1.9.pom
[INFO] Downloading from wso2-nexus: https://maven.wso2.org/nexus/content/groups/wso2-public/com/google/api/grpc/proto-google-common-protos/0.1.9/proto-google-common-protos-0.1.9.pom
[INFO] Downloaded from wso2-nexus: https://maven.wso2.org/nexus/content/groups/wso2-public/com/google/api/grpc/proto-google-common-protos/0.1.9/proto-google-common-protos-0.1.9.pom (1.7 kB at 34 kB/s)
[INFO] Downloading from wso2.releases: https://maven.wso2.org/nexus/content/repositories/releases/com/google/protobuf/protobuf-java/3.2.0/protobuf-java-3.2.0.pom
[INFO] Downloading from wso2-nexus: https://maven.wso2.org/nexus/content/groups/wso2-public/com/google/protobuf/protobuf-java/3.2.0/protobuf-java-3.2.0.pom
[INFO] Downloaded from wso2-nexus: https://maven.wso2.org/nexus/content/groups/wso2-public/com/google/protobuf/protobuf-java/3.2.0/protobuf-java-3.2.0.pom (4.7 kB at 106 kB/s)
[INFO] Downloading from wso2.releases: https://maven.wso2.org/nexus/content/repositories/releases/com/google/protobuf/protobuf-parent/3.2.0/protobuf-parent-3.2.0.pom
[INFO] Downloading from wso2-nexus: https://maven.wso2.org/nexus/content/groups/wso2-public/com/google/protobuf/protobuf-parent/3.2.0/protobuf-parent-3.2.0.pom
[INFO] Downloaded from wso2-nexus: https://maven.wso2.org/nexus/content/groups/wso2-public/com/google/protobuf/protobuf-parent/3.2.0/protobuf-parent-3.2.0.pom (6.8 kB at 428 kB/s)
[INFO] Downloading from wso2.releases: https://maven.wso2.org/nexus/content/repositories/releases/io/grpc/grpc-protobuf-lite/1.6.1/grpc-protobuf-lite-1.6.1.pom
[INFO] Downloading from wso2-nexus: https://maven.wso2.org/nexus/content/groups/wso2-public/io/grpc/grpc-protobuf-lite/1.6.1/grpc-protobuf-lite-1.6.1.pom
[INFO] Downloaded from wso2-nexus: https://maven.wso2.org/nexus/content/groups/wso2-public/io/grpc/grpc-protobuf-lite/1.6.1/grpc-protobuf-lite-1.6.1.pom (2.1 kB at 64 kB/s)
[INFO] Downloading from wso2.releases: https://maven.wso2.org/nexus/content/repositories/releases/io/grpc/grpc-netty/1.6.1/grpc-netty-1.6.1.pom
[INFO] Downloading from wso2-nexus: https://maven.wso2.org/nexus/content/groups/wso2-public/io/grpc/grpc-netty/1.6.1/grpc-netty-1.6.1.pom
[INFO] Downloaded from wso2-nexus: https://maven.wso2.org/nexus/content/groups/wso2-public/io/grpc/grpc-netty/1.6.1/grpc-netty-1.6.1.pom (2.5 kB at 86 kB/s)
[INFO] Downloading from wso2.releases: https://maven.wso2.org/nexus/content/repositories/releases/io/grpc/grpc-core/maven-metadata.xml
[INFO] Downloading from 3rd-party: https://maven.wso2.org/nexus/content/repositories/thirdparty/io/grpc/grpc-core/maven-metadata.xml
[INFO] Downloading from wso2-nexus: https://maven.wso2.org/nexus/content/groups/wso2-public/io/grpc/grpc-core/maven-metadata.xml
[INFO] Downloading from shibboleth.internet2.edu: https://build.shibboleth.net/nexus/content/groups/public/io/grpc/grpc-core/maven-metadata.xml
[INFO] Downloading from shibboleth-release: https://build.shibboleth.net/nexus/content/groups/public/io/grpc/grpc-core/maven-metadata.xml
[INFO] Downloading from wso2.snapshots: http://maven.wso2.org/nexus/content/repositories/snapshots/io/grpc/grpc-core/maven-metadata.xml
[INFO] Downloading from central: https://repo.maven.apache.org/maven2/io/grpc/grpc-core/maven-metadata.xml
[INFO] Downloaded from wso2-nexus: https://maven.wso2.org/nexus/content/groups/wso2-public/io/grpc/grpc-core/maven-metadata.xml (2.3 kB at 143 kB/s)
[INFO] Downloaded from central: https://repo.maven.apache.org/maven2/io/grpc/grpc-core/maven-metadata.xml (3.4 kB at 670 kB/s)
[INFO] Downloading from wso2.releases: https://maven.wso2.org/nexus/content/repositories/releases/io/netty/netty-codec-http2/maven-metadata.xml
[INFO] Downloading from wso2-nexus: https://maven.wso2.org/nexus/content/groups/wso2-public/io/netty/netty-codec-http2/maven-metadata.xml
[INFO] Downloading from 3rd-party: https://maven.wso2.org/nexus/content/repositories/thirdparty/io/netty/netty-codec-http2/maven-metadata.xml
[INFO] Downloading from shibboleth.internet2.edu: https://build.shibboleth.net/nexus/content/groups/public/io/netty/netty-codec-http2/maven-metadata.xml
[INFO] Downloading from shibboleth-release: https://build.shibboleth.net/nexus/content/groups/public/io/netty/netty-codec-http2/maven-metadata.xml
[INFO] Downloading from wso2.snapshots: http://maven.wso2.org/nexus/content/repositories/snapshots/io/netty/netty-codec-http2/maven-metadata.xml
[INFO] Downloading from central: https://repo.maven.apache.org/maven2/io/netty/netty-codec-http2/maven-metadata.xml
[INFO] Downloaded from wso2-nexus: https://maven.wso2.org/nexus/content/groups/wso2-public/io/netty/netty-codec-http2/maven-metadata.xml (2.5 kB at 158 kB/s)
[INFO] Downloaded from central: https://repo.maven.apache.org/maven2/io/netty/netty-codec-http2/maven-metadata.xml (3.4 kB at 858 kB/s)
[INFO] Downloaded from shibboleth-release: https://build.shibboleth.net/nexus/content/groups/public/io/netty/netty-codec-http2/maven-metadata.xml (564 B at 14 kB/s)
[INFO] Downloaded from shibboleth.internet2.edu: https://build.shibboleth.net/nexus/content/groups/public/io/netty/netty-codec-http2/maven-metadata.xml (564 B at 12 kB/s)
[INFO] Downloading from wso2.releases: https://maven.wso2.org/nexus/content/repositories/releases/io/netty/netty-codec-http2/4.1.14.Final/netty-codec-http2-4.1.14.Final.pom
[INFO] Downloading from wso2-nexus: https://maven.wso2.org/nexus/content/groups/wso2-public/io/netty/netty-codec-http2/4.1.14.Final/netty-codec-http2-4.1.14.Final.pom
[INFO] Downloaded from wso2-nexus: https://maven.wso2.org/nexus/content/groups/wso2-public/io/netty/netty-codec-http2/4.1.14.Final/netty-codec-http2-4.1.14.Final.pom (1.9 kB at 59 kB/s)
[INFO] Downloading from wso2.releases: https://maven.wso2.org/nexus/content/repositories/releases/io/netty/netty-parent/4.1.14.Final/netty-parent-4.1.14.Final.pom
[INFO] Downloading from wso2-nexus: https://maven.wso2.org/nexus/content/groups/wso2-public/io/netty/netty-parent/4.1.14.Final/netty-parent-4.1.14.Final.pom
[INFO] Downloaded from wso2-nexus: https://maven.wso2.org/nexus/content/groups/wso2-public/io/netty/netty-parent/4.1.14.Final/netty-parent-4.1.14.Final.pom (51 kB at 2.2 MB/s)
[INFO] Downloading from wso2.releases: https://maven.wso2.org/nexus/content/repositories/releases/io/netty/netty-codec-http/4.1.14.Final/netty-codec-http-4.1.14.Final.pom
[INFO] Downloading from wso2-nexus: https://maven.wso2.org/nexus/content/groups/wso2-public/io/netty/netty-codec-http/4.1.14.Final/netty-codec-http-4.1.14.Final.pom
[INFO] Downloaded from wso2-nexus: https://maven.wso2.org/nexus/content/groups/wso2-public/io/netty/netty-codec-http/4.1.14.Final/netty-codec-http-4.1.14.Final.pom (1.8 kB at 115 kB/s)
[INFO] Downloading from wso2.releases: https://maven.wso2.org/nexus/content/repositories/releases/io/netty/netty-codec/4.1.14.Final/netty-codec-4.1.14.Final.pom
[INFO] Downloading from wso2-nexus: https://maven.wso2.org/nexus/content/groups/wso2-public/io/netty/netty-codec/4.1.14.Final/netty-codec-4.1.14.Final.pom
[INFO] Downloaded from wso2-nexus: https://maven.wso2.org/nexus/content/groups/wso2-public/io/netty/netty-codec/4.1.14.Final/netty-codec-4.1.14.Final.pom (3.2 kB at 138 kB/s)
[INFO] Downloading from wso2.releases: https://maven.wso2.org/nexus/content/repositories/releases/io/netty/netty-transport/4.1.14.Final/netty-transport-4.1.14.Final.pom
[INFO] Downloading from wso2-nexus: https://maven.wso2.org/nexus/content/groups/wso2-public/io/netty/netty-transport/4.1.14.Final/netty-transport-4.1.14.Final.pom
[INFO] Downloaded from wso2-nexus: https://maven.wso2.org/nexus/content/groups/wso2-public/io/netty/netty-transport/4.1.14.Final/netty-transport-4.1.14.Final.pom (1.7 kB at 83 kB/s)
[INFO] Downloading from wso2.releases: https://maven.wso2.org/nexus/content/repositories/releases/io/netty/netty-buffer/4.1.14.Final/netty-buffer-4.1.14.Final.pom
[INFO] Downloading from wso2-nexus: https://maven.wso2.org/nexus/content/groups/wso2-public/io/netty/netty-buffer/4.1.14.Final/netty-buffer-4.1.14.Final.pom
[INFO] Downloaded from wso2-nexus: https://maven.wso2.org/nexus/content/groups/wso2-public/io/netty/netty-buffer/4.1.14.Final/netty-buffer-4.1.14.Final.pom (1.5 kB at 100 kB/s)
[INFO] Downloading from wso2.releases: https://maven.wso2.org/nexus/content/repositories/releases/io/netty/netty-common/4.1.14.Final/netty-common-4.1.14.Final.pom
[INFO] Downloading from wso2-nexus: https://maven.wso2.org/nexus/content/groups/wso2-public/io/netty/netty-common/4.1.14.Final/netty-common-4.1.14.Final.pom
[INFO] Downloaded from wso2-nexus: https://maven.wso2.org/nexus/content/groups/wso2-public/io/netty/netty-common/4.1.14.Final/netty-common-4.1.14.Final.pom (9.2 kB at 437 kB/s)
[INFO] Downloading from wso2.releases: https://maven.wso2.org/nexus/content/repositories/releases/io/netty/netty-resolver/4.1.14.Final/netty-resolver-4.1.14.Final.pom
[INFO] Downloading from wso2-nexus: https://maven.wso2.org/nexus/content/groups/wso2-public/io/netty/netty-resolver/4.1.14.Final/netty-resolver-4.1.14.Final.pom
[INFO] Downloaded from wso2-nexus: https://maven.wso2.org/nexus/content/groups/wso2-public/io/netty/netty-resolver/4.1.14.Final/netty-resolver-4.1.14.Final.pom (1.5 kB at 24 kB/s)
[INFO] Downloading from wso2.releases: https://maven.wso2.org/nexus/content/repositories/releases/io/netty/netty-handler/4.1.14.Final/netty-handler-4.1.14.Final.pom
[INFO] Downloading from wso2-nexus: https://maven.wso2.org/nexus/content/groups/wso2-public/io/netty/netty-handler/4.1.14.Final/netty-handler-4.1.14.Final.pom
[INFO] Downloaded from wso2-nexus: https://maven.wso2.org/nexus/content/groups/wso2-public/io/netty/netty-handler/4.1.14.Final/netty-handler-4.1.14.Final.pom (2.9 kB at 122 kB/s)
[INFO] Downloading from wso2.releases: https://maven.wso2.org/nexus/content/repositories/releases/io/netty/netty-handler-proxy/4.1.14.Final/netty-handler-proxy-4.1.14.Final.pom
[INFO] Downloading from wso2-nexus: https://maven.wso2.org/nexus/content/groups/wso2-public/io/netty/netty-handler-proxy/4.1.14.Final/netty-handler-proxy-4.1.14.Final.pom
[INFO] Downloaded from wso2-nexus: https://maven.wso2.org/nexus/content/groups/wso2-public/io/netty/netty-handler-proxy/4.1.14.Final/netty-handler-proxy-4.1.14.Final.pom (2.2 kB at 62 kB/s)
[INFO] Downloading from wso2.releases: https://maven.wso2.org/nexus/content/repositories/releases/io/netty/netty-codec-socks/4.1.14.Final/netty-codec-socks-4.1.14.Final.pom
[INFO] Downloading from wso2-nexus: https://maven.wso2.org/nexus/content/groups/wso2-public/io/netty/netty-codec-socks/4.1.14.Final/netty-codec-socks-4.1.14.Final.pom
[INFO] Downloaded from wso2-nexus: https://maven.wso2.org/nexus/content/groups/wso2-public/io/netty/netty-codec-socks/4.1.14.Final/netty-codec-socks-4.1.14.Final.pom (1.4 kB at 20 kB/s)
[INFO] Downloading from wso2.releases: https://maven.wso2.org/nexus/content/repositories/releases/io/grpc/grpc-stub/1.6.1/grpc-stub-1.6.1.pom
[INFO] Downloading from wso2-nexus: https://maven.wso2.org/nexus/content/groups/wso2-public/io/grpc/grpc-stub/1.6.1/grpc-stub-1.6.1.pom
[INFO] Downloaded from wso2-nexus: https://maven.wso2.org/nexus/content/groups/wso2-public/io/grpc/grpc-stub/1.6.1/grpc-stub-1.6.1.pom (2.1 kB at 148 kB/s)
[INFO] Downloading from wso2.releases: https://maven.wso2.org/nexus/content/repositories/releases/io/grpc/grpc-auth/1.6.1/grpc-auth-1.6.1.pom
[INFO] Downloading from wso2-nexus: https://maven.wso2.org/nexus/content/groups/wso2-public/io/grpc/grpc-auth/1.6.1/grpc-auth-1.6.1.pom
[INFO] Downloaded from wso2-nexus: https://maven.wso2.org/nexus/content/groups/wso2-public/io/grpc/grpc-auth/1.6.1/grpc-auth-1.6.1.pom (2.1 kB at 74 kB/s)
[INFO] Downloading from wso2.releases: https://maven.wso2.org/nexus/content/repositories/releases/com/google/auth/google-auth-library-credentials/0.4.0/google-auth-library-credentials-0.4.0.pom
[INFO] Downloading from wso2-nexus: https://maven.wso2.org/nexus/content/groups/wso2-public/com/google/auth/google-auth-library-credentials/0.4.0/google-auth-library-credentials-0.4.0.pom
[INFO] Downloaded from wso2-nexus: https://maven.wso2.org/nexus/content/groups/wso2-public/com/google/auth/google-auth-library-credentials/0.4.0/google-auth-library-credentials-0.4.0.pom (1.3 kB at 34 kB/s)
[INFO] Downloading from wso2.releases: https://maven.wso2.org/nexus/content/repositories/releases/com/google/auth/google-auth-library-parent/0.4.0/google-auth-library-parent-0.4.0.pom
[INFO] Downloading from wso2-nexus: https://maven.wso2.org/nexus/content/groups/wso2-public/com/google/auth/google-auth-library-parent/0.4.0/google-auth-library-parent-0.4.0.pom
[INFO] Downloaded from wso2-nexus: https://maven.wso2.org/nexus/content/groups/wso2-public/com/google/auth/google-auth-library-parent/0.4.0/google-auth-library-parent-0.4.0.pom (6.1 kB at 256 kB/s)
[INFO] Downloading from wso2.releases: https://maven.wso2.org/nexus/content/repositories/releases/com/google/api/gax-grpc/0.26.0/gax-grpc-0.26.0.pom
[INFO] Downloading from wso2-nexus: https://maven.wso2.org/nexus/content/groups/wso2-public/com/google/api/gax-grpc/0.26.0/gax-grpc-0.26.0.pom
[INFO] Downloaded from wso2-nexus: https://maven.wso2.org/nexus/content/groups/wso2-public/com/google/api/gax-grpc/0.26.0/gax-grpc-0.26.0.pom (6.7 kB at 67 kB/s)
[INFO] Downloading from wso2.releases: https://maven.wso2.org/nexus/content/repositories/releases/com/google/api/grpc/proto-google-common-protos/0.1.13/proto-google-common-protos-0.1.13.pom
[INFO] Downloading from wso2-nexus: https://maven.wso2.org/nexus/content/groups/wso2-public/com/google/api/grpc/proto-google-common-protos/0.1.13/proto-google-common-protos-0.1.13.pom
[INFO] Downloaded from wso2-nexus: https://maven.wso2.org/nexus/content/groups/wso2-public/com/google/api/grpc/proto-google-common-protos/0.1.13/proto-google-common-protos-0.1.13.pom (2.5 kB at 31 kB/s)
[INFO] Downloading from wso2.releases: https://maven.wso2.org/nexus/content/repositories/releases/com/google/api/grpc/proto-google-cloud-logging-v2/0.1.21/proto-google-cloud-logging-v2-0.1.21.pom
[INFO] Downloading from wso2-nexus: https://maven.wso2.org/nexus/content/groups/wso2-public/com/google/api/grpc/proto-google-cloud-logging-v2/0.1.21/proto-google-cloud-logging-v2-0.1.21.pom
[INFO] Downloaded from wso2-nexus: https://maven.wso2.org/nexus/content/groups/wso2-public/com/google/api/grpc/proto-google-cloud-logging-v2/0.1.21/proto-google-cloud-logging-v2-0.1.21.pom (2.7 kB at 52 kB/s)
[INFO] Downloading from wso2.releases: https://maven.wso2.org/nexus/content/repositories/releases/org/wso2/orbit/io/fabric8/kubernetes-client/5.8.0.wso2v1/kubernetes-client-5.8.0.wso2v1.pom
[INFO] Downloading from wso2-nexus: https://maven.wso2.org/nexus/content/groups/wso2-public/org/wso2/orbit/io/fabric8/kubernetes-client/5.8.0.wso2v1/kubernetes-client-5.8.0.wso2v1.pom
[INFO] Downloading from 3rd-party: https://maven.wso2.org/nexus/content/repositories/thirdparty/org/wso2/orbit/io/fabric8/kubernetes-client/5.8.0.wso2v1/kubernetes-client-5.8.0.wso2v1.pom
[INFO] Downloading from shibboleth.internet2.edu: https://build.shibboleth.net/nexus/content/groups/public/org/wso2/orbit/io/fabric8/kubernetes-client/5.8.0.wso2v1/kubernetes-client-5.8.0.wso2v1.pom
[INFO] Downloading from shibboleth-release: https://build.shibboleth.net/nexus/content/groups/public/org/wso2/orbit/io/fabric8/kubernetes-client/5.8.0.wso2v1/kubernetes-client-5.8.0.wso2v1.pom
[INFO] Downloading from central: https://repo.maven.apache.org/maven2/org/wso2/orbit/io/fabric8/kubernetes-client/5.8.0.wso2v1/kubernetes-client-5.8.0.wso2v1.pom
[WARNING] The POM for org.wso2.orbit.io.fabric8:kubernetes-client:jar:5.8.0.wso2v1 is missing, no dependency information available
[INFO] Downloading from wso2.releases: https://maven.wso2.org/nexus/content/repositories/releases/org/testng/testng/6.8.1/testng-6.8.1.jar
[INFO] Downloading from wso2.releases: https://maven.wso2.org/nexus/content/repositories/releases/com/google/cloud/google-cloud-logging/1.8.0/google-cloud-logging-1.8.0.jar
[INFO] Downloading from wso2.releases: https://maven.wso2.org/nexus/content/repositories/releases/io/netty/netty-tcnative-boringssl-static/2.0.3.Final/netty-tcnative-boringssl-static-2.0.3.Final.jar
[INFO] Downloading from wso2.releases: https://maven.wso2.org/nexus/content/repositories/releases/com/google/cloud/google-cloud-core/1.8.0/google-cloud-core-1.8.0.jar
[INFO] Downloading from wso2.releases: https://maven.wso2.org/nexus/content/repositories/releases/com/google/guava/guava/20.0/guava-20.0.jar
[INFO] Downloading from wso2.releases: https://maven.wso2.org/nexus/content/repositories/releases/joda-time/joda-time/2.9.2/joda-time-2.9.2.jar
[INFO] Downloading from wso2.releases: https://maven.wso2.org/nexus/content/repositories/releases/org/json/json/20160212/json-20160212.jar
[INFO] Downloading from wso2.releases: https://maven.wso2.org/nexus/content/repositories/releases/com/google/http-client/google-http-client/1.22.0/google-http-client-1.22.0.jar
[INFO] Downloading from wso2.releases: https://maven.wso2.org/nexus/content/repositories/releases/org/apache/httpcomponents/httpclient/4.0.1/httpclient-4.0.1.jar
[INFO] Downloading from wso2.releases: https://maven.wso2.org/nexus/content/repositories/releases/com/google/code/findbugs/jsr305/3.0.0/jsr305-3.0.0.jar
[INFO] Downloading from wso2.releases: https://maven.wso2.org/nexus/content/repositories/releases/com/google/api/api-common/1.1.0/api-common-1.1.0.jar
[INFO] Downloading from wso2.releases: https://maven.wso2.org/nexus/content/repositories/releases/com/google/api/gax/1.9.0/gax-1.9.0.jar
[INFO] Downloading from wso2.releases: https://maven.wso2.org/nexus/content/repositories/releases/com/google/protobuf/protobuf-java-util/3.3.1/protobuf-java-util-3.3.1.jar
[INFO] Downloading from wso2.releases: https://maven.wso2.org/nexus/content/repositories/releases/com/google/code/gson/gson/2.7/gson-2.7.jar
[INFO] Downloading from wso2.releases: https://maven.wso2.org/nexus/content/repositories/releases/com/google/api/grpc/proto-google-common-protos/0.1.21/proto-google-common-protos-0.1.21.jar
[INFO] Downloading from wso2.releases: https://maven.wso2.org/nexus/content/repositories/releases/com/google/api/grpc/proto-google-iam-v1/0.1.21/proto-google-iam-v1-0.1.21.jar
[INFO] Downloading from wso2.releases: https://maven.wso2.org/nexus/content/repositories/releases/com/google/cloud/google-cloud-core-grpc/1.8.0/google-cloud-core-grpc-1.8.0.jar
[INFO] Downloading from wso2.releases: https://maven.wso2.org/nexus/content/repositories/releases/com/google/auth/google-auth-library-credentials/0.8.0/google-auth-library-credentials-0.8.0.jar
[INFO] Downloading from wso2.releases: https://maven.wso2.org/nexus/content/repositories/releases/com/google/protobuf/protobuf-java/3.3.1/protobuf-java-3.3.1.jar
[INFO] Downloading from wso2.releases: https://maven.wso2.org/nexus/content/repositories/releases/io/grpc/grpc-protobuf/1.6.1/grpc-protobuf-1.6.1.jar
[INFO] Downloading from wso2.releases: https://maven.wso2.org/nexus/content/repositories/releases/io/grpc/grpc-protobuf-lite/1.6.1/grpc-protobuf-lite-1.6.1.jar
[INFO] Downloading from wso2.releases: https://maven.wso2.org/nexus/content/repositories/releases/io/grpc/grpc-context/1.6.1/grpc-context-1.6.1.jar
[INFO] Downloading from wso2.releases: https://maven.wso2.org/nexus/content/repositories/releases/com/google/api/gax-grpc/0.26.0/gax-grpc-0.26.0.jar
[INFO] Downloading from wso2.releases: https://maven.wso2.org/nexus/content/repositories/releases/com/google/auto/value/auto-value/1.2/auto-value-1.2.jar
[INFO] Downloading from wso2.releases: https://maven.wso2.org/nexus/content/repositories/releases/org/threeten/threetenbp/1.3.3/threetenbp-1.3.3.jar
[INFO] Downloading from wso2.releases: https://maven.wso2.org/nexus/content/repositories/releases/com/google/auth/google-auth-library-oauth2-http/0.8.0/google-auth-library-oauth2-http-0.8.0.jar
[INFO] Downloading from wso2.releases: https://maven.wso2.org/nexus/content/repositories/releases/com/google/http-client/google-http-client-jackson2/1.19.0/google-http-client-jackson2-1.19.0.jar
[INFO] Downloading from wso2.releases: https://maven.wso2.org/nexus/content/repositories/releases/com/fasterxml/jackson/core/jackson-core/2.1.3/jackson-core-2.1.3.jar
[INFO] Downloading from wso2.releases: https://maven.wso2.org/nexus/content/repositories/releases/com/google/api/grpc/proto-google-cloud-logging-v2/0.1.21/proto-google-cloud-logging-v2-0.1.21.jar
[INFO] Downloading from wso2.releases: https://maven.wso2.org/nexus/content/repositories/releases/io/grpc/grpc-netty/1.6.1/grpc-netty-1.6.1.jar
[INFO] Downloading from wso2.releases: https://maven.wso2.org/nexus/content/repositories/releases/com/google/errorprone/error_prone_annotations/2.0.19/error_prone_annotations-2.0.19.jar
[INFO] Downloading from wso2.releases: https://maven.wso2.org/nexus/content/repositories/releases/com/google/instrumentation/instrumentation-api/0.4.3/instrumentation-api-0.4.3.jar
[INFO] Downloading from wso2.releases: https://maven.wso2.org/nexus/content/repositories/releases/io/opencensus/opencensus-api/0.5.1/opencensus-api-0.5.1.jar
[INFO] Downloading from wso2.releases: https://maven.wso2.org/nexus/content/repositories/releases/io/netty/netty-codec-http/4.1.14.Final/netty-codec-http-4.1.14.Final.jar
[INFO] Downloading from wso2.releases: https://maven.wso2.org/nexus/content/repositories/releases/io/netty/netty-codec/4.1.14.Final/netty-codec-4.1.14.Final.jar
[INFO] Downloading from wso2.releases: https://maven.wso2.org/nexus/content/repositories/releases/io/netty/netty-handler/4.1.14.Final/netty-handler-4.1.14.Final.jar
[INFO] Downloading from wso2.releases: https://maven.wso2.org/nexus/content/repositories/releases/io/netty/netty-buffer/4.1.14.Final/netty-buffer-4.1.14.Final.jar
[INFO] Downloading from wso2.releases: https://maven.wso2.org/nexus/content/repositories/releases/io/netty/netty-common/4.1.14.Final/netty-common-4.1.14.Final.jar
[INFO] Downloading from wso2.releases: https://maven.wso2.org/nexus/content/repositories/releases/io/netty/netty-handler-proxy/4.1.14.Final/netty-handler-proxy-4.1.14.Final.jar
[INFO] Downloading from wso2.releases: https://maven.wso2.org/nexus/content/repositories/releases/io/netty/netty-transport/4.1.14.Final/netty-transport-4.1.14.Final.jar
[INFO] Downloading from wso2.releases: https://maven.wso2.org/nexus/content/repositories/releases/io/netty/netty-resolver/4.1.14.Final/netty-resolver-4.1.14.Final.jar
[INFO] Downloading from wso2.releases: https://maven.wso2.org/nexus/content/repositories/releases/io/netty/netty-codec-socks/4.1.14.Final/netty-codec-socks-4.1.14.Final.jar
[INFO] Downloading from wso2.releases: https://maven.wso2.org/nexus/content/repositories/releases/io/grpc/grpc-stub/1.6.1/grpc-stub-1.6.1.jar
[INFO] Downloading from wso2.releases: https://maven.wso2.org/nexus/content/repositories/releases/io/grpc/grpc-auth/1.6.1/grpc-auth-1.6.1.jar
[INFO] Downloading from wso2.releases: https://maven.wso2.org/nexus/content/repositories/releases/org/wso2/orbit/io/fabric8/kubernetes-client/5.8.0.wso2v1/kubernetes-client-5.8.0.wso2v1.jar
[INFO] Downloading from wso2-nexus: https://maven.wso2.org/nexus/content/groups/wso2-public/org/testng/testng/6.8.1/testng-6.8.1.jar
[INFO] Downloading from wso2-nexus: https://maven.wso2.org/nexus/content/groups/wso2-public/com/google/cloud/google-cloud-logging/1.8.0/google-cloud-logging-1.8.0.jar
[INFO] Downloading from wso2-nexus: https://maven.wso2.org/nexus/content/groups/wso2-public/io/netty/netty-tcnative-boringssl-static/2.0.3.Final/netty-tcnative-boringssl-static-2.0.3.Final.jar
[INFO] Downloading from wso2-nexus: https://maven.wso2.org/nexus/content/groups/wso2-public/com/google/cloud/google-cloud-core/1.8.0/google-cloud-core-1.8.0.jar
[INFO] Downloading from wso2-nexus: https://maven.wso2.org/nexus/content/groups/wso2-public/com/google/guava/guava/20.0/guava-20.0.jar
[INFO] Downloaded from wso2-nexus: https://maven.wso2.org/nexus/content/groups/wso2-public/com/google/cloud/google-cloud-logging/1.8.0/google-cloud-logging-1.8.0.jar (209 kB at 4.5 MB/s)
[INFO] Downloading from wso2-nexus: https://maven.wso2.org/nexus/content/groups/wso2-public/joda-time/joda-time/2.9.2/joda-time-2.9.2.jar
[INFO] Downloaded from wso2-nexus: https://maven.wso2.org/nexus/content/groups/wso2-public/com/google/cloud/google-cloud-core/1.8.0/google-cloud-core-1.8.0.jar (119 kB at 2.2 MB/s)
[INFO] Downloading from wso2-nexus: https://maven.wso2.org/nexus/content/groups/wso2-public/org/json/json/20160212/json-20160212.jar
[INFO] Downloaded from wso2-nexus: https://maven.wso2.org/nexus/content/groups/wso2-public/org/testng/testng/6.8.1/testng-6.8.1.jar (834 kB at 11 MB/s)
[INFO] Downloading from wso2-nexus: https://maven.wso2.org/nexus/content/groups/wso2-public/com/google/http-client/google-http-client/1.22.0/google-http-client-1.22.0.jar
[INFO] Downloaded from wso2-nexus: https://maven.wso2.org/nexus/content/groups/wso2-public/org/json/json/20160212/json-20160212.jar (49 kB at 585 kB/s)
[INFO] Downloading from wso2-nexus: https://maven.wso2.org/nexus/content/groups/wso2-public/org/apache/httpcomponents/httpclient/4.0.1/httpclient-4.0.1.jar
[INFO] Downloaded from wso2-nexus: https://maven.wso2.org/nexus/content/groups/wso2-public/joda-time/joda-time/2.9.2/joda-time-2.9.2.jar (626 kB at 6.2 MB/s)
[INFO] Downloading from wso2-nexus: https://maven.wso2.org/nexus/content/groups/wso2-public/com/google/code/findbugs/jsr305/3.0.0/jsr305-3.0.0.jar
[INFO] Downloaded from wso2-nexus: https://maven.wso2.org/nexus/content/groups/wso2-public/com/google/code/findbugs/jsr305/3.0.0/jsr305-3.0.0.jar (33 kB at 300 kB/s)
[INFO] Downloading from wso2-nexus: https://maven.wso2.org/nexus/content/groups/wso2-public/com/google/api/api-common/1.1.0/api-common-1.1.0.jar
[INFO] Downloaded from wso2-nexus: https://maven.wso2.org/nexus/content/groups/wso2-public/com/google/guava/guava/20.0/guava-20.0.jar (2.4 MB at 22 MB/s)
[INFO] Downloading from wso2-nexus: https://maven.wso2.org/nexus/content/groups/wso2-public/com/google/api/gax/1.9.0/gax-1.9.0.jar
[INFO] Downloaded from wso2-nexus: https://maven.wso2.org/nexus/content/groups/wso2-public/com/google/http-client/google-http-client/1.22.0/google-http-client-1.22.0.jar (357 kB at 3.1 MB/s)
[INFO] Downloading from wso2-nexus: https://maven.wso2.org/nexus/content/groups/wso2-public/com/google/protobuf/protobuf-java-util/3.3.1/protobuf-java-util-3.3.1.jar
[INFO] Downloaded from wso2-nexus: https://maven.wso2.org/nexus/content/groups/wso2-public/org/apache/httpcomponents/httpclient/4.0.1/httpclient-4.0.1.jar (291 kB at 2.4 MB/s)
[INFO] Downloading from wso2-nexus: https://maven.wso2.org/nexus/content/groups/wso2-public/com/google/code/gson/gson/2.7/gson-2.7.jar
[INFO] Downloaded from wso2-nexus: https://maven.wso2.org/nexus/content/groups/wso2-public/com/google/api/gax/1.9.0/gax-1.9.0.jar (196 kB at 1.5 MB/s)
[INFO] Downloading from wso2-nexus: https://maven.wso2.org/nexus/content/groups/wso2-public/com/google/api/grpc/proto-google-common-protos/0.1.21/proto-google-common-protos-0.1.21.jar
[INFO] Downloaded from wso2-nexus: https://maven.wso2.org/nexus/content/groups/wso2-public/io/netty/netty-tcnative-boringssl-static/2.0.3.Final/netty-tcnative-boringssl-static-2.0.3.Final.jar (2.4 MB at 17 MB/s)
[INFO] Downloading from wso2-nexus: https://maven.wso2.org/nexus/content/groups/wso2-public/com/google/api/grpc/proto-google-iam-v1/0.1.21/proto-google-iam-v1-0.1.21.jar
[INFO] Downloaded from wso2-nexus: https://maven.wso2.org/nexus/content/groups/wso2-public/com/google/protobuf/protobuf-java-util/3.3.1/protobuf-java-util-3.3.1.jar (68 kB at 484 kB/s)
[INFO] Downloading from wso2-nexus: https://maven.wso2.org/nexus/content/groups/wso2-public/com/google/cloud/google-cloud-core-grpc/1.8.0/google-cloud-core-grpc-1.8.0.jar
[INFO] Downloaded from wso2-nexus: https://maven.wso2.org/nexus/content/groups/wso2-public/com/google/api/api-common/1.1.0/api-common-1.1.0.jar (44 kB at 312 kB/s)
[INFO] Downloading from wso2-nexus: https://maven.wso2.org/nexus/content/groups/wso2-public/com/google/auth/google-auth-library-credentials/0.8.0/google-auth-library-credentials-0.8.0.jar
[INFO] Downloaded from wso2-nexus: https://maven.wso2.org/nexus/content/groups/wso2-public/com/google/code/gson/gson/2.7/gson-2.7.jar (232 kB at 1.6 MB/s)
[INFO] Downloading from wso2-nexus: https://maven.wso2.org/nexus/content/groups/wso2-public/com/google/protobuf/protobuf-java/3.3.1/protobuf-java-3.3.1.jar
[INFO] Downloaded from wso2-nexus: https://maven.wso2.org/nexus/content/groups/wso2-public/com/google/cloud/google-cloud-core-grpc/1.8.0/google-cloud-core-grpc-1.8.0.jar (11 kB at 71 kB/s)
[INFO] Downloading from wso2-nexus: https://maven.wso2.org/nexus/content/groups/wso2-public/io/grpc/grpc-protobuf/1.6.1/grpc-protobuf-1.6.1.jar
[INFO] Downloaded from wso2-nexus: https://maven.wso2.org/nexus/content/groups/wso2-public/com/google/auth/google-auth-library-credentials/0.8.0/google-auth-library-credentials-0.8.0.jar (5.7 kB at 37 kB/s)
[INFO] Downloading from wso2-nexus: https://maven.wso2.org/nexus/content/groups/wso2-public/io/grpc/grpc-protobuf-lite/1.6.1/grpc-protobuf-lite-1.6.1.jar
[INFO] Downloaded from wso2-nexus: https://maven.wso2.org/nexus/content/groups/wso2-public/io/grpc/grpc-protobuf/1.6.1/grpc-protobuf-1.6.1.jar (5.9 kB at 35 kB/s)
[INFO] Downloading from wso2-nexus: https://maven.wso2.org/nexus/content/groups/wso2-public/io/grpc/grpc-context/1.6.1/grpc-context-1.6.1.jar
[INFO] Downloaded from wso2-nexus: https://maven.wso2.org/nexus/content/groups/wso2-public/io/grpc/grpc-protobuf-lite/1.6.1/grpc-protobuf-lite-1.6.1.jar (7.7 kB at 46 kB/s)
[INFO] Downloading from wso2-nexus: https://maven.wso2.org/nexus/content/groups/wso2-public/com/google/api/gax-grpc/0.26.0/gax-grpc-0.26.0.jar
[INFO] Downloaded from wso2-nexus: https://maven.wso2.org/nexus/content/groups/wso2-public/com/google/api/grpc/proto-google-iam-v1/0.1.21/proto-google-iam-v1-0.1.21.jar (106 kB at 560 kB/s)
[INFO] Downloading from wso2-nexus: https://maven.wso2.org/nexus/content/groups/wso2-public/com/google/auto/value/auto-value/1.2/auto-value-1.2.jar
[INFO] Downloaded from wso2-nexus: https://maven.wso2.org/nexus/content/groups/wso2-public/com/google/api/gax-grpc/0.26.0/gax-grpc-0.26.0.jar (94 kB at 490 kB/s)
[INFO] Downloading from wso2-nexus: https://maven.wso2.org/nexus/content/groups/wso2-public/org/threeten/threetenbp/1.3.3/threetenbp-1.3.3.jar
[INFO] Downloaded from wso2-nexus: https://maven.wso2.org/nexus/content/groups/wso2-public/io/grpc/grpc-context/1.6.1/grpc-context-1.6.1.jar (21 kB at 107 kB/s)
[INFO] Downloading from wso2-nexus: https://maven.wso2.org/nexus/content/groups/wso2-public/com/google/auth/google-auth-library-oauth2-http/0.8.0/google-auth-library-oauth2-http-0.8.0.jar
[INFO] Downloaded from wso2-nexus: https://maven.wso2.org/nexus/content/groups/wso2-public/com/google/api/grpc/proto-google-common-protos/0.1.21/proto-google-common-protos-0.1.21.jar (1.1 MB at 5.1 MB/s)
[INFO] Downloading from wso2-nexus: https://maven.wso2.org/nexus/content/groups/wso2-public/com/google/http-client/google-http-client-jackson2/1.19.0/google-http-client-jackson2-1.19.0.jar
[INFO] Downloaded from wso2-nexus: https://maven.wso2.org/nexus/content/groups/wso2-public/com/google/protobuf/protobuf-java/3.3.1/protobuf-java-3.3.1.jar (1.4 MB at 6.3 MB/s)
[INFO] Downloading from wso2-nexus: https://maven.wso2.org/nexus/content/groups/wso2-public/com/fasterxml/jackson/core/jackson-core/2.1.3/jackson-core-2.1.3.jar
[INFO] Downloaded from wso2-nexus: https://maven.wso2.org/nexus/content/groups/wso2-public/com/google/http-client/google-http-client-jackson2/1.19.0/google-http-client-jackson2-1.19.0.jar (6.7 kB at 30 kB/s)
[INFO] Downloading from wso2-nexus: https://maven.wso2.org/nexus/content/groups/wso2-public/com/google/api/grpc/proto-google-cloud-logging-v2/0.1.21/proto-google-cloud-logging-v2-0.1.21.jar
[INFO] Downloaded from wso2-nexus: https://maven.wso2.org/nexus/content/groups/wso2-public/com/google/auth/google-auth-library-oauth2-http/0.8.0/google-auth-library-oauth2-http-0.8.0.jar (67 kB at 299 kB/s)
[INFO] Downloading from wso2-nexus: https://maven.wso2.org/nexus/content/groups/wso2-public/io/grpc/grpc-netty/1.6.1/grpc-netty-1.6.1.jar
[INFO] Downloaded from wso2-nexus: https://maven.wso2.org/nexus/content/groups/wso2-public/org/threeten/threetenbp/1.3.3/threetenbp-1.3.3.jar (511 kB at 2.0 MB/s)
[INFO] Downloading from wso2-nexus: https://maven.wso2.org/nexus/content/groups/wso2-public/io/grpc/grpc-core/1.6.1/grpc-core-1.6.1.jar
[INFO] Downloaded from wso2-nexus: https://maven.wso2.org/nexus/content/groups/wso2-public/io/grpc/grpc-netty/1.6.1/grpc-netty-1.6.1.jar (177 kB at 701 kB/s)
[INFO] Downloading from wso2-nexus: https://maven.wso2.org/nexus/content/groups/wso2-public/com/google/errorprone/error_prone_annotations/2.0.19/error_prone_annotations-2.0.19.jar
[INFO] Downloaded from wso2-nexus: https://maven.wso2.org/nexus/content/groups/wso2-public/com/google/api/grpc/proto-google-cloud-logging-v2/0.1.21/proto-google-cloud-logging-v2-0.1.21.jar (391 kB at 1.3 MB/s)
[INFO] Downloading from wso2-nexus: https://maven.wso2.org/nexus/content/groups/wso2-public/com/google/instrumentation/instrumentation-api/0.4.3/instrumentation-api-0.4.3.jar
[INFO] Downloaded from wso2-nexus: https://maven.wso2.org/nexus/content/groups/wso2-public/com/google/auto/value/auto-value/1.2/auto-value-1.2.jar (1.4 MB at 4.5 MB/s)
[INFO] Downloading from wso2-nexus: https://maven.wso2.org/nexus/content/groups/wso2-public/io/opencensus/opencensus-api/0.5.1/opencensus-api-0.5.1.jar
[INFO] Downloaded from wso2-nexus: https://maven.wso2.org/nexus/content/groups/wso2-public/com/fasterxml/jackson/core/jackson-core/2.1.3/jackson-core-2.1.3.jar (207 kB at 646 kB/s)
[INFO] Downloading from wso2-nexus: https://maven.wso2.org/nexus/content/groups/wso2-public/io/netty/netty-codec-http2/4.1.14.Final/netty-codec-http2-4.1.14.Final.jar
[INFO] Downloaded from wso2-nexus: https://maven.wso2.org/nexus/content/groups/wso2-public/com/google/errorprone/error_prone_annotations/2.0.19/error_prone_annotations-2.0.19.jar (12 kB at 37 kB/s)
[INFO] Downloading from wso2-nexus: https://maven.wso2.org/nexus/content/groups/wso2-public/io/netty/netty-codec-http/4.1.14.Final/netty-codec-http-4.1.14.Final.jar
[INFO] Downloaded from wso2-nexus: https://maven.wso2.org/nexus/content/groups/wso2-public/io/opencensus/opencensus-api/0.5.1/opencensus-api-0.5.1.jar (108 kB at 328 kB/s)
[INFO] Downloading from wso2-nexus: https://maven.wso2.org/nexus/content/groups/wso2-public/io/netty/netty-codec/4.1.14.Final/netty-codec-4.1.14.Final.jar
[INFO] Downloaded from wso2-nexus: https://maven.wso2.org/nexus/content/groups/wso2-public/io/grpc/grpc-core/1.6.1/grpc-core-1.6.1.jar (483 kB at 1.4 MB/s)
[INFO] Downloading from wso2-nexus: https://maven.wso2.org/nexus/content/groups/wso2-public/io/netty/netty-handler/4.1.14.Final/netty-handler-4.1.14.Final.jar
[INFO] Downloaded from wso2-nexus: https://maven.wso2.org/nexus/content/groups/wso2-public/io/netty/netty-codec-http2/4.1.14.Final/netty-codec-http2-4.1.14.Final.jar (370 kB at 1.0 MB/s)
[INFO] Downloading from wso2-nexus: https://maven.wso2.org/nexus/content/groups/wso2-public/io/netty/netty-buffer/4.1.14.Final/netty-buffer-4.1.14.Final.jar
[INFO] Downloaded from wso2-nexus: https://maven.wso2.org/nexus/content/groups/wso2-public/com/google/instrumentation/instrumentation-api/0.4.3/instrumentation-api-0.4.3.jar (94 kB at 256 kB/s)
[INFO] Downloading from wso2-nexus: https://maven.wso2.org/nexus/content/groups/wso2-public/io/netty/netty-common/4.1.14.Final/netty-common-4.1.14.Final.jar
[INFO] Downloaded from wso2-nexus: https://maven.wso2.org/nexus/content/groups/wso2-public/io/netty/netty-codec/4.1.14.Final/netty-codec-4.1.14.Final.jar (312 kB at 818 kB/s)
[INFO] Downloading from wso2-nexus: https://maven.wso2.org/nexus/content/groups/wso2-public/io/netty/netty-handler-proxy/4.1.14.Final/netty-handler-proxy-4.1.14.Final.jar
[INFO] Downloaded from wso2-nexus: https://maven.wso2.org/nexus/content/groups/wso2-public/io/netty/netty-handler/4.1.14.Final/netty-handler-4.1.14.Final.jar (360 kB at 926 kB/s)
[INFO] Downloading from wso2-nexus: https://maven.wso2.org/nexus/content/groups/wso2-public/io/netty/netty-transport/4.1.14.Final/netty-transport-4.1.14.Final.jar
[INFO] Downloaded from wso2-nexus: https://maven.wso2.org/nexus/content/groups/wso2-public/io/netty/netty-codec-http/4.1.14.Final/netty-codec-http-4.1.14.Final.jar (548 kB at 1.4 MB/s)
[INFO] Downloading from wso2-nexus: https://maven.wso2.org/nexus/content/groups/wso2-public/io/netty/netty-resolver/4.1.14.Final/netty-resolver-4.1.14.Final.jar
[INFO] Downloaded from wso2-nexus: https://maven.wso2.org/nexus/content/groups/wso2-public/io/netty/netty-handler-proxy/4.1.14.Final/netty-handler-proxy-4.1.14.Final.jar (21 kB at 53 kB/s)
[INFO] Downloading from wso2-nexus: https://maven.wso2.org/nexus/content/groups/wso2-public/io/netty/netty-codec-socks/4.1.14.Final/netty-codec-socks-4.1.14.Final.jar
[INFO] Downloaded from wso2-nexus: https://maven.wso2.org/nexus/content/groups/wso2-public/io/netty/netty-buffer/4.1.14.Final/netty-buffer-4.1.14.Final.jar (270 kB at 671 kB/s)
[INFO] Downloading from wso2-nexus: https://maven.wso2.org/nexus/content/groups/wso2-public/io/grpc/grpc-stub/1.6.1/grpc-stub-1.6.1.jar
[INFO] Downloaded from wso2-nexus: https://maven.wso2.org/nexus/content/groups/wso2-public/io/netty/netty-common/4.1.14.Final/netty-common-4.1.14.Final.jar (550 kB at 1.3 MB/s)
[INFO] Downloading from wso2-nexus: https://maven.wso2.org/nexus/content/groups/wso2-public/io/grpc/grpc-auth/1.6.1/grpc-auth-1.6.1.jar
[INFO] Downloaded from wso2-nexus: https://maven.wso2.org/nexus/content/groups/wso2-public/io/netty/netty-codec-socks/4.1.14.Final/netty-codec-socks-4.1.14.Final.jar (119 kB at 281 kB/s)
[INFO] Downloading from wso2-nexus: https://maven.wso2.org/nexus/content/groups/wso2-public/org/wso2/orbit/io/fabric8/kubernetes-client/5.8.0.wso2v1/kubernetes-client-5.8.0.wso2v1.jar
[INFO] Downloaded from wso2-nexus: https://maven.wso2.org/nexus/content/groups/wso2-public/io/grpc/grpc-stub/1.6.1/grpc-stub-1.6.1.jar (37 kB at 87 kB/s)
[INFO] Downloaded from wso2-nexus: https://maven.wso2.org/nexus/content/groups/wso2-public/io/grpc/grpc-auth/1.6.1/grpc-auth-1.6.1.jar (12 kB at 29 kB/s)
[INFO] Downloaded from wso2-nexus: https://maven.wso2.org/nexus/content/groups/wso2-public/io/netty/netty-resolver/4.1.14.Final/netty-resolver-4.1.14.Final.jar (32 kB at 75 kB/s)
[INFO] Downloaded from wso2-nexus: https://maven.wso2.org/nexus/content/groups/wso2-public/io/netty/netty-transport/4.1.14.Final/netty-transport-4.1.14.Final.jar (439 kB at 985 kB/s)
[INFO] Downloading from 3rd-party: https://maven.wso2.org/nexus/content/repositories/thirdparty/org/wso2/orbit/io/fabric8/kubernetes-client/5.8.0.wso2v1/kubernetes-client-5.8.0.wso2v1.jar
[INFO] Downloading from shibboleth.internet2.edu: https://build.shibboleth.net/nexus/content/groups/public/org/wso2/orbit/io/fabric8/kubernetes-client/5.8.0.wso2v1/kubernetes-client-5.8.0.wso2v1.jar
[INFO] Downloading from shibboleth-release: https://build.shibboleth.net/nexus/content/groups/public/org/wso2/orbit/io/fabric8/kubernetes-client/5.8.0.wso2v1/kubernetes-client-5.8.0.wso2v1.jar
[INFO] Downloading from central: https://repo.maven.apache.org/maven2/org/wso2/orbit/io/fabric8/kubernetes-client/5.8.0.wso2v1/kubernetes-client-5.8.0.wso2v1.jar
[INFO] 
[INFO] ------------------------------------------------------------------------
[INFO] Skipping WSO2 AppCloud
[INFO] This project has been banned from the build due to previous failures.
[INFO] ------------------------------------------------------------------------
[INFO] ------------------------------------------------------------------------
[INFO] Reactor Summary:
[INFO] 
[INFO] WSO2 AppCloud 3.0.0-SNAPSHOT ....................... SUCCESS [  6.727 s]
[INFO] WSO2 AppCloud Components - Common .................. SUCCESS [ 21.812 s]
[INFO] WSO2 AppCloud Components - Core .................... SUCCESS [ 17.673 s]
[INFO] WSO2 AppCloud Components - Runtime provisioning .... FAILURE [  5.594 s]
[INFO] WSO2 AppCloud Management - Management Console ...... SKIPPED
[INFO] WSO2 Carbon - Unit Test Coverage Generation 3.0.0-SNAPSHOT SKIPPED
[INFO] ------------------------------------------------------------------------
[INFO] BUILD FAILURE
[INFO] ------------------------------------------------------------------------
[INFO] Total time: 01:01 min
[INFO] Finished at: 2021-11-01T11:34:31Z
[INFO] ------------------------------------------------------------------------
Waiting for Jenkins to finish collecting data
[ERROR] Failed to execute goal on project org.wso2.appcloud.provisioning.runtime: Could not resolve dependencies for project org.wso2.appcloud:org.wso2.appcloud.provisioning.runtime:bundle:3.0.0-SNAPSHOT: Could not find artifact org.wso2.orbit.io.fabric8:kubernetes-client:jar:5.8.0.wso2v1 in wso2.releases (https://maven.wso2.org/nexus/content/repositories/releases/) -> [Help 1]
[ERROR] 
[ERROR] To see the full stack trace of the errors, re-run Maven with the -e switch.
[ERROR] Re-run Maven using the -X switch to enable full debug logging.
[ERROR] 
[ERROR] For more information about the errors and possible solutions, please read the following articles:
[ERROR] [Help 1] http://cwiki.apache.org/confluence/display/MAVEN/DependencyResolutionException
[ERROR] 
[ERROR] After correcting the problems, you can resume the build with the command
[ERROR]   mvn <goals> -rf :org.wso2.appcloud.provisioning.runtime
[JENKINS] Archiving /home/jenkins/workspace/sonar-app-cloud/modules/jaggeryapps/appmgt/pom.xml to org.wso2.appcloud/appmgt/3.0.0-SNAPSHOT/appmgt-3.0.0-SNAPSHOT.pom
[JENKINS] Archiving /home/jenkins/workspace/sonar-app-cloud/modules/components/org.wso2.appcloud.common/pom.xml to org.wso2.appcloud/org.wso2.appcloud.common/3.0.0-SNAPSHOT/org.wso2.appcloud.common-3.0.0-SNAPSHOT.pom
[JENKINS] Archiving /home/jenkins/workspace/sonar-app-cloud/modules/components/org.wso2.appcloud.common/target/org.wso2.appcloud.common-3.0.0-SNAPSHOT.jar to org.wso2.appcloud/org.wso2.appcloud.common/3.0.0-SNAPSHOT/org.wso2.appcloud.common-3.0.0-SNAPSHOT.jar
[JENKINS] Archiving /home/jenkins/workspace/sonar-app-cloud/modules/components/org.wso2.appcloud.core/pom.xml to org.wso2.appcloud/org.wso2.appcloud.core/3.0.0-SNAPSHOT/org.wso2.appcloud.core-3.0.0-SNAPSHOT.pom
[JENKINS] Archiving /home/jenkins/workspace/sonar-app-cloud/modules/components/org.wso2.appcloud.core/target/org.wso2.appcloud.core-3.0.0-SNAPSHOT.jar to org.wso2.appcloud/org.wso2.appcloud.core/3.0.0-SNAPSHOT/org.wso2.appcloud.core-3.0.0-SNAPSHOT.jar
[JENKINS] Archiving /home/jenkins/workspace/sonar-app-cloud/modules/components/org.wso2.appcloud.provisioning.runtime/pom.xml to org.wso2.appcloud/org.wso2.appcloud.provisioning.runtime/3.0.0-SNAPSHOT/org.wso2.appcloud.provisioning.runtime-3.0.0-SNAPSHOT.pom
[JENKINS] Archiving /home/jenkins/workspace/sonar-app-cloud/pom.xml to org.wso2.appcloud/appcloud-parent/3.0.0-SNAPSHOT/appcloud-parent-3.0.0-SNAPSHOT.pom
[JENKINS] Archiving /home/jenkins/workspace/sonar-app-cloud/coverage-reports/pom.xml to org.wso2.appcloud/test-coverage/3.0.0-SNAPSHOT/test-coverage-3.0.0-SNAPSHOT.pom
executing script 'Dependency-Summary-Report'
channel stopped
[sonar-app-cloud] $ /bin/sh /tmp/build_step_template4433519219249631520.sh
cat: target/site/dependency-updates-report.html: No such file or directory
/tmp/build_step_template4433519219249631520.sh: 4: /tmp/build_step_template4433519219249631520.sh: cannot create target/site/dependency-updates-report.html: Directory nonexistent
Build step 'Execute managed script' marked build as failure
Archiving artifacts
Finished: FAILURE