Started 10 mo ago
Took 8 min 2 sec on ECS_PRODUCTION-83c9f014af4a3c

Unstable Build #443 (Mar 19, 2021 3:08:05 AM)

No changes.

Started by timer

Revision: 8c923fa5b37793bd9470a147bebf5f3b1984c026
  • refs/remotes/origin/ballerina-1.1.x
Test Result (1 failure / +1)

Identified problems

testService

org.ballerinax.docker.test.utils.DockerTestException: com.spotify.docker.client.exceptions.DockerRequestException: Request error: POST unix://localhost:80/containers/ba4bbb6710ca0414dfb4f2c08951d4c97ee24a2c6ab16026b6dca7b6ccf8f42f/start: 500, body: {"message":"driver failed programming external connectivity on endpoint ballerinax_docker_sample1test (d301510de955c34937e003eed4e2d00a6d90a12ea6795f8909b03fe651fcf966): Bind for 0.0.0.0:9090 failed: port is already allocated"} at org.ballerinax.docker.test.samples.Sample1Test.testService(Sample1Test.java:65) Caused by: com.spotify.docker.client.exceptions.DockerRequestException: Request error: POST unix://localhost:80/containers/ba4bbb6710ca0414dfb4f2c08951d4c97ee24a2c6ab16026b6dca7b6ccf8f42f/start: 500, body: {"message":"driver failed programming external connectivity on endpoint ballerinax_docker_sample1test (d301510de955c34937e003eed4e2d00a6d90a12ea6795f8909b03fe651fcf966): Bind for 0.0.0.0:9090 failed: port is already allocated"} at org.ballerinax.docker.test.samples.Sample1Test.testService(Sample1Test.java:65) Caused by: javax.ws.rs.InternalServerErrorException: HTTP 500 Internal Server Error

Environment Variables(67)15 different
Slave Information(87)10 different
Project Information(16)0 different

Module Builds

Success Ballerinax - Docker Extension17 sec
Success Ballerinax - Docker Extension Annotations15 sec
Success Ballerinax - Docker Extension Test Coverage5.8 sec
Success Ballerinax - Docker Extension Examples7.6 sec
Success Ballerinax - Docker Parent26 sec
Unstable Ballerinax - Docker Extension Tests3 min 19 sec
Success Ballerinax - Docker Generator32 sec