collapse
96%
WDescription%
Test Result: 1 test failing out of a total of 25 tests.96
Build stability: No recent builds failed.100
Build History
x
 Identified problems10 MB
 10 MB
 10 MB
 10 MB
 10 MB
 10 MB
 10 MB
 10 MB
 10 MB
 10 MB

Maven project docker-patch

This project is currently disabled
Project disk usage information + trend graph
Disk Usage: Workspace 0, Builds {all=104823938, locked=0}, Job directory 104845232
Test Result Trend
[Test result trend chart]
(just show failures) enlarge

More graphs
Recent Changes
Latest Test Result (1 failure / +1)

Identified problems

testService

org.ballerinax.docker.test.utils.DockerTestException: com.spotify.docker.client.exceptions.DockerRequestException: Request error: POST unix://localhost:80/containers/ba4bbb6710ca0414dfb4f2c08951d4c97ee24a2c6ab16026b6dca7b6ccf8f42f/start: 500, body: {"message":"driver failed programming external connectivity on endpoint ballerinax_docker_sample1test (d301510de955c34937e003eed4e2d00a6d90a12ea6795f8909b03fe651fcf966): Bind for 0.0.0.0:9090 failed: port is already allocated"} at org.ballerinax.docker.test.samples.Sample1Test.testService(Sample1Test.java:65) Caused by: com.spotify.docker.client.exceptions.DockerRequestException: Request error: POST unix://localhost:80/containers/ba4bbb6710ca0414dfb4f2c08951d4c97ee24a2c6ab16026b6dca7b6ccf8f42f/start: 500, body: {"message":"driver failed programming external connectivity on endpoint ballerinax_docker_sample1test (d301510de955c34937e003eed4e2d00a6d90a12ea6795f8909b03fe651fcf966): Bind for 0.0.0.0:9090 failed: port is already allocated"} at org.ballerinax.docker.test.samples.Sample1Test.testService(Sample1Test.java:65) Caused by: javax.ws.rs.InternalServerErrorException: HTTP 500 Internal Server Error

Latest Test Result (1 failure / +1)