Started 1 day 21 hr ago
Took 6 hr 23 min on ECS_PRODUCTION-21d142338c23ea

Unstable Build #204 (Jan 20, 2022 7:32:04 PM)

Build Artifacts
update.zip18.36 MB view
wso2ei-6.7.0-SNAPSHOT.zip519.17 MB view
No changes.

Started by timer

Revision: 1247f7dd7837122a1b224dc342f28eab2c282291
  • refs/remotes/origin/master
Test Result (6 failures / ±0)Show all failed tests >>>
Jacoco - Overall Coverage Summary
INSTRUCTION0%
BRANCH0%
COMPLEXITY0%
LINE0%
METHOD0%
CLASS0%

Identified problems

testMessagesInMessageProcessor

java.lang.AssertionError: Message Processor : mspAdminTestInMemoryMessageProcessor did not de-activate after failed delivery attempts with OUT_ONLY property. expected: but was: at org.testng.Assert.fail(Assert.java:89) at org.testng.Assert.failNotEquals(Assert.java:489) at org.testng.Assert.assertFalse(Assert.java:58) at org.wso2.carbon.esb.message.processor.test.MessageProcessorAdminTestCase.testMessagesInMessageProcessor(MessageProcessorAdminTestCase.java:191)

xsltTransformationFromUrl

org.apache.axis2.AxisFault: org.apache.synapse.SynapseException: Content-Type:text/xml; charset=UTF-8,Host:localhost:8480,SOAPAction:"urn:getQuote", Unexpected error sending message back at org.apache.axis2.util.Utils.getInboundFaultFromMessageContext(Utils.java:531) at org.apache.axis2.description.OutInAxisOperationClient.handleResponse(OutInAxisOperation.java:382) at org.apache.axis2.description.OutInAxisOperationClient.send(OutInAxisOperation.java:457) at org.apache.axis2.description.OutInAxisOperationClient.executeImpl(OutInAxisOperation.java:228) at org.apache.axis2.client.OperationClient.execute(OperationClient.java:149) at org.apache.axis2.client.ServiceClient.sendReceive(ServiceClient.java:554) at org.apache.axis2.client.ServiceClient.sendReceive(ServiceClient.java:530) at org.wso2.esb.integration.common.utils.clients.stockquoteclient.StockQuoteClient.sendCustomQuoteRequest(StockQuoteClient.java:166) at org.wso2.carbon.esb.mediator.test.xslt.XsltTransformationFromUrlTestCase.xsltTransformationFromUrl(XsltTransformationFromUrlTestCase.java:42)

testPreserveContentTypeHeader

java.lang.AssertionError: Response header modified at org.junit.Assert.fail(Assert.java:88) at org.junit.Assert.assertTrue(Assert.java:41) at org.wso2.carbon.esb.passthru.transport.test.PreseveResponseHeaderTestCase.testPreserveContentTypeHeader(PreseveResponseHeaderTestCase.java:57)

testPollingWithSuspensionLimit

java.lang.AssertionError: JMS Polling suspension is not enabled. expected: but was: at org.testng.Assert.fail(Assert.java:89) at org.testng.Assert.failNotEquals(Assert.java:489) at org.testng.Assert.assertTrue(Assert.java:37) at org.wso2.carbon.esb.jms.transport.test.EI1622JMSInboundMessagePollingConsumerTest.testPollingWithSuspensionLimit(EI1622JMSInboundMessagePollingConsumerTest.java:62)

testPollingWithSuspensionLimitAsZero

java.lang.AssertionError: JMS Polling is not permanently suspended though the suspension limit is 0. expected: but was: at org.testng.Assert.fail(Assert.java:89) at org.testng.Assert.failNotEquals(Assert.java:489) at org.testng.Assert.assertTrue(Assert.java:37) at org.wso2.carbon.esb.jms.transport.test.EI1622JMSInboundMessagePollingConsumerTest.testPollingWithSuspensionLimitAsZero(EI1622JMSInboundMessagePollingConsumerTest.java:74)

testMalformedJSONPayloadInFaultySequence

java.lang.AssertionError: The status code set in the faulty sequence is not received expected:<500> but was:<202> at org.testng.Assert.fail(Assert.java:89) at org.testng.Assert.failNotEquals(Assert.java:489) at org.testng.Assert.assertEquals(Assert.java:118) at org.testng.Assert.assertEquals(Assert.java:365) at org.wso2.carbon.esb.json.EI2757MalformedJSONPayloadFaultyTestCase.testMalformedJSONPayloadInFaultySequence(EI2757MalformedJSONPayloadFaultyTestCase.java:44)

Environment Variables(63)16 different
Slave Information(87)9 different
Project Information(15)0 different

Module Builds

Success EI Integration Test Admin Clients10 sec
Success WSO2 Enterprise Integrator - Automation Extensions29 sec
Success WSO2 BPS Samples16 sec
Success DataServices Clients33 sec
Success WSO2 Enterprise Integrator - Data Service Hosting Integration Tests1.5 sec
Success WSO2 DataServices Integration Test1.1 sec
Success WSO2 DataServices Integration Test Common0.45 sec
Success WSO2 DataServices Samples Parent7.5 sec
Success WSO2 Enterprise Integrator - Component Parent0.72 sec
Success WSO2 Enterprise Integrator - P2 Profile Generation1 min 27 sec
Success WSO2 Enterprise Integrator - Samples Parent0.52 sec
Success EI Test Common Module11 sec
Success EI Integration Test Common Utils22 sec
Success WSO2 Enterprise Integrator - Integration Tests0.61 sec
Success WSO2 Enterprise Integrator - Feature Aggregator Module0.58 sec
Success JAX-RS Basic Demo9.7 sec
 WSO2 Enterprise Integrator - Lightweight P2 Profile Generation (didn’t run)
Success Integration Test Module1.9 sec
Success WSO2 MB - Integration Tests3.7 sec
Success WSO2 Enterprise Integrator - Mediation Integration Tests0.42 sec
 WSO2 Enterprise Integrator - micro-integrator P2 Profile Generation (didn’t run)
 WSO2 MSF4J Runtime (didn’t run)
Success WSO2 Business Process Server Integration Tests - HumanTask Coordination10 min
Success Integration Test Reporting14 sec
Success org.wso2.carbon.ei.migration18 sec
Success EI test Module - Test Connectors1 min 9 sec
Success EI test Module-mediator-127 min
Unstable EI test Module-mediator-215 min
Success EI test Module-Other15 min
Unstable EI test Module - Test Patches20 min
Success EI Test Module - Platform0.64 sec
Success EI test Module - Platform - RabbitMQ Transport4.5 sec
Success EI test Module - Platform - with WSO2MB7.3 sec
Success EI test Module - Sample8 min 41 sec
Success EI test Module-Service18 min
Success EI test Module-Transport27 min
Success EI test Module - UI6.1 sec
 WSO2 Enterprise Integrator - Core Component (didn’t run)
 WSO2 Enterprise Integrator - Core Server Feature (didn’t run)
 WSO2 Enterprise Integrator - Micro Core Component (didn’t run)
 org.wso2.carbon.micro.integrator.security (didn’t run)
 WSO2 Enterprise Integrator - Micro server Component (didn’t run)
 WSO2 Enterprise Integrator - Micro Core Server Feature (didn’t run)
Success WSO2 Carbon - Server Administration UI6.6 sec
Success WSO2 Enterprise Integrator - Admin Console feature1 sec
Success WSO2 Enterprise Integrator - Analytics ELK49 sec
Success WSO2 Enterprise Integrator - Analytics ELK Feature8.4 sec
Success WSO2 Enterprise Integrator - Analytics Feature5.7 sec
Success WSO2 Enterprise Integrator - Analytics Styles1 sec
Success WSO2 Enterprise Integrator Analytics - Styles Features7.9 sec
Success WSO2 Carbon - BPMN Analytics Core Extension15 sec
Success WSO2 ei bpmn Analytics - UDF9.7 sec
Success WSO2 EI Message Broker - Dashboard UI7.6 sec
Success WSO2 EI Broker - Tenant Dashboard UI4.8 sec
Success WSO2 EI Broker Styles1 sec
Success WSO2 EI Broker - Styles Features0.94 sec
Success WSO2 EI Business-Process - Tenant Dashboard UI12 sec
Success WSO2 EI Business-Process - Tenant Dashboard UI6.7 sec
Success WSO2 EI Business-Process - UI styles7 sec
Success WSO2 EI Business Process - Style Features6.5 sec
Success WSO2 BPS - Integration Test Common Module3.7 sec
Success WSO2 BPS - Integration Test Utils3.2 sec
Success WSO2 Business Process Server Integration Tests - BPS Test Reporting Module1 sec
Success WSO2 Business Process Server Integration Tests - BPEL10 min
Success WSO2 Business Process Server Integration Tests - BPMN7 min 25 sec
Success WSO2 Business Process Server Integration Tests - HumanTask6 min 55 sec
Success WSO2 Business Process Server Tests Patches - BPEL1 min 0 sec
Success WSO2 BPS - Integration UI Pages6.4 sec
Success admin-clents7.6 sec
Success integration-test-utils4.4 sec
Success integration-test-ui-pages5.2 sec
Success DataService Integration test UI module3.9 sec
Success org.wso2.ei.integration.test25 min
Success MB AMQP based Test Module2 hr 25 min
Success WSO2 MB - Integration Test Common Module3.7 sec
Success WSO2 MB - Integration Test Common Utils Module4.6 sec
Success UI Integration Test Module5.2 sec
Success MB Patch based Test Module44 sec
Success WSO2 MB - platform Test Common Utils Module4.3 sec
Success WSO2 EI - Samples8.7 sec
Success WSO2 Enterprise Integrator - Samples Features1.2 sec
Success WSO2 Enterprise Integrator - Styles6.6 sec
Success WSO2 Enterprise Integrator - Styles Features6.5 sec
Success WSO2 Enterprise Integrator - P2 Profile Module3.9 sec
Success WSO2 BPS - Tools29 sec
Success WSO2 BPS - Client for Samples6.8 sec
Success WSO2 BPS - Utilities for Samples15 sec
Success WSO2 BPS - Sample Utilities and Jars to use with BPS Testing0.49 sec
Success MB Server Test Module32 sec
Success EI Test Service Module2.7 sec
Success EI Integration Test UI Pages9.2 sec
 WSO2 Enterprise Integrator - Analytics P2 Profile Generation (didn’t run)
Success >WSO2 Enterprise Integrator - Analytics Profile Generation2 min 0 sec
Success WSO2 BPS - Integration Parent0.76 sec
Success WSO2 BPS - Integration Parent0.57 sec
Success WSO2 BPS - Integration Parent0.64 sec
Success WSO2 BPS - Integration Parent1.8 sec
Success WSO2 BPS - P2 Profile Generation32 sec
Success WSO2 BPS - Distribution Parent0.56 sec
Success WSO2 Broker - P2 Profile Generation24 sec
Success WSO2 Enterprise Integrator - Distribution1 min 18 sec
Success WSO2 Enterprise Integrator11 sec
Success WSO2 Enterprise Integrator - Web App Samples4.4 sec