Started 6 mo 20 days ago
Took 6 hr 7 min on ECS_PRODUCTION-daa72597810a7

Unstable Build #882 (Mar 15, 2022 4:31:57 AM)

Build Artifacts
update.zip18.36 MB view
wso2ei-6.7.0-SNAPSHOT.zip519.17 MB view
No changes.

Started by timer

Revision: 1247f7dd7837122a1b224dc342f28eab2c282291
  • refs/remotes/origin/master
Test Result (5 failures / ±0)Show all failed tests >>>
Jacoco - Overall Coverage Summary
INSTRUCTION0%
BRANCH0%
COMPLEXITY0%
LINE0%
METHOD0%
CLASS0%

Identified problems

testCopyFile

java.lang.AssertionError: expected:<200> but was:<202> at org.testng.Assert.fail(Assert.java:89) at org.testng.Assert.failNotEquals(Assert.java:489) at org.testng.Assert.assertEquals(Assert.java:118) at org.testng.Assert.assertEquals(Assert.java:365) at org.testng.Assert.assertEquals(Assert.java:375) at org.wso2.carbon.ei.tests.connectors.FileConnectorIntegrationTest.testCopyFile(FileConnectorIntegrationTest.java:77)

testMessagesInMessageProcessor

java.lang.AssertionError: Message Processor : mspAdminTestInMemoryMessageProcessor did not de-activate after failed delivery attempts with OUT_ONLY property. expected: but was: at org.testng.Assert.fail(Assert.java:89) at org.testng.Assert.failNotEquals(Assert.java:489) at org.testng.Assert.assertFalse(Assert.java:58) at org.wso2.carbon.esb.message.processor.test.MessageProcessorAdminTestCase.testMessagesInMessageProcessor(MessageProcessorAdminTestCase.java:191)

xsltTransformationFromUrl

org.apache.axis2.AxisFault: org.apache.synapse.SynapseException: Content-Type:text/xml; charset=UTF-8,Host:localhost:8480,SOAPAction:"urn:getQuote", Unexpected error sending message back at org.apache.axis2.util.Utils.getInboundFaultFromMessageContext(Utils.java:531) at org.apache.axis2.description.OutInAxisOperationClient.handleResponse(OutInAxisOperation.java:382) at org.apache.axis2.description.OutInAxisOperationClient.send(OutInAxisOperation.java:457) at org.apache.axis2.description.OutInAxisOperationClient.executeImpl(OutInAxisOperation.java:228) at org.apache.axis2.client.OperationClient.execute(OperationClient.java:149) at org.apache.axis2.client.ServiceClient.sendReceive(ServiceClient.java:554) at org.apache.axis2.client.ServiceClient.sendReceive(ServiceClient.java:530) at org.wso2.esb.integration.common.utils.clients.stockquoteclient.StockQuoteClient.sendCustomQuoteRequest(StockQuoteClient.java:166) at org.wso2.carbon.esb.mediator.test.xslt.XsltTransformationFromUrlTestCase.xsltTransformationFromUrl(XsltTransformationFromUrlTestCase.java:42)

testPreserveContentTypeHeader

java.lang.AssertionError: Response header modified at org.junit.Assert.fail(Assert.java:88) at org.junit.Assert.assertTrue(Assert.java:41) at org.wso2.carbon.esb.passthru.transport.test.PreseveResponseHeaderTestCase.testPreserveContentTypeHeader(PreseveResponseHeaderTestCase.java:57)

testMalformedJSONPayloadInFaultySequence

java.lang.AssertionError: The status code set in the faulty sequence is not received expected:<500> but was:<202> at org.testng.Assert.fail(Assert.java:89) at org.testng.Assert.failNotEquals(Assert.java:489) at org.testng.Assert.assertEquals(Assert.java:118) at org.testng.Assert.assertEquals(Assert.java:365) at org.wso2.carbon.esb.json.EI2757MalformedJSONPayloadFaultyTestCase.testMalformedJSONPayloadInFaultySequence(EI2757MalformedJSONPayloadFaultyTestCase.java:44)

Environment Variables(69)16 different
Slave Information(87)10 different
Project Information(15)0 different

Module Builds

 WSO2 BPS - HumanTaskWebApp (didn’t run)
 AdminApiHelper (didn’t run)
Success EI Integration Test Admin Clients7.8 sec
Success WSO2 Enterprise Integrator - Automation Extensions29 sec
 WSO2 BPS - BPEL Event Listener (didn’t run)
 WSO2 BPS - BPEL Extension (didn’t run)
 WSO2 BPS - BPEL Property Reader Extension (didn’t run)
Success WSO2 BPS Samples9 sec
Success DataServices Clients24 sec
Success WSO2 Enterprise Integrator - Data Service Hosting Integration Tests0.48 sec
Success WSO2 DataServices Integration Test0.47 sec
Success WSO2 DataServices Integration Test Common0.44 sec
Success WSO2 DataServices Samples Parent1.3 sec
Success WSO2 Enterprise Integrator - Component Parent0.49 sec
Success WSO2 Enterprise Integrator - P2 Profile Generation1 min 14 sec
Success WSO2 Enterprise Integrator - Samples Parent0.47 sec
 WSO2 BPS - HumanTask Event Listener (didn’t run)
Success EI Test Common Module13 sec
Success EI Integration Test Common Utils11 sec
Success WSO2 Enterprise Integrator - Integration Tests0.5 sec
Success WSO2 Enterprise Integrator - Feature Aggregator Module0.48 sec
Success JAX-RS Basic Demo5 sec
 WSO2 Enterprise Integrator - Lightweight P2 Profile Generation (didn’t run)
Success Integration Test Module1.6 sec
Success WSO2 MB - Integration Tests5.3 sec
Success WSO2 Enterprise Integrator - Mediation Integration Tests0.46 sec
 WSO2 Enterprise Integrator - micro-integrator P2 Profile Generation (didn’t run)
 WSO2 Enterprise Integrator - microIntegrator P2 Profile Generation (didn’t run)
 WSO2 MSF4J Runtime (didn’t run)
 WSO2 MSF4J Runtime (didn’t run)
 WSO2 BPS - Integration Test Common Module (didn’t run)
 WSO2 BPS - Integration Test Utils (didn’t run)
 WSO2 Business Process Server Integration Tests - BPS Test Reporting Module (didn’t run)
 WSO2 Business Process Server Integration Tests - BPEL (didn’t run)
 WSO2 Business Process Server Integration Tests - BPMN (didn’t run)
 WSO2 Business Process Server Integration Tests - HumanTask (didn’t run)
 WSO2 Business Process Server Tests Patches - BPEL (didn’t run)
Success WSO2 Business Process Server Integration Tests - HumanTask Coordination11 min
 WSO2 BPS - Integration UI Pages (didn’t run)
Success Integration Test Reporting14 sec
Success org.wso2.carbon.ei.migration10 sec
Unstable EI test Module - Test Connectors1 min 14 sec
Success EI test Module-mediator-127 min
Unstable EI test Module-mediator-215 min
Success EI test Module-Other15 min
Unstable EI test Module - Test Patches20 min
Success EI Test Module - Platform0.45 sec
Success EI test Module - Platform - RabbitMQ Transport3.1 sec
Success EI test Module - Platform - with WSO2MB6.9 sec
Success EI test Module - Sample8 min 44 sec
Success EI test Module-Service18 min
Success EI test Module-Transport27 min
Success EI test Module - UI5.4 sec
 WSO2 Enterprise Integrator - Core Component (didn’t run)
 WSO2 Enterprise Integrator - Core Server Feature (didn’t run)
 org.wso2.carbon.micro.integrator.admin.api (didn’t run)
 org.wso2.carbon.micro.integrator.admin.apis (didn’t run)
 org.wso2.carbon.micro.integrator.admin.apis.esb (didn’t run)
 WSO2 Enterprise Integrator - Micro Core Component (didn’t run)
 WSO2 Enterprise Integrator - Micro Extensions (didn’t run)
 org.wso2.carbon.micro.integrator.security (didn’t run)
 WSO2 Enterprise Integrator - Micro server Component (didn’t run)
 WSO2 Enterprise Integrator - Micro Core Server Feature (didn’t run)
Success WSO2 Carbon - Server Administration UI3 sec
Success WSO2 Enterprise Integrator - Admin Console feature1 sec
Success WSO2 Enterprise Integrator - Analytics ELK52 sec
Success WSO2 Enterprise Integrator - Analytics ELK Feature2.4 sec
Success WSO2 Enterprise Integrator - Analytics Feature3.1 sec
Success WSO2 Enterprise Integrator - Analytics Styles1 sec
Success WSO2 Enterprise Integrator Analytics - Styles Features1.4 sec
Success WSO2 Carbon - BPMN Analytics Core Extension7 sec
Success WSO2 ei bpmn Analytics - UDF4.6 sec
Success WSO2 EI Message Broker - Dashboard UI1.8 sec
Success WSO2 EI Broker - Tenant Dashboard UI1.3 sec
Success WSO2 EI Broker Styles0.95 sec
Success WSO2 EI Broker - Styles Features0.73 sec
Success WSO2 EI Business-Process - Tenant Dashboard UI13 sec
Success WSO2 EI Business-Process - Tenant Dashboard UI1.3 sec
Success WSO2 EI Business-Process - UI styles1 sec
Success WSO2 EI Business Process - Style Features0.74 sec
Success WSO2 BPS - Integration Test Common Module5.6 sec
Success WSO2 BPS - Integration Test Utils2.9 sec
Success WSO2 Business Process Server Integration Tests - BPS Test Reporting Module1.1 sec
Success WSO2 Business Process Server Integration Tests - BPEL10 min
Success WSO2 Business Process Server Integration Tests - BPMN7 min 29 sec
Success WSO2 Business Process Server Integration Tests - HumanTask6 min 59 sec
Success WSO2 Business Process Server Tests Patches - BPEL2 min 1 sec
Success WSO2 BPS - Integration UI Pages5.1 sec
Success admin-clents4.7 sec
Success integration-test-utils4.1 sec
Success integration-test-ui-pages3.8 sec
Success DataService Integration test UI module3.1 sec
Success org.wso2.ei.integration.test24 min
Success MB AMQP based Test Module2 hr 25 min
Success WSO2 MB - Integration Test Common Module3.7 sec
Success WSO2 MB - Integration Test Common Utils Module4.6 sec
Success UI Integration Test Module4 sec
Success MB Patch based Test Module46 sec
Success WSO2 MB - platform Test Common Utils Module4.4 sec
Success WSO2 EI - Samples7.3 sec
Success WSO2 Enterprise Integrator - Samples Features1.2 sec
Success WSO2 Enterprise Integrator - Styles3.8 sec
Success WSO2 Enterprise Integrator - Styles Features6.2 sec
Success WSO2 Enterprise Integrator - P2 Profile Module0.5 sec
Success WSO2 BPS - Tools35 sec
Success WSO2 BPS - Client for Samples3.4 sec
Success WSO2 BPS - Utilities for Samples4.1 sec
Success WSO2 BPS - Sample Utilities and Jars to use with BPS Testing0.48 sec
Success MB Server Test Module33 sec
Success EI Test Service Module3.3 sec
Success EI Integration Test UI Pages6.6 sec
 WSO2 Enterprise Integrator - Analytics P2 Profile Generation (didn’t run)
Success >WSO2 Enterprise Integrator - Analytics Profile Generation2 min 16 sec
Success WSO2 BPS - Integration Parent0.46 sec
Success WSO2 BPS - Integration Parent0.45 sec
Success WSO2 BPS - Integration Parent0.46 sec
Success WSO2 BPS - Integration Parent0.47 sec
Success WSO2 BPS - P2 Profile Generation34 sec
Success WSO2 BPS - Distribution Parent0.46 sec
Success WSO2 Broker - P2 Profile Generation25 sec
Success WSO2 Enterprise Integrator - Distribution1 min 14 sec
Success WSO2 Enterprise Integrator13 sec
Success WSO2 Enterprise Integrator - Web App Samples1.3 sec
 WSO2 MSF4J Runtime (didn’t run)