Started 16 hr ago
Took 2 hr 51 min on ECS_PRODUCTION-22337540e09af7

Unstable Build #1724 (Jan 22, 2022 1:31:40 AM)

No changes.

Started by timer

Revision: 1247f7dd7837122a1b224dc342f28eab2c282291
  • refs/remotes/origin/master
Test Result (6 failures / -1)Show all failed tests >>>
Jacoco - Overall Coverage Summary
INSTRUCTION0%
BRANCH0%
COMPLEXITY0%
LINE0%
METHOD0%
CLASS0%

Identified problems

testMessagesInMessageProcessor

java.lang.AssertionError: Message Processor : mspAdminTestInMemoryMessageProcessor did not de-activate after failed delivery attempts with OUT_ONLY property. expected: but was: at org.testng.Assert.fail(Assert.java:89) at org.testng.Assert.failNotEquals(Assert.java:489) at org.testng.Assert.assertFalse(Assert.java:58) at org.wso2.carbon.esb.message.processor.test.MessageProcessorAdminTestCase.testMessagesInMessageProcessor(MessageProcessorAdminTestCase.java:191)

xsltTransformationFromUrl

org.apache.axis2.AxisFault: org.apache.synapse.SynapseException: Content-Type:text/xml; charset=UTF-8,Host:localhost:8480,SOAPAction:"urn:getQuote", Unexpected error sending message back at org.apache.axis2.util.Utils.getInboundFaultFromMessageContext(Utils.java:531) at org.apache.axis2.description.OutInAxisOperationClient.handleResponse(OutInAxisOperation.java:382) at org.apache.axis2.description.OutInAxisOperationClient.send(OutInAxisOperation.java:457) at org.apache.axis2.description.OutInAxisOperationClient.executeImpl(OutInAxisOperation.java:228) at org.apache.axis2.client.OperationClient.execute(OperationClient.java:149) at org.apache.axis2.client.ServiceClient.sendReceive(ServiceClient.java:554) at org.apache.axis2.client.ServiceClient.sendReceive(ServiceClient.java:530) at org.wso2.esb.integration.common.utils.clients.stockquoteclient.StockQuoteClient.sendCustomQuoteRequest(StockQuoteClient.java:166) at org.wso2.carbon.esb.mediator.test.xslt.XsltTransformationFromUrlTestCase.xsltTransformationFromUrl(XsltTransformationFromUrlTestCase.java:42)

testPreserveContentTypeHeader

java.lang.AssertionError: Response header modified at org.junit.Assert.fail(Assert.java:88) at org.junit.Assert.assertTrue(Assert.java:41) at org.wso2.carbon.esb.passthru.transport.test.PreseveResponseHeaderTestCase.testPreserveContentTypeHeader(PreseveResponseHeaderTestCase.java:57)

testPollingWithSuspensionLimit

java.lang.AssertionError: JMS Polling suspension is not enabled. expected: but was: at org.testng.Assert.fail(Assert.java:89) at org.testng.Assert.failNotEquals(Assert.java:489) at org.testng.Assert.assertTrue(Assert.java:37) at org.wso2.carbon.esb.jms.transport.test.EI1622JMSInboundMessagePollingConsumerTest.testPollingWithSuspensionLimit(EI1622JMSInboundMessagePollingConsumerTest.java:62)

testPollingWithSuspensionLimitAsZero

java.lang.AssertionError: JMS Polling is not permanently suspended though the suspension limit is 0. expected: but was: at org.testng.Assert.fail(Assert.java:89) at org.testng.Assert.failNotEquals(Assert.java:489) at org.testng.Assert.assertTrue(Assert.java:37) at org.wso2.carbon.esb.jms.transport.test.EI1622JMSInboundMessagePollingConsumerTest.testPollingWithSuspensionLimitAsZero(EI1622JMSInboundMessagePollingConsumerTest.java:74)

testMalformedJSONPayloadInFaultySequence

java.lang.AssertionError: The status code set in the faulty sequence is not received expected:<500> but was:<202> at org.testng.Assert.fail(Assert.java:89) at org.testng.Assert.failNotEquals(Assert.java:489) at org.testng.Assert.assertEquals(Assert.java:118) at org.testng.Assert.assertEquals(Assert.java:365) at org.wso2.carbon.esb.json.EI2757MalformedJSONPayloadFaultyTestCase.testMalformedJSONPayloadInFaultySequence(EI2757MalformedJSONPayloadFaultyTestCase.java:44)

Environment Variables(66)15 different
Slave Information(87)9 different
Project Information(15)0 different

Module Builds

 AdminApiHelper (didn’t run)
Success EI Integration Test Admin Clients12 sec
Success WSO2 Enterprise Integrator - Automation Extensions35 sec
Success WSO2 BPS Samples20 sec
Success DataServices Clients35 sec
Success WSO2 DataServices Samples Parent7.3 sec
Success WSO2 Enterprise Integrator - Component Parent0.73 sec
Success WSO2 Enterprise Integrator - P2 Profile Generation1 min 9 sec
Success WSO2 Enterprise Integrator - Samples Parent0.68 sec
Success EI Test Common Module18 sec
Success EI Integration Test Common Utils23 sec
Success WSO2 Enterprise Integrator - Integration Tests1.3 sec
Success WSO2 Enterprise Integrator - Feature Aggregator Module0.68 sec
Success JAX-RS Basic Demo9.6 sec
 WSO2 Enterprise Integrator - Lightweight P2 Profile Generation (didn’t run)
Success WSO2 Enterprise Integrator - Mediation Integration Tests7.3 sec
 WSO2 Enterprise Integrator - micro-integrator P2 Profile Generation (didn’t run)
 WSO2 Enterprise Integrator - microIntegrator P2 Profile Generation (didn’t run)
 WSO2 MSF4J Runtime (didn’t run)
Success Integration Test Reporting21 sec
Success org.wso2.carbon.ei.migration10 sec
Success EI test Module - Test Connectors1 min 19 sec
Success EI test Module-mediator-127 min
Unstable EI test Module-mediator-215 min
Success EI test Module-Other15 min
Unstable EI test Module - Test Patches20 min
Success EI Test Module - Platform1.3 sec
Success EI test Module - Platform - RabbitMQ Transport8.9 sec
Success EI test Module - Platform - with WSO2MB17 sec
Success EI test Module - Sample8 min 50 sec
Success EI test Module-Service19 min
Success EI test Module-Transport27 min
Success EI test Module - UI10 sec
 WSO2 Enterprise Integrator - Core Component (didn’t run)
 WSO2 Enterprise Integrator - Core Server Feature (didn’t run)
 org.wso2.carbon.micro.integrator.admin.api (didn’t run)
 org.wso2.carbon.micro.integrator.admin.apis (didn’t run)
 org.wso2.carbon.micro.integrator.admin.apis.esb (didn’t run)
 WSO2 Enterprise Integrator - Micro Core Component (didn’t run)
 WSO2 Enterprise Integrator - Micro Extensions (didn’t run)
 org.wso2.carbon.micro.integrator.security (didn’t run)
 WSO2 Enterprise Integrator - Micro server Component (didn’t run)
 WSO2 Enterprise Integrator - Micro Core Server Feature (didn’t run)
Success WSO2 Carbon - Server Administration UI9.7 sec
Success WSO2 Enterprise Integrator - Admin Console feature1.4 sec
Success WSO2 Enterprise Integrator - Analytics ELK47 sec
Success WSO2 Enterprise Integrator - Analytics ELK Feature3.5 sec
Success WSO2 Enterprise Integrator - Analytics Feature8.5 sec
Success WSO2 Enterprise Integrator - Analytics Styles9.1 sec
Success WSO2 Enterprise Integrator Analytics - Styles Features1.5 sec
Success WSO2 Carbon - BPMN Analytics Core Extension15 sec
Success WSO2 ei bpmn Analytics - UDF8.9 sec
Success WSO2 EI Message Broker - Dashboard UI1.8 sec
Success WSO2 EI Broker - Tenant Dashboard UI5.5 sec
Success WSO2 EI Broker Styles1 sec
Success WSO2 EI Broker - Styles Features1.4 sec
Success WSO2 EI Business-Process - Tenant Dashboard UI12 sec
Success WSO2 EI Business-Process - Tenant Dashboard UI1.9 sec
Success WSO2 EI Business-Process - UI styles1.2 sec
Success WSO2 EI Business Process - Style Features1 sec
Success WSO2 EI - Samples12 sec
Success WSO2 Enterprise Integrator - Samples Features5.7 sec
Success WSO2 Enterprise Integrator - Styles8.8 sec
Success WSO2 Enterprise Integrator - Styles Features8.4 sec
Success WSO2 Enterprise Integrator - P2 Profile Module5.2 sec
Success WSO2 BPS - Tools31 sec
Success WSO2 BPS - Client for Samples10 sec
Success WSO2 BPS - Utilities for Samples10 sec
Success WSO2 BPS - Sample Utilities and Jars to use with BPS Testing1.8 sec
Success EI Test Service Module10 sec
Success EI Integration Test UI Pages11 sec
 WSO2 Enterprise Integrator - Analytics P2 Profile Generation (didn’t run)
Success >WSO2 Enterprise Integrator - Analytics Profile Generation2 min 1 sec
Success WSO2 BPS - P2 Profile Generation37 sec
Success WSO2 BPS - Distribution Parent5.6 sec
Success WSO2 Broker - P2 Profile Generation29 sec
Success WSO2 Enterprise Integrator - Distribution1 min 11 sec
Success WSO2 Enterprise Integrator21 sec
Success WSO2 Enterprise Integrator - Web App Samples8 sec