Started 7 hr 24 min ago
Took 2 hr 37 min on ECS_PRODUCTION-23bc6bdb6af815

Unstable Build #1729 (Jan 27, 2022 1:32:44 AM)

No changes.

Started by timer

Revision: 1247f7dd7837122a1b224dc342f28eab2c282291
  • refs/remotes/origin/master
Test Result (7 failures / ±0)Show all failed tests >>>
Jacoco - Overall Coverage Summary
INSTRUCTION0%
BRANCH0%
COMPLEXITY0%
LINE0%
METHOD0%
CLASS0%

Identified problems

testCopyFile

java.lang.AssertionError: expected:<200> but was:<202> at org.testng.Assert.fail(Assert.java:89) at org.testng.Assert.failNotEquals(Assert.java:489) at org.testng.Assert.assertEquals(Assert.java:118) at org.testng.Assert.assertEquals(Assert.java:365) at org.testng.Assert.assertEquals(Assert.java:375) at org.wso2.carbon.ei.tests.connectors.FileConnectorIntegrationTest.testCopyFile(FileConnectorIntegrationTest.java:77)

testMessagesInMessageProcessor

java.lang.AssertionError: Message Processor : mspAdminTestInMemoryMessageProcessor did not de-activate after failed delivery attempts with OUT_ONLY property. expected: but was: at org.testng.Assert.fail(Assert.java:89) at org.testng.Assert.failNotEquals(Assert.java:489) at org.testng.Assert.assertFalse(Assert.java:58) at org.wso2.carbon.esb.message.processor.test.MessageProcessorAdminTestCase.testMessagesInMessageProcessor(MessageProcessorAdminTestCase.java:191)

xsltTransformationFromUrl

org.apache.axis2.AxisFault: org.apache.synapse.SynapseException: Content-Type:text/xml; charset=UTF-8,Host:localhost:8480,SOAPAction:"urn:getQuote", Unexpected error sending message back at org.apache.axis2.util.Utils.getInboundFaultFromMessageContext(Utils.java:531) at org.apache.axis2.description.OutInAxisOperationClient.handleResponse(OutInAxisOperation.java:382) at org.apache.axis2.description.OutInAxisOperationClient.send(OutInAxisOperation.java:457) at org.apache.axis2.description.OutInAxisOperationClient.executeImpl(OutInAxisOperation.java:228) at org.apache.axis2.client.OperationClient.execute(OperationClient.java:149) at org.apache.axis2.client.ServiceClient.sendReceive(ServiceClient.java:554) at org.apache.axis2.client.ServiceClient.sendReceive(ServiceClient.java:530) at org.wso2.esb.integration.common.utils.clients.stockquoteclient.StockQuoteClient.sendCustomQuoteRequest(StockQuoteClient.java:166) at org.wso2.carbon.esb.mediator.test.xslt.XsltTransformationFromUrlTestCase.xsltTransformationFromUrl(XsltTransformationFromUrlTestCase.java:42)

testPreserveContentTypeHeader

java.lang.AssertionError: Response header modified at org.junit.Assert.fail(Assert.java:88) at org.junit.Assert.assertTrue(Assert.java:41) at org.wso2.carbon.esb.passthru.transport.test.PreseveResponseHeaderTestCase.testPreserveContentTypeHeader(PreseveResponseHeaderTestCase.java:57)

testPollingWithSuspensionLimit

java.lang.AssertionError: JMS Polling suspension is not enabled. expected: but was: at org.testng.Assert.fail(Assert.java:89) at org.testng.Assert.failNotEquals(Assert.java:489) at org.testng.Assert.assertTrue(Assert.java:37) at org.wso2.carbon.esb.jms.transport.test.EI1622JMSInboundMessagePollingConsumerTest.testPollingWithSuspensionLimit(EI1622JMSInboundMessagePollingConsumerTest.java:62)

testPollingWithSuspensionLimitAsZero

java.lang.AssertionError: JMS Polling is not permanently suspended though the suspension limit is 0. expected: but was: at org.testng.Assert.fail(Assert.java:89) at org.testng.Assert.failNotEquals(Assert.java:489) at org.testng.Assert.assertTrue(Assert.java:37) at org.wso2.carbon.esb.jms.transport.test.EI1622JMSInboundMessagePollingConsumerTest.testPollingWithSuspensionLimitAsZero(EI1622JMSInboundMessagePollingConsumerTest.java:74)

testMalformedJSONPayloadInFaultySequence

java.lang.AssertionError: The status code set in the faulty sequence is not received expected:<500> but was:<202> at org.testng.Assert.fail(Assert.java:89) at org.testng.Assert.failNotEquals(Assert.java:489) at org.testng.Assert.assertEquals(Assert.java:118) at org.testng.Assert.assertEquals(Assert.java:365) at org.wso2.carbon.esb.json.EI2757MalformedJSONPayloadFaultyTestCase.testMalformedJSONPayloadInFaultySequence(EI2757MalformedJSONPayloadFaultyTestCase.java:44)

Environment Variables(66)15 different
Slave Information(87)9 different
Project Information(15)0 different

Module Builds

 AdminApiHelper (didn’t run)
Success EI Integration Test Admin Clients14 sec
Success WSO2 Enterprise Integrator - Automation Extensions20 sec
Success WSO2 BPS Samples11 sec
Success DataServices Clients30 sec
Success WSO2 DataServices Samples Parent2.4 sec
Success WSO2 Enterprise Integrator - Component Parent6.8 sec
Success WSO2 Enterprise Integrator - P2 Profile Generation1 min 9 sec
Success WSO2 Enterprise Integrator - Samples Parent0.56 sec
Success EI Test Common Module18 sec
Success EI Integration Test Common Utils29 sec
Success WSO2 Enterprise Integrator - Integration Tests0.74 sec
Success WSO2 Enterprise Integrator - Feature Aggregator Module1.3 sec
Success JAX-RS Basic Demo6.9 sec
 WSO2 Enterprise Integrator - Lightweight P2 Profile Generation (didn’t run)
Success WSO2 Enterprise Integrator - Mediation Integration Tests7 sec
 WSO2 Enterprise Integrator - micro-integrator P2 Profile Generation (didn’t run)
 WSO2 Enterprise Integrator - microIntegrator P2 Profile Generation (didn’t run)
 WSO2 MSF4J Runtime (didn’t run)
Success Integration Test Reporting14 sec
Success org.wso2.carbon.ei.migration10 sec
Unstable EI test Module - Test Connectors1 min 11 sec
Success EI test Module-mediator-127 min
Unstable EI test Module-mediator-215 min
Success EI test Module-Other15 min
Unstable EI test Module - Test Patches20 min
Success EI Test Module - Platform0.91 sec
Success EI test Module - Platform - RabbitMQ Transport3.7 sec
Success EI test Module - Platform - with WSO2MB7.5 sec
Success EI test Module - Sample8 min 45 sec
Success EI test Module-Service19 min
Success EI test Module-Transport27 min
Success EI test Module - UI5.4 sec
 WSO2 Enterprise Integrator - Core Component (didn’t run)
 WSO2 Enterprise Integrator - Core Server Feature (didn’t run)
 org.wso2.carbon.micro.integrator.admin.api (didn’t run)
 org.wso2.carbon.micro.integrator.admin.apis (didn’t run)
 org.wso2.carbon.micro.integrator.admin.apis.esb (didn’t run)
 WSO2 Enterprise Integrator - Micro Core Component (didn’t run)
 WSO2 Enterprise Integrator - Micro Extensions (didn’t run)
 org.wso2.carbon.micro.integrator.security (didn’t run)
 WSO2 Enterprise Integrator - Micro server Component (didn’t run)
 WSO2 Enterprise Integrator - Micro Core Server Feature (didn’t run)
Success WSO2 Carbon - Server Administration UI5.4 sec
Success WSO2 Enterprise Integrator - Admin Console feature1.4 sec
Success WSO2 Enterprise Integrator - Analytics ELK43 sec
Success WSO2 Enterprise Integrator - Analytics ELK Feature8.4 sec
Success WSO2 Enterprise Integrator - Analytics Feature4.4 sec
Success WSO2 Enterprise Integrator - Analytics Styles6.9 sec
Success WSO2 Enterprise Integrator Analytics - Styles Features3.9 sec
Success WSO2 Carbon - BPMN Analytics Core Extension15 sec
Success WSO2 ei bpmn Analytics - UDF9.8 sec
Success WSO2 EI Message Broker - Dashboard UI3 sec
Success WSO2 EI Broker - Tenant Dashboard UI1.3 sec
Success WSO2 EI Broker Styles1.1 sec
Success WSO2 EI Broker - Styles Features1.2 sec
Success WSO2 EI Business-Process - Tenant Dashboard UI13 sec
Success WSO2 EI Business-Process - Tenant Dashboard UI1.4 sec
Success WSO2 EI Business-Process - UI styles2.2 sec
Success WSO2 EI Business Process - Style Features0.93 sec
Success WSO2 EI - Samples17 sec
Success WSO2 Enterprise Integrator - Samples Features1.5 sec
Success WSO2 Enterprise Integrator - Styles8.3 sec
Success WSO2 Enterprise Integrator - Styles Features8.5 sec
Success WSO2 Enterprise Integrator - P2 Profile Module0.81 sec
Success WSO2 BPS - Tools35 sec
Success WSO2 BPS - Client for Samples6.4 sec
Success WSO2 BPS - Utilities for Samples10 sec
Success WSO2 BPS - Sample Utilities and Jars to use with BPS Testing0.71 sec
Success EI Test Service Module3.3 sec
Success EI Integration Test UI Pages16 sec
 WSO2 Enterprise Integrator - Analytics P2 Profile Generation (didn’t run)
Success >WSO2 Enterprise Integrator - Analytics Profile Generation1 min 27 sec
Success WSO2 BPS - P2 Profile Generation39 sec
Success WSO2 BPS - Distribution Parent0.76 sec
Success WSO2 Broker - P2 Profile Generation27 sec
Success WSO2 Enterprise Integrator - Distribution1 min 16 sec
Success WSO2 Enterprise Integrator16 sec
Success WSO2 Enterprise Integrator - Web App Samples4.3 sec