Started 3 yr 3 mo ago
Took 2 min 34 sec on ECS_PRODUCTION-a02fda7f1b98

Unstable Build #84 (Jun 16, 2019 8:31:39 PM)

Build Artifacts
org.wso2.carbon.ei.tests.sample-1.1.0-SNAPSHOT-tests.jar3.56 MB view
org.wso2.carbon.ei.tests.sample-1.1.0-SNAPSHOT.jar17.45 KB view
org.wso2.carbon.ei.tests.sample-1.1.0-SNAPSHOT.pom21.95 KB view
No changes.
Test Result (17 failures )Show all failed tests >>>

Identified problems

There are test failures

[INFO] [ERROR] Failed to execute goal org.apache.maven.plugins:maven-surefire-plugin:2.18.1:test (default-test) on project
Indication 1

testRoutingMessagesAndAggregatingResponses

org.apache.axis2.AxisFault: Read timed out at org.apache.axis2.AxisFault.makeFault(AxisFault.java:430) at org.apache.axis2.transport.http.HTTPSender.sendViaPost(HTTPSender.java:203) at org.apache.axis2.transport.http.HTTPSender.send(HTTPSender.java:81) at org.apache.axis2.transport.http.CommonsHTTPTransportSender.writeMessageWithCommons(CommonsHTTPTransportSender.java:459) at org.apache.axis2.transport.http.CommonsHTTPTransportSender.invoke(CommonsHTTPTransportSender.java:286) at org.apache.axis2.engine.AxisEngine.send(AxisEngine.java:442) at org.apache.axis2.description.OutInAxisOperationClient.send(OutInAxisOperation.java:442) at org.apache.axis2.description.OutInAxisOperationClient.executeImpl(OutInAxisOperation.java:228) at org.apache.axis2.client.OperationClient.execute(OperationClient.java:149) at org.apache.axis2.client.ServiceClient.sendReceive(ServiceClient.java:554) at org.apache.axis2.client.ServiceClient.sendReceive(ServiceClient.java:530) at org.wso2.esb.integration.common.utils.clients.stockquoteclient.StockQuoteClient.sendSimpleQuoteRequest(StockQuoteClient.java:90) at org.wso2.carbon.esb.samples.test.endpoint.Sample62TestCase.testRoutingMessagesAndAggregatingResponses(Sample62TestCase.java:77) Caused by: java.net.SocketTimeoutException: Read timed out at java.net.SocketInputStream.socketRead0(Native Method) at java.net.SocketInputStream.socketRead(SocketInputStream.java:116) at java.net.SocketInputStream.read(SocketInputStream.java:171) at java.net.SocketInputStream.read(SocketInputStream.java:141) at java.io.BufferedInputStream.fill(BufferedInputStream.java:246) at java.io.BufferedInputStream.read(BufferedInputStream.java:265) at org.apache.commons.httpclient.HttpParser.readRawLine(HttpParser.java:78) at org.apache.commons.httpclient.HttpParser.readLine(HttpParser.java:106) at org.apache.commons.httpclient.HttpConnection.readLine(HttpConnection.java:1116) at org.apache.commons.httpclient.MultiThreadedHttpConnectionManager$HttpConnectionAdapter.readLine(MultiThreadedHttpConnectionManager.java:1413) at org.apache.commons.httpclient.HttpMethodBase.readStatusLine(HttpMethodBase.java:1973) at org.apache.commons.httpclient.HttpMethodBase.readResponse(HttpMethodBase.java:1735) at org.apache.commons.httpclient.HttpMethodBase.execute(HttpMethodBase.java:1098) at org.apache.commons.httpclient.HttpMethodDirector.executeWithRetry(HttpMethodDirector.java:398) at org.apache.commons.httpclient.HttpMethodDirector.executeMethod(HttpMethodDirector.java:171) at org.apache.commons.httpclient.HttpClient.executeMethod(HttpClient.java:397) at org.apache.axis2.transport.http.AbstractHTTPSender.executeMethod(AbstractHTTPSender.java:712) at org.apache.axis2.transport.http.HTTPSender.sendViaPost(HTTPSender.java:199) ... 45 more

setEnvironment

java.io.FileNotFoundException: /home/jenkins/workspace/products/micro-integrator-asankaab-delete/integration/mediation-tests/tests-sample/src/test/resources/artifacts/ESB/samples/synapse_sample_701.xml (No such file or directory) at java.io.FileInputStream.open0(Native Method) at java.io.FileInputStream.open(FileInputStream.java:195) at java.io.FileInputStream.(FileInputStream.java:138) at java.io.FileInputStream.(FileInputStream.java:93) at org.wso2.esb.integration.common.utils.ESBTestCaseUtils.loadESBSampleConfiguration(ESBTestCaseUtils.java:178) at org.wso2.carbon.esb.samples.test.util.ESBSampleIntegrationTest.loadSampleESBConfiguration(ESBSampleIntegrationTest.java:286) at org.wso2.carbon.esb.samples.test.messaging.store.Sample701TestCase.setEnvironment(Sample701TestCase.java:44)

setEnvironment

java.io.FileNotFoundException: /home/jenkins/workspace/products/micro-integrator-asankaab-delete/integration/mediation-tests/tests-sample/src/test/resources/artifacts/ESB/samples/synapse_sample_702.xml (No such file or directory) at java.io.FileInputStream.open0(Native Method) at java.io.FileInputStream.open(FileInputStream.java:195) at java.io.FileInputStream.(FileInputStream.java:138) at java.io.FileInputStream.(FileInputStream.java:93) at org.wso2.esb.integration.common.utils.ESBTestCaseUtils.loadESBSampleConfiguration(ESBTestCaseUtils.java:178) at org.wso2.carbon.esb.samples.test.util.ESBSampleIntegrationTest.loadSampleESBConfiguration(ESBSampleIntegrationTest.java:286) at org.wso2.carbon.esb.samples.test.messaging.store.Sample702TestCase.setEnvironment(Sample702TestCase.java:43)

setEnvironment

java.io.FileNotFoundException: /home/jenkins/workspace/products/micro-integrator-asankaab-delete/integration/mediation-tests/tests-sample/src/test/resources/artifacts/ESB/samples/synapse_sample_704.xml (No such file or directory) at java.io.FileInputStream.open0(Native Method) at java.io.FileInputStream.open(FileInputStream.java:195) at java.io.FileInputStream.(FileInputStream.java:138) at java.io.FileInputStream.(FileInputStream.java:93) at org.wso2.esb.integration.common.utils.ESBTestCaseUtils.loadESBSampleConfiguration(ESBTestCaseUtils.java:178) at org.wso2.carbon.esb.samples.test.util.ESBSampleIntegrationTest.loadSampleESBConfiguration(ESBSampleIntegrationTest.java:286) at org.wso2.carbon.esb.samples.test.messaging.store.Sample704TestCase.setEnvironment(Sample704TestCase.java:43)

setEnvironment

java.io.FileNotFoundException: /home/jenkins/workspace/products/micro-integrator-asankaab-delete/integration/mediation-tests/tests-sample/src/test/resources/artifacts/ESB/samples/synapse_sample_700.xml (No such file or directory) at java.io.FileInputStream.open0(Native Method) at java.io.FileInputStream.open(FileInputStream.java:195) at java.io.FileInputStream.(FileInputStream.java:138) at java.io.FileInputStream.(FileInputStream.java:93) at org.wso2.esb.integration.common.utils.ESBTestCaseUtils.loadESBSampleConfiguration(ESBTestCaseUtils.java:178) at org.wso2.carbon.esb.samples.test.util.ESBSampleIntegrationTest.loadSampleESBConfiguration(ESBSampleIntegrationTest.java:286) at org.wso2.carbon.esb.samples.test.messaging.store.Sample700TestCase.setEnvironment(Sample700TestCase.java:43)

setEnvironment

java.io.FileNotFoundException: /home/jenkins/workspace/products/micro-integrator-asankaab-delete/integration/mediation-tests/tests-sample/src/test/resources/artifacts/ESB/samples/synapse_sample_701.xml (No such file or directory) at java.io.FileInputStream.open0(Native Method) at java.io.FileInputStream.open(FileInputStream.java:195) at java.io.FileInputStream.(FileInputStream.java:138) at java.io.FileInputStream.(FileInputStream.java:93) at org.wso2.esb.integration.common.utils.ESBTestCaseUtils.loadESBSampleConfiguration(ESBTestCaseUtils.java:178) at org.wso2.carbon.esb.samples.test.util.ESBSampleIntegrationTest.loadSampleESBConfiguration(ESBSampleIntegrationTest.java:286) at org.wso2.carbon.esb.samples.test.messaging.store.Sample701TestCase.setEnvironment(Sample701TestCase.java:44)

setEnvironment

java.io.FileNotFoundException: /home/jenkins/workspace/products/micro-integrator-asankaab-delete/integration/mediation-tests/tests-sample/src/test/resources/artifacts/ESB/samples/synapse_sample_704.xml (No such file or directory) at java.io.FileInputStream.open0(Native Method) at java.io.FileInputStream.open(FileInputStream.java:195) at java.io.FileInputStream.(FileInputStream.java:138) at java.io.FileInputStream.(FileInputStream.java:93) at org.wso2.esb.integration.common.utils.ESBTestCaseUtils.loadESBSampleConfiguration(ESBTestCaseUtils.java:178) at org.wso2.carbon.esb.samples.test.util.ESBSampleIntegrationTest.loadSampleESBConfiguration(ESBSampleIntegrationTest.java:286) at org.wso2.carbon.esb.samples.test.messaging.store.Sample704TestCase.setEnvironment(Sample704TestCase.java:43)

setEnvironment

java.io.FileNotFoundException: /home/jenkins/workspace/products/micro-integrator-asankaab-delete/integration/mediation-tests/tests-sample/src/test/resources/artifacts/ESB/samples/synapse_sample_702.xml (No such file or directory) at java.io.FileInputStream.open0(Native Method) at java.io.FileInputStream.open(FileInputStream.java:195) at java.io.FileInputStream.(FileInputStream.java:138) at java.io.FileInputStream.(FileInputStream.java:93) at org.wso2.esb.integration.common.utils.ESBTestCaseUtils.loadESBSampleConfiguration(ESBTestCaseUtils.java:178) at org.wso2.carbon.esb.samples.test.util.ESBSampleIntegrationTest.loadSampleESBConfiguration(ESBSampleIntegrationTest.java:286) at org.wso2.carbon.esb.samples.test.messaging.store.Sample702TestCase.setEnvironment(Sample702TestCase.java:43)

testEndPoints

org.apache.axis2.AxisFault: Connection has been shutdown: javax.net.ssl.SSLException: java.lang.RuntimeException: Unexpected error: java.security.InvalidAlgorithmParameterException: the trustAnchors parameter must be non-empty at org.apache.axis2.AxisFault.makeFault(AxisFault.java:430) at org.apache.axis2.transport.http.SOAPMessageFormatter.writeTo(SOAPMessageFormatter.java:78) at org.apache.axis2.transport.http.AxisRequestEntity.writeRequest(AxisRequestEntity.java:84) at org.apache.commons.httpclient.methods.EntityEnclosingMethod.writeRequestBody(EntityEnclosingMethod.java:499) at org.apache.commons.httpclient.HttpMethodBase.writeRequest(HttpMethodBase.java:2114) at org.apache.commons.httpclient.HttpMethodBase.execute(HttpMethodBase.java:1096) at org.apache.commons.httpclient.HttpMethodDirector.executeWithRetry(HttpMethodDirector.java:398) at org.apache.commons.httpclient.HttpMethodDirector.executeMethod(HttpMethodDirector.java:171) at org.apache.commons.httpclient.HttpClient.executeMethod(HttpClient.java:397) at org.apache.axis2.transport.http.AbstractHTTPSender.executeMethod(AbstractHTTPSender.java:712) at org.apache.axis2.transport.http.HTTPSender.sendViaPost(HTTPSender.java:199) at org.apache.axis2.transport.http.HTTPSender.send(HTTPSender.java:81) at org.apache.axis2.transport.http.CommonsHTTPTransportSender.writeMessageWithCommons(CommonsHTTPTransportSender.java:459) at org.apache.axis2.transport.http.CommonsHTTPTransportSender.invoke(CommonsHTTPTransportSender.java:286) at org.apache.axis2.engine.AxisEngine.send(AxisEngine.java:442) at org.apache.axis2.description.OutInAxisOperationClient.send(OutInAxisOperation.java:442) at org.apache.axis2.description.OutInAxisOperationClient.executeImpl(OutInAxisOperation.java:228) at org.apache.axis2.client.OperationClient.execute(OperationClient.java:149) at org.wso2.carbon.endpoint.stub.types.EndpointAdminStub.getEndpointCount(EndpointAdminStub.java:4020) at org.wso2.esb.integration.common.clients.endpoint.EndPointAdminClient.getEndpointCount(EndPointAdminClient.java:84) at org.wso2.carbon.esb.samples.test.miscellaneous.Sample650TestCase.testEndPoints(Sample650TestCase.java:123) Caused by: com.ctc.wstx.exc.WstxIOException: Connection has been shutdown: javax.net.ssl.SSLException: java.lang.RuntimeException: Unexpected error: java.security.InvalidAlgorithmParameterException: the trustAnchors parameter must be non-empty at com.ctc.wstx.sw.BaseStreamWriter._finishDocument(BaseStreamWriter.java:1406) at com.ctc.wstx.sw.BaseStreamWriter.close(BaseStreamWriter.java:247) at org.apache.axiom.om.impl.MTOMXMLStreamWriter.close(MTOMXMLStreamWriter.java:188) at org.apache.axiom.om.impl.llom.OMSerializableImpl.serializeAndConsume(OMSerializableImpl.java:197) at org.apache.axis2.transport.http.SOAPMessageFormatter.writeTo(SOAPMessageFormatter.java:74) ... 53 more Caused by: javax.net.ssl.SSLException: Connection has been shutdown: javax.net.ssl.SSLException: java.lang.RuntimeException: Unexpected error: java.security.InvalidAlgorithmParameterException: the trustAnchors parameter must be non-empty at sun.security.ssl.SSLSocketImpl.checkEOF(SSLSocketImpl.java:1551) at sun.security.ssl.SSLSocketImpl.checkWrite(SSLSocketImpl.java:1563) at sun.security.ssl.AppOutputStream.write(AppOutputStream.java:71) at java.io.BufferedOutputStream.flushBuffer(BufferedOutputStream.java:82) at java.io.BufferedOutputStream.flush(BufferedOutputStream.java:140) at org.apache.commons.httpclient.ChunkedOutputStream.flush(ChunkedOutputStream.java:191) at com.ctc.wstx.io.UTF8Writer.flush(UTF8Writer.java:103) at com.ctc.wstx.sw.BufferingXmlWriter.flush(BufferingXmlWriter.java:225) at com.ctc.wstx.sw.BufferingXmlWriter.close(BufferingXmlWriter.java:198) at com.ctc.wstx.sw.BaseStreamWriter._finishDocument(BaseStreamWriter.java:1404) ... 57 more Caused by: javax.net.ssl.SSLException: java.lang.RuntimeException: Unexpected error: java.security.InvalidAlgorithmParameterException: the trustAnchors parameter must be non-empty at sun.security.ssl.Alerts.getSSLException(Alerts.java:208) at sun.security.ssl.SSLSocketImpl.fatal(SSLSocketImpl.java:1959) at sun.security.ssl.SSLSocketImpl.fatal(SSLSocketImpl.java:1916) at sun.security.ssl.SSLSocketImpl.handleException(SSLSocketImpl.java:1899) at sun.security.ssl.SSLSocketImpl.handleException(SSLSocketImpl.java:1825) at sun.security.ssl.AppOutputStream.write(AppOutputStream.java:128) at java.io.BufferedOutputStream.flushBuffer(BufferedOutputStream.java:82) at java.io.BufferedOutputStream.flush(BufferedOutputStream.java:140) at org.apache.commons.httpclient.ChunkedOutputStream.flush(ChunkedOutputStream.java:191) at com.ctc.wstx.io.UTF8Writer.flush(UTF8Writer.java:103) at com.ctc.wstx.sw.BufferingXmlWriter.flush(BufferingXmlWriter.java:225) at com.ctc.wstx.sw.BaseStreamWriter.flush(BaseStreamWriter.java:259) at org.apache.axiom.om.impl.MTOMXMLStreamWriter.flush(MTOMXMLStreamWriter.java:198) at org.apache.axis2.databinding.ADBDataSource.serialize(ADBDataSource.java:91) at org.apache.axiom.om.impl.llom.OMSourcedElementImpl.internalSerialize(OMSourcedElementImpl.java:691) at org.apache.axiom.om.impl.util.OMSerializerUtil.serializeChildren(OMSerializerUtil.java:562) at org.apache.axiom.om.impl.llom.OMElementImpl.internalSerialize(OMElementImpl.java:875) at org.apache.axiom.soap.impl.llom.SOAPEnvelopeImpl.serializeInternally(SOAPEnvelopeImpl.java:283) at org.apache.axiom.soap.impl.llom.SOAPEnvelopeImpl.internalSerialize(SOAPEnvelopeImpl.java:245) at org.apache.axiom.om.impl.llom.OMSerializableImpl.serializeAndConsume(OMSerializableImpl.java:193) ... 54 more Caused by: java.lang.RuntimeException: Unexpected error: java.security.InvalidAlgorithmParameterException: the trustAnchors parameter must be non-empty at sun.security.validator.PKIXValidator.(PKIXValidator.java:91) at sun.security.validator.Validator.getInstance(Validator.java:179) at sun.security.ssl.X509TrustManagerImpl.getValidator(X509TrustManagerImpl.java:312) at sun.security.ssl.X509TrustManagerImpl.checkTrustedInit(X509TrustManagerImpl.java:171) at sun.security.ssl.X509TrustManagerImpl.checkTrusted(X509TrustManagerImpl.java:184) at sun.security.ssl.X509TrustManagerImpl.checkServerTrusted(X509TrustManagerImpl.java:124) at sun.security.ssl.ClientHandshaker.serverCertificate(ClientHandshaker.java:1496) at sun.security.ssl.ClientHandshaker.processMessage(ClientHandshaker.java:216) at sun.security.ssl.Handshaker.processLoop(Handshaker.java:1026) at sun.security.ssl.Handshaker.process_record(Handshaker.java:961) at sun.security.ssl.SSLSocketImpl.readRecord(SSLSocketImpl.java:1072) at sun.security.ssl.SSLSocketImpl.performInitialHandshake(SSLSocketImpl.java:1385) at sun.security.ssl.SSLSocketImpl.writeRecord(SSLSocketImpl.java:757) at sun.security.ssl.AppOutputStream.write(AppOutputStream.java:123) ... 68 more Caused by: java.security.InvalidAlgorithmParameterException: the trustAnchors parameter must be non-empty at java.security.cert.PKIXParameters.setTrustAnchors(PKIXParameters.java:200) at java.security.cert.PKIXParameters.(PKIXParameters.java:120) at java.security.cert.PKIXBuilderParameters.(PKIXBuilderParameters.java:104) at sun.security.validator.PKIXValidator.(PKIXValidator.java:89) ... 81 more

testLocalEntries

org.apache.axis2.AxisFault: Connection has been shutdown: javax.net.ssl.SSLException: java.lang.RuntimeException: Unexpected error: java.security.InvalidAlgorithmParameterException: the trustAnchors parameter must be non-empty at org.apache.axis2.AxisFault.makeFault(AxisFault.java:430) at org.apache.axis2.transport.http.SOAPMessageFormatter.writeTo(SOAPMessageFormatter.java:78) at org.apache.axis2.transport.http.AxisRequestEntity.writeRequest(AxisRequestEntity.java:84) at org.apache.commons.httpclient.methods.EntityEnclosingMethod.writeRequestBody(EntityEnclosingMethod.java:499) at org.apache.commons.httpclient.HttpMethodBase.writeRequest(HttpMethodBase.java:2114) at org.apache.commons.httpclient.HttpMethodBase.execute(HttpMethodBase.java:1096) at org.apache.commons.httpclient.HttpMethodDirector.executeWithRetry(HttpMethodDirector.java:398) at org.apache.commons.httpclient.HttpMethodDirector.executeMethod(HttpMethodDirector.java:171) at org.apache.commons.httpclient.HttpClient.executeMethod(HttpClient.java:397) at org.apache.axis2.transport.http.AbstractHTTPSender.executeMethod(AbstractHTTPSender.java:712) at org.apache.axis2.transport.http.HTTPSender.sendViaPost(HTTPSender.java:199) at org.apache.axis2.transport.http.HTTPSender.send(HTTPSender.java:81) at org.apache.axis2.transport.http.CommonsHTTPTransportSender.writeMessageWithCommons(CommonsHTTPTransportSender.java:459) at org.apache.axis2.transport.http.CommonsHTTPTransportSender.invoke(CommonsHTTPTransportSender.java:286) at org.apache.axis2.engine.AxisEngine.send(AxisEngine.java:442) at org.apache.axis2.description.OutInAxisOperationClient.send(OutInAxisOperation.java:442) at org.apache.axis2.description.OutInAxisOperationClient.executeImpl(OutInAxisOperation.java:228) at org.apache.axis2.client.OperationClient.execute(OperationClient.java:149) at org.wso2.carbon.localentry.stub.types.LocalEntryAdminServiceStub.getEntryDataCount(LocalEntryAdminServiceStub.java:2863) at org.wso2.esb.integration.common.clients.localentry.LocalEntriesAdminClient.getEntryDataCount(LocalEntriesAdminClient.java:127) at org.wso2.carbon.esb.samples.test.miscellaneous.Sample650TestCase.testLocalEntries(Sample650TestCase.java:129) Caused by: com.ctc.wstx.exc.WstxIOException: Connection has been shutdown: javax.net.ssl.SSLException: java.lang.RuntimeException: Unexpected error: java.security.InvalidAlgorithmParameterException: the trustAnchors parameter must be non-empty at com.ctc.wstx.sw.BaseStreamWriter._finishDocument(BaseStreamWriter.java:1406) at com.ctc.wstx.sw.BaseStreamWriter.close(BaseStreamWriter.java:247) at org.apache.axiom.om.impl.MTOMXMLStreamWriter.close(MTOMXMLStreamWriter.java:188) at org.apache.axiom.om.impl.llom.OMSerializableImpl.serializeAndConsume(OMSerializableImpl.java:197) at org.apache.axis2.transport.http.SOAPMessageFormatter.writeTo(SOAPMessageFormatter.java:74) ... 53 more Caused by: javax.net.ssl.SSLException: Connection has been shutdown: javax.net.ssl.SSLException: java.lang.RuntimeException: Unexpected error: java.security.InvalidAlgorithmParameterException: the trustAnchors parameter must be non-empty at sun.security.ssl.SSLSocketImpl.checkEOF(SSLSocketImpl.java:1551) at sun.security.ssl.SSLSocketImpl.checkWrite(SSLSocketImpl.java:1563) at sun.security.ssl.AppOutputStream.write(AppOutputStream.java:71) at java.io.BufferedOutputStream.flushBuffer(BufferedOutputStream.java:82) at java.io.BufferedOutputStream.flush(BufferedOutputStream.java:140) at org.apache.commons.httpclient.ChunkedOutputStream.flush(ChunkedOutputStream.java:191) at com.ctc.wstx.io.UTF8Writer.flush(UTF8Writer.java:103) at com.ctc.wstx.sw.BufferingXmlWriter.flush(BufferingXmlWriter.java:225) at com.ctc.wstx.sw.BufferingXmlWriter.close(BufferingXmlWriter.java:198) at com.ctc.wstx.sw.BaseStreamWriter._finishDocument(BaseStreamWriter.java:1404) ... 57 more Caused by: javax.net.ssl.SSLException: java.lang.RuntimeException: Unexpected error: java.security.InvalidAlgorithmParameterException: the trustAnchors parameter must be non-empty at sun.security.ssl.Alerts.getSSLException(Alerts.java:208) at sun.security.ssl.SSLSocketImpl.fatal(SSLSocketImpl.java:1959) at sun.security.ssl.SSLSocketImpl.fatal(SSLSocketImpl.java:1916) at sun.security.ssl.SSLSocketImpl.handleException(SSLSocketImpl.java:1899) at sun.security.ssl.SSLSocketImpl.handleException(SSLSocketImpl.java:1825) at sun.security.ssl.AppOutputStream.write(AppOutputStream.java:128) at java.io.BufferedOutputStream.flushBuffer(BufferedOutputStream.java:82) at java.io.BufferedOutputStream.flush(BufferedOutputStream.java:140) at org.apache.commons.httpclient.ChunkedOutputStream.flush(ChunkedOutputStream.java:191) at com.ctc.wstx.io.UTF8Writer.flush(UTF8Writer.java:103) at com.ctc.wstx.sw.BufferingXmlWriter.flush(BufferingXmlWriter.java:225) at com.ctc.wstx.sw.BaseStreamWriter.flush(BaseStreamWriter.java:259) at org.apache.axiom.om.impl.MTOMXMLStreamWriter.flush(MTOMXMLStreamWriter.java:198) at org.apache.axiom.om.impl.llom.OMSerializableImpl.serializeAndConsume(OMSerializableImpl.java:195) ... 54 more Caused by: java.lang.RuntimeException: Unexpected error: java.security.InvalidAlgorithmParameterException: the trustAnchors parameter must be non-empty at sun.security.validator.PKIXValidator.(PKIXValidator.java:91) at sun.security.validator.Validator.getInstance(Validator.java:179) at sun.security.ssl.X509TrustManagerImpl.getValidator(X509TrustManagerImpl.java:312) at sun.security.ssl.X509TrustManagerImpl.checkTrustedInit(X509TrustManagerImpl.java:171) at sun.security.ssl.X509TrustManagerImpl.checkTrusted(X509TrustManagerImpl.java:184) at sun.security.ssl.X509TrustManagerImpl.checkServerTrusted(X509TrustManagerImpl.java:124) at sun.security.ssl.ClientHandshaker.serverCertificate(ClientHandshaker.java:1496) at sun.security.ssl.ClientHandshaker.processMessage(ClientHandshaker.java:216) at sun.security.ssl.Handshaker.processLoop(Handshaker.java:1026) at sun.security.ssl.Handshaker.process_record(Handshaker.java:961) at sun.security.ssl.SSLSocketImpl.readRecord(SSLSocketImpl.java:1072) at sun.security.ssl.SSLSocketImpl.performInitialHandshake(SSLSocketImpl.java:1385) at sun.security.ssl.SSLSocketImpl.writeRecord(SSLSocketImpl.java:757) at sun.security.ssl.AppOutputStream.write(AppOutputStream.java:123) ... 62 more Caused by: java.security.InvalidAlgorithmParameterException: the trustAnchors parameter must be non-empty at java.security.cert.PKIXParameters.setTrustAnchors(PKIXParameters.java:200) at java.security.cert.PKIXParameters.(PKIXParameters.java:120) at java.security.cert.PKIXBuilderParameters.(PKIXBuilderParameters.java:104) at sun.security.validator.PKIXValidator.(PKIXValidator.java:89) ... 75 more

testSendingToDefinedProxies

org.apache.axis2.AxisFault: Transport error: 404 Error: Not Found at org.apache.axis2.transport.http.HTTPSender.handleResponse(HTTPSender.java:371) at org.apache.axis2.transport.http.HTTPSender.sendViaPost(HTTPSender.java:200) at org.apache.axis2.transport.http.HTTPSender.send(HTTPSender.java:81) at org.apache.axis2.transport.http.CommonsHTTPTransportSender.writeMessageWithCommons(CommonsHTTPTransportSender.java:459) at org.apache.axis2.transport.http.CommonsHTTPTransportSender.invoke(CommonsHTTPTransportSender.java:286) at org.apache.axis2.engine.AxisEngine.send(AxisEngine.java:442) at org.apache.axis2.description.OutInAxisOperationClient.send(OutInAxisOperation.java:442) at org.apache.axis2.description.OutInAxisOperationClient.executeImpl(OutInAxisOperation.java:228) at org.apache.axis2.client.OperationClient.execute(OperationClient.java:149) at org.apache.axis2.client.ServiceClient.sendReceive(ServiceClient.java:554) at org.apache.axis2.client.ServiceClient.sendReceive(ServiceClient.java:530) at org.wso2.esb.integration.common.utils.clients.stockquoteclient.StockQuoteClient.sendSimpleStockQuoteRequest(StockQuoteClient.java:70) at org.wso2.carbon.esb.samples.test.miscellaneous.Sample650TestCase.testSendingToDefinedProxies(Sample650TestCase.java:92)

testSequences

org.apache.axis2.AxisFault: Connection has been shutdown: javax.net.ssl.SSLException: java.lang.RuntimeException: Unexpected error: java.security.InvalidAlgorithmParameterException: the trustAnchors parameter must be non-empty at org.apache.axis2.AxisFault.makeFault(AxisFault.java:430) at org.apache.axis2.transport.http.SOAPMessageFormatter.writeTo(SOAPMessageFormatter.java:78) at org.apache.axis2.transport.http.AxisRequestEntity.writeRequest(AxisRequestEntity.java:84) at org.apache.commons.httpclient.methods.EntityEnclosingMethod.writeRequestBody(EntityEnclosingMethod.java:499) at org.apache.commons.httpclient.HttpMethodBase.writeRequest(HttpMethodBase.java:2114) at org.apache.commons.httpclient.HttpMethodBase.execute(HttpMethodBase.java:1096) at org.apache.commons.httpclient.HttpMethodDirector.executeWithRetry(HttpMethodDirector.java:398) at org.apache.commons.httpclient.HttpMethodDirector.executeMethod(HttpMethodDirector.java:171) at org.apache.commons.httpclient.HttpClient.executeMethod(HttpClient.java:397) at org.apache.axis2.transport.http.AbstractHTTPSender.executeMethod(AbstractHTTPSender.java:712) at org.apache.axis2.transport.http.HTTPSender.sendViaPost(HTTPSender.java:199) at org.apache.axis2.transport.http.HTTPSender.send(HTTPSender.java:81) at org.apache.axis2.transport.http.CommonsHTTPTransportSender.writeMessageWithCommons(CommonsHTTPTransportSender.java:459) at org.apache.axis2.transport.http.CommonsHTTPTransportSender.invoke(CommonsHTTPTransportSender.java:286) at org.apache.axis2.engine.AxisEngine.send(AxisEngine.java:442) at org.apache.axis2.description.OutInAxisOperationClient.send(OutInAxisOperation.java:442) at org.apache.axis2.description.OutInAxisOperationClient.executeImpl(OutInAxisOperation.java:228) at org.apache.axis2.client.OperationClient.execute(OperationClient.java:149) at org.wso2.carbon.sequences.stub.types.SequenceAdminServiceStub.getSequences(SequenceAdminServiceStub.java:1332) at org.wso2.esb.integration.common.clients.sequences.SequenceAdminServiceClient.getSequences(SequenceAdminServiceClient.java:213) at org.wso2.carbon.esb.samples.test.miscellaneous.Sample650TestCase.testSequences(Sample650TestCase.java:135) Caused by: com.ctc.wstx.exc.WstxIOException: Connection has been shutdown: javax.net.ssl.SSLException: java.lang.RuntimeException: Unexpected error: java.security.InvalidAlgorithmParameterException: the trustAnchors parameter must be non-empty at com.ctc.wstx.sw.BaseStreamWriter._finishDocument(BaseStreamWriter.java:1406) at com.ctc.wstx.sw.BaseStreamWriter.close(BaseStreamWriter.java:247) at org.apache.axiom.om.impl.MTOMXMLStreamWriter.close(MTOMXMLStreamWriter.java:188) at org.apache.axiom.om.impl.llom.OMSerializableImpl.serializeAndConsume(OMSerializableImpl.java:197) at org.apache.axis2.transport.http.SOAPMessageFormatter.writeTo(SOAPMessageFormatter.java:74) ... 53 more Caused by: javax.net.ssl.SSLException: Connection has been shutdown: javax.net.ssl.SSLException: java.lang.RuntimeException: Unexpected error: java.security.InvalidAlgorithmParameterException: the trustAnchors parameter must be non-empty at sun.security.ssl.SSLSocketImpl.checkEOF(SSLSocketImpl.java:1551) at sun.security.ssl.SSLSocketImpl.checkWrite(SSLSocketImpl.java:1563) at sun.security.ssl.AppOutputStream.write(AppOutputStream.java:71) at java.io.BufferedOutputStream.flushBuffer(BufferedOutputStream.java:82) at java.io.BufferedOutputStream.flush(BufferedOutputStream.java:140) at org.apache.commons.httpclient.ChunkedOutputStream.flush(ChunkedOutputStream.java:191) at com.ctc.wstx.io.UTF8Writer.flush(UTF8Writer.java:103) at com.ctc.wstx.sw.BufferingXmlWriter.flush(BufferingXmlWriter.java:225) at com.ctc.wstx.sw.BufferingXmlWriter.close(BufferingXmlWriter.java:198) at com.ctc.wstx.sw.BaseStreamWriter._finishDocument(BaseStreamWriter.java:1404) ... 57 more Caused by: javax.net.ssl.SSLException: java.lang.RuntimeException: Unexpected error: java.security.InvalidAlgorithmParameterException: the trustAnchors parameter must be non-empty at sun.security.ssl.Alerts.getSSLException(Alerts.java:208) at sun.security.ssl.SSLSocketImpl.fatal(SSLSocketImpl.java:1959) at sun.security.ssl.SSLSocketImpl.fatal(SSLSocketImpl.java:1916) at sun.security.ssl.SSLSocketImpl.handleException(SSLSocketImpl.java:1899) at sun.security.ssl.SSLSocketImpl.handleException(SSLSocketImpl.java:1825) at sun.security.ssl.AppOutputStream.write(AppOutputStream.java:128) at java.io.BufferedOutputStream.flushBuffer(BufferedOutputStream.java:82) at java.io.BufferedOutputStream.flush(BufferedOutputStream.java:140) at org.apache.commons.httpclient.ChunkedOutputStream.flush(ChunkedOutputStream.java:191) at com.ctc.wstx.io.UTF8Writer.flush(UTF8Writer.java:103) at com.ctc.wstx.sw.BufferingXmlWriter.flush(BufferingXmlWriter.java:225) at com.ctc.wstx.sw.BaseStreamWriter.flush(BaseStreamWriter.java:259) at org.apache.axiom.om.impl.MTOMXMLStreamWriter.flush(MTOMXMLStreamWriter.java:198) at org.apache.axis2.databinding.ADBDataSource.serialize(ADBDataSource.java:91) at org.apache.axiom.om.impl.llom.OMSourcedElementImpl.internalSerialize(OMSourcedElementImpl.java:691) at org.apache.axiom.om.impl.util.OMSerializerUtil.serializeChildren(OMSerializerUtil.java:562) at org.apache.axiom.om.impl.llom.OMElementImpl.internalSerialize(OMElementImpl.java:875) at org.apache.axiom.soap.impl.llom.SOAPEnvelopeImpl.serializeInternally(SOAPEnvelopeImpl.java:283) at org.apache.axiom.soap.impl.llom.SOAPEnvelopeImpl.internalSerialize(SOAPEnvelopeImpl.java:245) at org.apache.axiom.om.impl.llom.OMSerializableImpl.serializeAndConsume(OMSerializableImpl.java:193) ... 54 more Caused by: java.lang.RuntimeException: Unexpected error: java.security.InvalidAlgorithmParameterException: the trustAnchors parameter must be non-empty at sun.security.validator.PKIXValidator.(PKIXValidator.java:91) at sun.security.validator.Validator.getInstance(Validator.java:179) at sun.security.ssl.X509TrustManagerImpl.getValidator(X509TrustManagerImpl.java:312) at sun.security.ssl.X509TrustManagerImpl.checkTrustedInit(X509TrustManagerImpl.java:171) at sun.security.ssl.X509TrustManagerImpl.checkTrusted(X509TrustManagerImpl.java:184) at sun.security.ssl.X509TrustManagerImpl.checkServerTrusted(X509TrustManagerImpl.java:124) at sun.security.ssl.ClientHandshaker.serverCertificate(ClientHandshaker.java:1496) at sun.security.ssl.ClientHandshaker.processMessage(ClientHandshaker.java:216) at sun.security.ssl.Handshaker.processLoop(Handshaker.java:1026) at sun.security.ssl.Handshaker.process_record(Handshaker.java:961) at sun.security.ssl.SSLSocketImpl.readRecord(SSLSocketImpl.java:1072) at sun.security.ssl.SSLSocketImpl.performInitialHandshake(SSLSocketImpl.java:1385) at sun.security.ssl.SSLSocketImpl.writeRecord(SSLSocketImpl.java:757) at sun.security.ssl.AppOutputStream.write(AppOutputStream.java:123) ... 68 more Caused by: java.security.InvalidAlgorithmParameterException: the trustAnchors parameter must be non-empty at java.security.cert.PKIXParameters.setTrustAnchors(PKIXParameters.java:200) at java.security.cert.PKIXParameters.(PKIXParameters.java:120) at java.security.cert.PKIXBuilderParameters.(PKIXBuilderParameters.java:104) at sun.security.validator.PKIXValidator.(PKIXValidator.java:89) ... 81 more

testTasks

org.apache.axis2.AxisFault: Connection has been shutdown: javax.net.ssl.SSLException: java.lang.RuntimeException: Unexpected error: java.security.InvalidAlgorithmParameterException: the trustAnchors parameter must be non-empty at org.apache.axis2.AxisFault.makeFault(AxisFault.java:430) at org.apache.axis2.transport.http.SOAPMessageFormatter.writeTo(SOAPMessageFormatter.java:78) at org.apache.axis2.transport.http.AxisRequestEntity.writeRequest(AxisRequestEntity.java:84) at org.apache.commons.httpclient.methods.EntityEnclosingMethod.writeRequestBody(EntityEnclosingMethod.java:499) at org.apache.commons.httpclient.HttpMethodBase.writeRequest(HttpMethodBase.java:2114) at org.apache.commons.httpclient.HttpMethodBase.execute(HttpMethodBase.java:1096) at org.apache.commons.httpclient.HttpMethodDirector.executeWithRetry(HttpMethodDirector.java:398) at org.apache.commons.httpclient.HttpMethodDirector.executeMethod(HttpMethodDirector.java:171) at org.apache.commons.httpclient.HttpClient.executeMethod(HttpClient.java:397) at org.apache.axis2.transport.http.AbstractHTTPSender.executeMethod(AbstractHTTPSender.java:712) at org.apache.axis2.transport.http.HTTPSender.sendViaPost(HTTPSender.java:199) at org.apache.axis2.transport.http.HTTPSender.send(HTTPSender.java:81) at org.apache.axis2.transport.http.CommonsHTTPTransportSender.writeMessageWithCommons(CommonsHTTPTransportSender.java:459) at org.apache.axis2.transport.http.CommonsHTTPTransportSender.invoke(CommonsHTTPTransportSender.java:286) at org.apache.axis2.engine.AxisEngine.send(AxisEngine.java:442) at org.apache.axis2.description.OutInAxisOperationClient.send(OutInAxisOperation.java:442) at org.apache.axis2.description.OutInAxisOperationClient.executeImpl(OutInAxisOperation.java:228) at org.apache.axis2.client.OperationClient.execute(OperationClient.java:149) at org.wso2.carbon.task.stub.TaskAdminStub.getAllTaskDescriptions(TaskAdminStub.java:422) at org.wso2.esb.integration.common.clients.tasks.TaskAdminClient.getAllTaskDescriptions(TaskAdminClient.java:87) at org.wso2.esb.integration.common.clients.tasks.TaskAdminClient.getScheduleTaskList(TaskAdminClient.java:92) at org.wso2.carbon.esb.samples.test.miscellaneous.Sample650TestCase.testTasks(Sample650TestCase.java:141) Caused by: com.ctc.wstx.exc.WstxIOException: Connection has been shutdown: javax.net.ssl.SSLException: java.lang.RuntimeException: Unexpected error: java.security.InvalidAlgorithmParameterException: the trustAnchors parameter must be non-empty at com.ctc.wstx.sw.BaseStreamWriter._finishDocument(BaseStreamWriter.java:1406) at com.ctc.wstx.sw.BaseStreamWriter.close(BaseStreamWriter.java:247) at org.apache.axiom.om.impl.MTOMXMLStreamWriter.close(MTOMXMLStreamWriter.java:188) at org.apache.axiom.om.impl.llom.OMSerializableImpl.serializeAndConsume(OMSerializableImpl.java:197) at org.apache.axis2.transport.http.SOAPMessageFormatter.writeTo(SOAPMessageFormatter.java:74) ... 54 more Caused by: javax.net.ssl.SSLException: Connection has been shutdown: javax.net.ssl.SSLException: java.lang.RuntimeException: Unexpected error: java.security.InvalidAlgorithmParameterException: the trustAnchors parameter must be non-empty at sun.security.ssl.SSLSocketImpl.checkEOF(SSLSocketImpl.java:1551) at sun.security.ssl.SSLSocketImpl.checkWrite(SSLSocketImpl.java:1563) at sun.security.ssl.AppOutputStream.write(AppOutputStream.java:71) at java.io.BufferedOutputStream.flushBuffer(BufferedOutputStream.java:82) at java.io.BufferedOutputStream.flush(BufferedOutputStream.java:140) at org.apache.commons.httpclient.ChunkedOutputStream.flush(ChunkedOutputStream.java:191) at com.ctc.wstx.io.UTF8Writer.flush(UTF8Writer.java:103) at com.ctc.wstx.sw.BufferingXmlWriter.flush(BufferingXmlWriter.java:225) at com.ctc.wstx.sw.BufferingXmlWriter.close(BufferingXmlWriter.java:198) at com.ctc.wstx.sw.BaseStreamWriter._finishDocument(BaseStreamWriter.java:1404) ... 58 more Caused by: javax.net.ssl.SSLException: java.lang.RuntimeException: Unexpected error: java.security.InvalidAlgorithmParameterException: the trustAnchors parameter must be non-empty at sun.security.ssl.Alerts.getSSLException(Alerts.java:208) at sun.security.ssl.SSLSocketImpl.fatal(SSLSocketImpl.java:1959) at sun.security.ssl.SSLSocketImpl.fatal(SSLSocketImpl.java:1916) at sun.security.ssl.SSLSocketImpl.handleException(SSLSocketImpl.java:1899) at sun.security.ssl.SSLSocketImpl.handleException(SSLSocketImpl.java:1825) at sun.security.ssl.AppOutputStream.write(AppOutputStream.java:128) at java.io.BufferedOutputStream.flushBuffer(BufferedOutputStream.java:82) at java.io.BufferedOutputStream.flush(BufferedOutputStream.java:140) at org.apache.commons.httpclient.ChunkedOutputStream.flush(ChunkedOutputStream.java:191) at com.ctc.wstx.io.UTF8Writer.flush(UTF8Writer.java:103) at com.ctc.wstx.sw.BufferingXmlWriter.flush(BufferingXmlWriter.java:225) at com.ctc.wstx.sw.BaseStreamWriter.flush(BaseStreamWriter.java:259) at org.apache.axiom.om.impl.MTOMXMLStreamWriter.flush(MTOMXMLStreamWriter.java:198) at org.apache.axis2.databinding.ADBDataSource.serialize(ADBDataSource.java:91) at org.apache.axiom.om.impl.llom.OMSourcedElementImpl.internalSerialize(OMSourcedElementImpl.java:691) at org.apache.axiom.om.impl.util.OMSerializerUtil.serializeChildren(OMSerializerUtil.java:562) at org.apache.axiom.om.impl.llom.OMElementImpl.internalSerialize(OMElementImpl.java:875) at org.apache.axiom.soap.impl.llom.SOAPEnvelopeImpl.serializeInternally(SOAPEnvelopeImpl.java:283) at org.apache.axiom.soap.impl.llom.SOAPEnvelopeImpl.internalSerialize(SOAPEnvelopeImpl.java:245) at org.apache.axiom.om.impl.llom.OMSerializableImpl.serializeAndConsume(OMSerializableImpl.java:193) ... 55 more Caused by: java.lang.RuntimeException: Unexpected error: java.security.InvalidAlgorithmParameterException: the trustAnchors parameter must be non-empty at sun.security.validator.PKIXValidator.(PKIXValidator.java:91) at sun.security.validator.Validator.getInstance(Validator.java:179) at sun.security.ssl.X509TrustManagerImpl.getValidator(X509TrustManagerImpl.java:312) at sun.security.ssl.X509TrustManagerImpl.checkTrustedInit(X509TrustManagerImpl.java:171) at sun.security.ssl.X509TrustManagerImpl.checkTrusted(X509TrustManagerImpl.java:184) at sun.security.ssl.X509TrustManagerImpl.checkServerTrusted(X509TrustManagerImpl.java:124) at sun.security.ssl.ClientHandshaker.serverCertificate(ClientHandshaker.java:1496) at sun.security.ssl.ClientHandshaker.processMessage(ClientHandshaker.java:216) at sun.security.ssl.Handshaker.processLoop(Handshaker.java:1026) at sun.security.ssl.Handshaker.process_record(Handshaker.java:961) at sun.security.ssl.SSLSocketImpl.readRecord(SSLSocketImpl.java:1072) at sun.security.ssl.SSLSocketImpl.performInitialHandshake(SSLSocketImpl.java:1385) at sun.security.ssl.SSLSocketImpl.writeRecord(SSLSocketImpl.java:757) at sun.security.ssl.AppOutputStream.write(AppOutputStream.java:123) ... 69 more Caused by: java.security.InvalidAlgorithmParameterException: the trustAnchors parameter must be non-empty at java.security.cert.PKIXParameters.setTrustAnchors(PKIXParameters.java:200) at java.security.cert.PKIXParameters.(PKIXParameters.java:120) at java.security.cert.PKIXBuilderParameters.(PKIXBuilderParameters.java:104) at sun.security.validator.PKIXValidator.(PKIXValidator.java:89) ... 82 more

setEnvironment

java.io.FileNotFoundException: /home/jenkins/workspace/products/micro-integrator-asankaab-delete/integration/mediation-tests/tests-sample/src/test/resources/artifacts/ESB/samples/synapse_sample_656.xml (No such file or directory) at java.io.FileInputStream.open0(Native Method) at java.io.FileInputStream.open(FileInputStream.java:195) at java.io.FileInputStream.(FileInputStream.java:138) at java.io.FileInputStream.(FileInputStream.java:93) at org.wso2.esb.integration.common.utils.ESBTestCaseUtils.loadESBSampleConfiguration(ESBTestCaseUtils.java:178) at org.wso2.carbon.esb.samples.test.util.ESBSampleIntegrationTest.loadSampleESBConfiguration(ESBSampleIntegrationTest.java:286) at org.wso2.carbon.esb.samples.test.miscellaneous.Sample656TestCase.setEnvironment(Sample656TestCase.java:38)

setEnvironment

java.io.FileNotFoundException: /home/jenkins/workspace/products/micro-integrator-asankaab-delete/integration/mediation-tests/tests-sample/src/test/resources/artifacts/ESB/samples/synapse_sample_655.xml (No such file or directory) at java.io.FileInputStream.open0(Native Method) at java.io.FileInputStream.open(FileInputStream.java:195) at java.io.FileInputStream.(FileInputStream.java:138) at java.io.FileInputStream.(FileInputStream.java:93) at org.wso2.esb.integration.common.utils.ESBTestCaseUtils.loadESBSampleConfiguration(ESBTestCaseUtils.java:178) at org.wso2.carbon.esb.samples.test.util.ESBSampleIntegrationTest.loadSampleESBConfiguration(ESBSampleIntegrationTest.java:286) at org.wso2.carbon.esb.samples.test.miscellaneous.Sample655TestCase.setEnvironment(Sample655TestCase.java:38)

setEnvironment

java.io.FileNotFoundException: /home/jenkins/workspace/products/micro-integrator-asankaab-delete/integration/mediation-tests/tests-sample/src/test/resources/artifacts/ESB/samples/synapse_sample_155.xml (No such file or directory) at java.io.FileInputStream.open0(Native Method) at java.io.FileInputStream.open(FileInputStream.java:195) at java.io.FileInputStream.(FileInputStream.java:138) at java.io.FileInputStream.(FileInputStream.java:93) at org.wso2.esb.integration.common.utils.ESBTestCaseUtils.loadESBSampleConfiguration(ESBTestCaseUtils.java:178) at org.wso2.esb.integration.common.utils.ESBIntegrationTest.loadSampleESBConfigurationWithoutApply(ESBIntegrationTest.java:208) at org.wso2.carbon.esb.samples.test.proxy.Sample155TestCase.loadAndEditSample(Sample155TestCase.java:89) at org.wso2.carbon.esb.samples.test.proxy.Sample155TestCase.setEnvironment(Sample155TestCase.java:42)

destroy

java.lang.NullPointerException at org.wso2.carbon.esb.samples.test.proxy.Sample155TestCase.destroy(Sample155TestCase.java:80)

Environment Variables(37)0 different
Slave Information(84)0 different
Project Information(14)0 different