FailedConsole Output

Skipping 2,855 KB.. Full Log
791/30127 KB   
6760/6964 KB   21791/30127 KB   
6764/6964 KB   21791/30127 KB   
6768/6964 KB   21791/30127 KB   
6772/6964 KB   21791/30127 KB   
6772/6964 KB   21795/30127 KB   
6776/6964 KB   21795/30127 KB   
6776/6964 KB   21799/30127 KB   
6780/6964 KB   21799/30127 KB   
6780/6964 KB   21803/30127 KB   
6784/6964 KB   21803/30127 KB   
6788/6964 KB   21803/30127 KB   
6788/6964 KB   21807/30127 KB   
6788/6964 KB   21811/30127 KB   
6792/6964 KB   21811/30127 KB   
6792/6964 KB   21815/30127 KB   
6796/6964 KB   21815/30127 KB   
6796/6964 KB   21819/30127 KB   
6800/6964 KB   21819/30127 KB   
6800/6964 KB   21823/30127 KB   
6804/6964 KB   21823/30127 KB   
6808/6964 KB   21823/30127 KB   
6808/6964 KB   21827/30127 KB   
6812/6964 KB   21827/30127 KB   
6816/6964 KB   21827/30127 KB   
6816/6964 KB   21831/30127 KB   
6820/6964 KB   21831/30127 KB   
6824/6964 KB   21831/30127 KB   
6824/6964 KB   21835/30127 KB   
6828/6964 KB   21835/30127 KB   
6832/6964 KB   21835/30127 KB   
6832/6964 KB   21835/30127 KB   
6836/6964 KB   21835/30127 KB   
6840/6964 KB   21835/30127 KB   
6844/6964 KB   21835/30127 KB   
6848/6964 KB   21835/30127 KB   
6852/6964 KB   21835/30127 KB   
6856/6964 KB   21835/30127 KB   
6860/6964 KB   21835/30127 KB   
6864/6964 KB   21835/30127 KB   
6868/6964 KB   21835/30127 KB   
6868/6964 KB   21839/30127 KB   
6872/6964 KB   21839/30127 KB   
6876/6964 KB   21839/30127 KB   
6880/6964 KB   21839/30127 KB   
6884/6964 KB   21839/30127 KB   
6888/6964 KB   21839/30127 KB   
6892/6964 KB   21839/30127 KB   
6896/6964 KB   21839/30127 KB   
6900/6964 KB   21839/30127 KB   
6904/6964 KB   21839/30127 KB   
6908/6964 KB   21839/30127 KB   
6912/6964 KB   21839/30127 KB   
6916/6964 KB   21839/30127 KB   
6920/6964 KB   21839/30127 KB   
6924/6964 KB   21839/30127 KB   
6928/6964 KB   21839/30127 KB   
6932/6964 KB   21839/30127 KB   
6932/6964 KB   21843/30127 KB   
6936/6964 KB   21843/30127 KB   
6936/6964 KB   21847/30127 KB   
6940/6964 KB   21847/30127 KB   
6944/6964 KB   21847/30127 KB   
6944/6964 KB   21851/30127 KB   
6948/6964 KB   21851/30127 KB   
6948/6964 KB   21855/30127 KB   
6952/6964 KB   21855/30127 KB   
6952/6964 KB   21859/30127 KB   
6956/6964 KB   21859/30127 KB   
6956/6964 KB   21863/30127 KB   
6960/6964 KB   21863/30127 KB   
6960/6964 KB   21867/30127 KB   
6964/6964 KB   21867/30127 KB   
6964/6964 KB   21871/30127 KB   
6964/6964 KB   21875/30127 KB   
6964/6964 KB   21879/30127 KB   
6964/6964 KB   21883/30127 KB   
6964/6964 KB   21887/30127 KB   
6964/6964 KB   21891/30127 KB   
6964/6964 KB   21895/30127 KB   
6964/6964 KB   21899/30127 KB   
6964/6964 KB   21903/30127 KB   
6964/6964 KB   21907/30127 KB   
6964/6964 KB   21911/30127 KB   
6964/6964 KB   21915/30127 KB   
6964/6964 KB   21919/30127 KB   
6964/6964 KB   21923/30127 KB   
6964/6964 KB   21926/30127 KB   
6964/6964 KB   21930/30127 KB   
6964/6964 KB   21934/30127 KB   
6964/6964 KB   21938/30127 KB   
6964/6964 KB   21942/30127 KB   
6964/6964 KB   21946/30127 KB   
6964/6964 KB   21950/30127 KB   
6964/6964 KB   21954/30127 KB   
6964/6964 KB   21958/30127 KB   
6964/6964 KB   21962/30127 KB   
6964/6964 KB   21966/30127 KB   
6964/6964 KB   21970/30127 KB   
6964/6964 KB   21974/30127 KB   
6964/6964 KB   21978/30127 KB   
6964/6964 KB   21982/30127 KB   
6964/6964 KB   21986/30127 KB   
6964/6964 KB   21990/30127 KB   
6964/6964 KB   21994/30127 KB   
6964/6964 KB   21998/30127 KB   
6964/6964 KB   22002/30127 KB   
6964/6964 KB   22006/30127 KB   
                                
Downloaded: http://maven.wso2.org/nexus/content/groups/wso2-public/org/scala-lang/scala-library/2.10.5/scala-library-2.10.5.jar (6964 KB at 11491.2 KB/sec)
22010/30127 KB                  
22014/30127 KB   
22018/30127 KB   
22022/30127 KB   
22026/30127 KB   
22030/30127 KB   
22034/30127 KB   
22038/30127 KB   
22042/30127 KB   
22046/30127 KB   
22050/30127 KB   
22054/30127 KB   
22058/30127 KB   
22062/30127 KB   
22066/30127 KB   
22070/30127 KB   
22074/30127 KB   
22078/30127 KB   
22082/30127 KB   
22086/30127 KB   
22090/30127 KB   
22094/30127 KB   
22098/30127 KB   
22102/30127 KB   
22106/30127 KB   
22110/30127 KB   
22114/30127 KB   
22118/30127 KB   
22122/30127 KB   
22126/30127 KB   
22130/30127 KB   
22134/30127 KB   
22138/30127 KB   
22142/30127 KB   
22146/30127 KB   
22150/30127 KB   
22154/30127 KB   
22158/30127 KB   
22162/30127 KB   
22166/30127 KB   
22170/30127 KB   
22174/30127 KB   
22178/30127 KB   
22182/30127 KB   
22186/30127 KB   
22190/30127 KB   
22194/30127 KB   
22198/30127 KB   
22202/30127 KB   
22206/30127 KB   
22210/30127 KB   
22214/30127 KB   
22218/30127 KB   
22222/30127 KB   
22226/30127 KB   
22230/30127 KB   
22234/30127 KB   
22238/30127 KB   
22242/30127 KB   
22246/30127 KB   
22250/30127 KB   
22254/30127 KB   
22258/30127 KB   
22262/30127 KB   
22266/30127 KB   
22270/30127 KB   
22274/30127 KB   
22278/30127 KB   
22282/30127 KB   
22286/30127 KB   
22290/30127 KB   
22294/30127 KB   
22298/30127 KB   
22302/30127 KB   
22306/30127 KB   
22310/30127 KB   
22314/30127 KB   
22318/30127 KB   
22322/30127 KB   
22326/30127 KB   
22330/30127 KB   
22334/30127 KB   
22338/30127 KB   
22342/30127 KB   
22346/30127 KB   
22350/30127 KB   
22354/30127 KB   
22358/30127 KB   
22362/30127 KB   
22366/30127 KB   
22370/30127 KB   
22374/30127 KB   
22378/30127 KB   
22382/30127 KB   
22386/30127 KB   
22390/30127 KB   
22394/30127 KB   
22398/30127 KB   
22402/30127 KB   
22406/30127 KB   
22410/30127 KB   
22414/30127 KB   
22418/30127 KB   
22422/30127 KB   
22426/30127 KB   
22430/30127 KB   
22434/30127 KB   
22438/30127 KB   
22442/30127 KB   
22446/30127 KB   
22450/30127 KB   
22454/30127 KB   
22458/30127 KB   
22462/30127 KB   
22466/30127 KB   
22470/30127 KB   
22474/30127 KB   
22478/30127 KB   
22482/30127 KB   
22486/30127 KB   
22490/30127 KB   
22494/30127 KB   
22498/30127 KB   
22502/30127 KB   
22506/30127 KB   
22510/30127 KB   
22514/30127 KB   
22518/30127 KB   
22522/30127 KB   
22526/30127 KB   
22530/30127 KB   
22534/30127 KB   
22538/30127 KB   
22542/30127 KB   
22546/30127 KB   
22550/30127 KB   
22554/30127 KB   
22558/30127 KB   
22562/30127 KB   
22566/30127 KB   
22570/30127 KB   
22574/30127 KB   
22578/30127 KB   
22582/30127 KB   
22586/30127 KB   
22590/30127 KB   
22594/30127 KB   
22598/30127 KB   
22602/30127 KB   
22606/30127 KB   
22610/30127 KB   
22614/30127 KB   
22618/30127 KB   
22622/30127 KB   
22626/30127 KB   
22630/30127 KB   
22634/30127 KB   
22638/30127 KB   
22642/30127 KB   
22646/30127 KB   
22650/30127 KB   
22654/30127 KB   
22658/30127 KB   
22662/30127 KB   
22666/30127 KB   
22670/30127 KB   
22674/30127 KB   
22678/30127 KB   
22682/30127 KB   
22686/30127 KB   
22690/30127 KB   
22694/30127 KB   
22698/30127 KB   
22702/30127 KB   
22706/30127 KB   
22710/30127 KB   
22714/30127 KB   
22718/30127 KB   
22722/30127 KB   
22726/30127 KB   
22730/30127 KB   
22734/30127 KB   
22738/30127 KB   
22742/30127 KB   
22746/30127 KB   
22750/30127 KB   
22754/30127 KB   
22758/30127 KB   
22762/30127 KB   
22766/30127 KB   
22770/30127 KB   
22774/30127 KB   
22778/30127 KB   
22782/30127 KB   
22786/30127 KB   
22790/30127 KB   
22794/30127 KB   
22798/30127 KB   
22802/30127 KB   
22806/30127 KB   
22810/30127 KB   
22814/30127 KB   
22818/30127 KB   
22822/30127 KB   
22826/30127 KB   
22830/30127 KB   
22834/30127 KB   
22838/30127 KB   
22842/30127 KB   
22846/30127 KB   
22850/30127 KB   
22854/30127 KB   
22858/30127 KB   
22862/30127 KB   
22866/30127 KB   
22870/30127 KB   
22874/30127 KB   
22878/30127 KB   
22882/30127 KB   
22886/30127 KB   
22890/30127 KB   
22894/30127 KB   
22898/30127 KB   
22902/30127 KB   
22906/30127 KB   
22910/30127 KB   
22914/30127 KB   
22918/30127 KB   
22922/30127 KB   
22926/30127 KB   
22930/30127 KB   
22934/30127 KB   
22938/30127 KB   
22942/30127 KB   
22946/30127 KB   
22950/30127 KB   
22954/30127 KB   
22958/30127 KB   
22962/30127 KB   
22966/30127 KB   
22970/30127 KB   
22974/30127 KB   
22978/30127 KB   
22982/30127 KB   
22986/30127 KB   
22990/30127 KB   
22994/30127 KB   
22998/30127 KB   
23002/30127 KB   
23006/30127 KB   
23010/30127 KB   
23014/30127 KB   
23018/30127 KB   
23022/30127 KB   
23026/30127 KB   
23030/30127 KB   
23034/30127 KB   
23038/30127 KB   
23042/30127 KB   
23046/30127 KB   
23050/30127 KB   
23054/30127 KB   
23058/30127 KB   
23062/30127 KB   
23066/30127 KB   
23070/30127 KB   
23074/30127 KB   
23078/30127 KB   
23082/30127 KB   
23086/30127 KB   
23090/30127 KB   
23094/30127 KB   
23098/30127 KB   
23102/30127 KB   
23106/30127 KB   
23110/30127 KB   
23114/30127 KB   
23118/30127 KB   
23122/30127 KB   
23126/30127 KB   
23130/30127 KB   
23134/30127 KB   
23138/30127 KB   
23142/30127 KB   
23146/30127 KB   
23150/30127 KB   
23154/30127 KB   
23158/30127 KB   
23162/30127 KB   
23166/30127 KB   
23170/30127 KB   
23174/30127 KB   
23178/30127 KB   
23182/30127 KB   
23186/30127 KB   
23190/30127 KB   
23194/30127 KB   
23198/30127 KB   
23202/30127 KB   
23206/30127 KB   
23210/30127 KB   
23214/30127 KB   
23218/30127 KB   
23222/30127 KB   
23226/30127 KB   
23230/30127 KB   
23234/30127 KB   
23238/30127 KB   
23242/30127 KB   
23246/30127 KB   
23250/30127 KB   
23254/30127 KB   
23258/30127 KB   
23262/30127 KB   
23266/30127 KB   
23270/30127 KB   
23274/30127 KB   
23278/30127 KB   
23282/30127 KB   
23286/30127 KB   
23290/30127 KB   
23294/30127 KB   
23298/30127 KB   
23302/30127 KB   
23306/30127 KB   
23310/30127 KB   
23314/30127 KB   
23318/30127 KB   
23322/30127 KB   
23326/30127 KB   
23330/30127 KB   
23334/30127 KB   
23338/30127 KB   
23342/30127 KB   
23346/30127 KB   
23350/30127 KB   
23354/30127 KB   
23358/30127 KB   
23362/30127 KB   
23366/30127 KB   
23370/30127 KB   
23374/30127 KB   
23378/30127 KB   
23382/30127 KB   
23386/30127 KB   
23390/30127 KB   
23394/30127 KB   
23398/30127 KB   
23402/30127 KB   
23406/30127 KB   
23410/30127 KB   
23414/30127 KB   
23418/30127 KB   
23422/30127 KB   
23426/30127 KB   
23430/30127 KB   
23434/30127 KB   
23438/30127 KB   
23442/30127 KB   
23446/30127 KB   
23450/30127 KB   
23454/30127 KB   
23458/30127 KB   
23462/30127 KB   
23466/30127 KB   
23470/30127 KB   
23474/30127 KB   
23478/30127 KB   
23482/30127 KB   
23486/30127 KB   
23490/30127 KB   
23494/30127 KB   
23498/30127 KB   
23502/30127 KB   
23506/30127 KB   
23510/30127 KB   
23514/30127 KB   
23518/30127 KB   
23522/30127 KB   
23526/30127 KB   
23530/30127 KB   
23534/30127 KB   
23538/30127 KB   
23542/30127 KB   
23546/30127 KB   
23550/30127 KB   
23554/30127 KB   
23558/30127 KB   
23562/30127 KB   
23566/30127 KB   
23570/30127 KB   
23574/30127 KB   
23578/30127 KB   
23582/30127 KB   
23586/30127 KB   
23590/30127 KB   
23594/30127 KB   
23598/30127 KB   
23602/30127 KB   
23606/30127 KB   
23610/30127 KB   
23614/30127 KB   
23618/30127 KB   
23622/30127 KB   
23626/30127 KB   
23630/30127 KB   
23634/30127 KB   
23638/30127 KB   
23642/30127 KB   
23646/30127 KB   
23650/30127 KB   
23654/30127 KB   
23658/30127 KB   
23662/30127 KB   
23666/30127 KB   
23670/30127 KB   
23674/30127 KB   
23678/30127 KB   
23682/30127 KB   
23686/30127 KB   
23690/30127 KB   
23694/30127 KB   
23698/30127 KB   
23702/30127 KB   
23706/30127 KB   
23710/30127 KB   
23714/30127 KB   
23718/30127 KB   
23722/30127 KB   
23726/30127 KB   
23730/30127 KB   
23734/30127 KB   
23738/30127 KB   
23742/30127 KB   
23746/30127 KB   
23750/30127 KB   
23754/30127 KB   
23758/30127 KB   
23762/30127 KB   
23766/30127 KB   
23770/30127 KB   
23774/30127 KB   
23778/30127 KB   
23782/30127 KB   
23786/30127 KB   
23790/30127 KB   
23794/30127 KB   
23798/30127 KB   
23802/30127 KB   
23806/30127 KB   
23810/30127 KB   
23814/30127 KB   
23818/30127 KB   
23822/30127 KB   
23826/30127 KB   
23830/30127 KB   
23834/30127 KB   
23838/30127 KB   
23842/30127 KB   
23846/30127 KB   
23850/30127 KB   
23854/30127 KB   
23858/30127 KB   
23862/30127 KB   
23866/30127 KB   
23870/30127 KB   
23874/30127 KB   
23878/30127 KB   
23882/30127 KB   
23886/30127 KB   
23890/30127 KB   
23894/30127 KB   
23898/30127 KB   
23902/30127 KB   
23906/30127 KB   
23910/30127 KB   
23914/30127 KB   
23918/30127 KB   
23922/30127 KB   
23926/30127 KB   
23930/30127 KB   
23934/30127 KB   
23938/30127 KB   
23942/30127 KB   
23946/30127 KB   
23950/30127 KB   
23954/30127 KB   
23958/30127 KB   
23962/30127 KB   
23966/30127 KB   
23970/30127 KB   
23974/30127 KB   
23978/30127 KB   
23982/30127 KB   
23986/30127 KB   
23990/30127 KB   
23994/30127 KB   
23998/30127 KB   
24002/30127 KB   
24006/30127 KB   
24010/30127 KB   
24014/30127 KB   
24018/30127 KB   
24022/30127 KB   
24026/30127 KB   
24030/30127 KB   
24034/30127 KB   
24038/30127 KB   
24042/30127 KB   
24046/30127 KB   
24050/30127 KB   
24054/30127 KB   
24058/30127 KB   
24062/30127 KB   
24066/30127 KB   
24070/30127 KB   
24074/30127 KB   
24078/30127 KB   
24082/30127 KB   
24086/30127 KB   
24090/30127 KB   
24094/30127 KB   
24098/30127 KB   
24102/30127 KB   
24106/30127 KB   
24110/30127 KB   
24114/30127 KB   
24118/30127 KB   
24122/30127 KB   
24126/30127 KB   
24130/30127 KB   
24134/30127 KB   
24138/30127 KB   
24142/30127 KB   
24146/30127 KB   
24150/30127 KB   
24154/30127 KB   
24158/30127 KB   
24162/30127 KB   
24166/30127 KB   
24170/30127 KB   
24174/30127 KB   
24178/30127 KB   
24182/30127 KB   
24186/30127 KB   
24190/30127 KB   
24194/30127 KB   
24198/30127 KB   
24202/30127 KB   
24206/30127 KB   
24210/30127 KB   
24214/30127 KB   
24218/30127 KB   
24222/30127 KB   
24226/30127 KB   
24230/30127 KB   
24234/30127 KB   
24238/30127 KB   
24242/30127 KB   
24246/30127 KB   
24250/30127 KB   
24254/30127 KB   
24258/30127 KB   
24262/30127 KB   
24266/30127 KB   
24270/30127 KB   
24274/30127 KB   
24278/30127 KB   
24282/30127 KB   
24286/30127 KB   
24290/30127 KB   
24294/30127 KB   
24298/30127 KB   
24302/30127 KB   
24306/30127 KB   
24310/30127 KB   
24314/30127 KB   
24318/30127 KB   
24322/30127 KB   
24326/30127 KB   
24330/30127 KB   
24334/30127 KB   
24338/30127 KB   
24342/30127 KB   
24346/30127 KB   
24350/30127 KB   
24354/30127 KB   
24358/30127 KB   
24362/30127 KB   
24366/30127 KB   
24370/30127 KB   
24374/30127 KB   
24378/30127 KB   
24382/30127 KB   
24386/30127 KB   
24390/30127 KB   
24394/30127 KB   
24398/30127 KB   
24402/30127 KB   
24406/30127 KB   
24410/30127 KB   
24414/30127 KB   
24418/30127 KB   
24422/30127 KB   
24426/30127 KB   
24430/30127 KB   
24434/30127 KB   
24438/30127 KB   
24442/30127 KB   
24446/30127 KB   
24450/30127 KB   
24454/30127 KB   
24458/30127 KB   
24462/30127 KB   
24466/30127 KB   
24470/30127 KB   
24474/30127 KB   
24478/30127 KB   
24482/30127 KB   
24486/30127 KB   
24490/30127 KB   
24494/30127 KB   
24498/30127 KB   
24502/30127 KB   
24506/30127 KB   
24510/30127 KB   
24514/30127 KB   
24518/30127 KB   
24522/30127 KB   
24526/30127 KB   
24530/30127 KB   
24534/30127 KB   
24538/30127 KB   
24542/30127 KB   
24546/30127 KB   
24550/30127 KB   
24554/30127 KB   
24558/30127 KB   
24562/30127 KB   
24566/30127 KB   
24570/30127 KB   
24574/30127 KB   
24578/30127 KB   
24582/30127 KB   
24586/30127 KB   
24590/30127 KB   
24594/30127 KB   
24598/30127 KB   
24602/30127 KB   
24606/30127 KB   
24610/30127 KB   
24614/30127 KB   
24618/30127 KB   
24622/30127 KB   
24626/30127 KB   
24630/30127 KB   
24634/30127 KB   
24638/30127 KB   
24642/30127 KB   
24646/30127 KB   
24650/30127 KB   
24654/30127 KB   
24658/30127 KB   
24662/30127 KB   
24666/30127 KB   
24670/30127 KB   
24674/30127 KB   
24678/30127 KB   
24682/30127 KB   
24686/30127 KB   
24690/30127 KB   
24694/30127 KB   
24698/30127 KB   
24702/30127 KB   
24706/30127 KB   
24710/30127 KB   
24714/30127 KB   
24718/30127 KB   
24722/30127 KB   
24726/30127 KB   
24730/30127 KB   
24734/30127 KB   
24738/30127 KB   
24742/30127 KB   
24746/30127 KB   
24750/30127 KB   
24754/30127 KB   
24758/30127 KB   
24762/30127 KB   
24766/30127 KB   
24770/30127 KB   
24774/30127 KB   
24778/30127 KB   
24782/30127 KB   
24786/30127 KB   
24790/30127 KB   
24794/30127 KB   
24798/30127 KB   
24802/30127 KB   
24806/30127 KB   
24810/30127 KB   
24814/30127 KB   
24818/30127 KB   
24822/30127 KB   
24826/30127 KB   
24830/30127 KB   
24834/30127 KB   
24838/30127 KB   
24842/30127 KB   
24846/30127 KB   
24850/30127 KB   
24854/30127 KB   
24858/30127 KB   
24862/30127 KB   
24866/30127 KB   
24870/30127 KB   
24874/30127 KB   
24878/30127 KB   
24882/30127 KB   
24886/30127 KB   
24890/30127 KB   
24894/30127 KB   
24898/30127 KB   
24902/30127 KB   
24906/30127 KB   
24910/30127 KB   
24914/30127 KB   
24918/30127 KB   
24922/30127 KB   
24926/30127 KB   
24930/30127 KB   
24934/30127 KB   
24938/30127 KB   
24942/30127 KB   
24946/30127 KB   
24950/30127 KB   
24954/30127 KB   
24958/30127 KB   
24962/30127 KB   
24966/30127 KB   
24970/30127 KB   
24974/30127 KB   
24978/30127 KB   
24982/30127 KB   
24986/30127 KB   
24990/30127 KB   
24994/30127 KB   
24998/30127 KB   
25002/30127 KB   
25006/30127 KB   
25010/30127 KB   
25014/30127 KB   
25018/30127 KB   
25022/30127 KB   
25026/30127 KB   
25030/30127 KB   
25034/30127 KB   
25038/30127 KB   
25042/30127 KB   
25046/30127 KB   
25050/30127 KB   
25054/30127 KB   
25058/30127 KB   
25062/30127 KB   
25066/30127 KB   
25070/30127 KB   
25074/30127 KB   
25078/30127 KB   
25082/30127 KB   
25086/30127 KB   
25090/30127 KB   
25094/30127 KB   
25098/30127 KB   
25102/30127 KB   
25106/30127 KB   
25110/30127 KB   
25114/30127 KB   
25118/30127 KB   
25122/30127 KB   
25126/30127 KB   
25130/30127 KB   
25134/30127 KB   
25138/30127 KB   
25142/30127 KB   
25146/30127 KB   
25150/30127 KB   
25154/30127 KB   
25158/30127 KB   
25162/30127 KB   
25166/30127 KB   
25170/30127 KB   
25174/30127 KB   
25178/30127 KB   
25182/30127 KB   
25186/30127 KB   
25190/30127 KB   
25194/30127 KB   
25198/30127 KB   
25202/30127 KB   
25206/30127 KB   
25210/30127 KB   
25214/30127 KB   
25218/30127 KB   
25222/30127 KB   
25226/30127 KB   
25230/30127 KB   
25234/30127 KB   
25238/30127 KB   
25242/30127 KB   
25246/30127 KB   
25250/30127 KB   
25254/30127 KB   
25258/30127 KB   
25262/30127 KB   
25266/30127 KB   
25270/30127 KB   
25274/30127 KB   
25278/30127 KB   
25282/30127 KB   
25286/30127 KB   
25290/30127 KB   
25294/30127 KB   
25298/30127 KB   
25302/30127 KB   
25306/30127 KB   
25310/30127 KB   
25314/30127 KB   
25318/30127 KB   
25322/30127 KB   
25326/30127 KB   
25330/30127 KB   
25334/30127 KB   
25338/30127 KB   
25342/30127 KB   
25346/30127 KB   
25350/30127 KB   
25354/30127 KB   
25358/30127 KB   
25362/30127 KB   
25366/30127 KB   
25370/30127 KB   
25374/30127 KB   
25378/30127 KB   
25382/30127 KB   
25386/30127 KB   
25390/30127 KB   
25394/30127 KB   
25398/30127 KB   
25402/30127 KB   
25406/30127 KB   
25410/30127 KB   
25414/30127 KB   
25418/30127 KB   
25422/30127 KB   
25426/30127 KB   
25430/30127 KB   
25434/30127 KB   
25438/30127 KB   
25442/30127 KB   
25446/30127 KB   
25450/30127 KB   
25454/30127 KB   
25458/30127 KB   
25462/30127 KB   
25466/30127 KB   
25470/30127 KB   
25474/30127 KB   
25478/30127 KB   
25482/30127 KB   
25486/30127 KB   
25490/30127 KB   
25494/30127 KB   
25498/30127 KB   
25502/30127 KB   
25506/30127 KB   
25510/30127 KB   
25514/30127 KB   
25518/30127 KB   
25522/30127 KB   
25526/30127 KB   
25530/30127 KB   
25534/30127 KB   
25538/30127 KB   
25542/30127 KB   
25546/30127 KB   
25550/30127 KB   
25554/30127 KB   
25558/30127 KB   
25562/30127 KB   
25566/30127 KB   
25570/30127 KB   
25574/30127 KB   
25578/30127 KB   
25582/30127 KB   
25586/30127 KB   
25590/30127 KB   
25594/30127 KB   
25598/30127 KB   
25602/30127 KB   
25606/30127 KB   
25610/30127 KB   
25614/30127 KB   
25618/30127 KB   
25622/30127 KB   
25626/30127 KB   
25630/30127 KB   
25634/30127 KB   
25638/30127 KB   
25642/30127 KB   
25646/30127 KB   
25650/30127 KB   
25654/30127 KB   
25658/30127 KB   
25662/30127 KB   
25666/30127 KB   
25670/30127 KB   
25674/30127 KB   
25678/30127 KB   
25682/30127 KB   
25686/30127 KB   
25690/30127 KB   
25694/30127 KB   
25698/30127 KB   
25702/30127 KB   
25706/30127 KB   
25710/30127 KB   
25714/30127 KB   
25718/30127 KB   
25722/30127 KB   
25726/30127 KB   
25730/30127 KB   
25734/30127 KB   
25738/30127 KB   
25742/30127 KB   
25746/30127 KB   
25750/30127 KB   
25754/30127 KB   
25758/30127 KB   
25762/30127 KB   
25766/30127 KB   
25770/30127 KB   
25774/30127 KB   
25778/30127 KB   
25782/30127 KB   
25786/30127 KB   
25790/30127 KB   
25794/30127 KB   
25798/30127 KB   
25802/30127 KB   
25806/30127 KB   
25810/30127 KB   
25814/30127 KB   
25818/30127 KB   
25822/30127 KB   
25826/30127 KB   
25830/30127 KB   
25834/30127 KB   
25838/30127 KB   
25842/30127 KB   
25846/30127 KB   
25850/30127 KB   
25854/30127 KB   
25858/30127 KB   
25862/30127 KB   
25866/30127 KB   
25870/30127 KB   
25874/30127 KB   
25878/30127 KB   
25882/30127 KB   
25886/30127 KB   
25890/30127 KB   
25894/30127 KB   
25898/30127 KB   
25902/30127 KB   
25906/30127 KB   
25910/30127 KB   
25914/30127 KB   
25918/30127 KB   
25922/30127 KB   
25926/30127 KB   
25930/30127 KB   
25934/30127 KB   
25938/30127 KB   
25942/30127 KB   
25946/30127 KB   
25950/30127 KB   
25954/30127 KB   
25958/30127 KB   
25962/30127 KB   
25966/30127 KB   
25970/30127 KB   
25974/30127 KB   
25978/30127 KB   
25982/30127 KB   
25986/30127 KB   
25990/30127 KB   
25994/30127 KB   
25998/30127 KB   
26002/30127 KB   
26006/30127 KB   
26010/30127 KB   
26014/30127 KB   
26018/30127 KB   
26022/30127 KB   
26026/30127 KB   
26030/30127 KB   
26034/30127 KB   
26038/30127 KB   
26042/30127 KB   
26046/30127 KB   
26050/30127 KB   
26054/30127 KB   
26058/30127 KB   
26062/30127 KB   
26066/30127 KB   
26070/30127 KB   
26074/30127 KB   
26078/30127 KB   
26082/30127 KB   
26086/30127 KB   
26090/30127 KB   
26094/30127 KB   
26098/30127 KB   
26102/30127 KB   
26106/30127 KB   
26110/30127 KB   
26114/30127 KB   
26118/30127 KB   
26122/30127 KB   
26126/30127 KB   
26130/30127 KB   
26134/30127 KB   
26138/30127 KB   
26142/30127 KB   
26146/30127 KB   
26150/30127 KB   
26154/30127 KB   
26158/30127 KB   
26162/30127 KB   
26166/30127 KB   
26170/30127 KB   
26174/30127 KB   
26178/30127 KB   
26182/30127 KB   
26186/30127 KB   
26190/30127 KB   
26194/30127 KB   
26198/30127 KB   
26202/30127 KB   
26206/30127 KB   
26210/30127 KB   
26214/30127 KB   
26218/30127 KB   
26222/30127 KB   
26226/30127 KB   
26230/30127 KB   
26234/30127 KB   
26238/30127 KB   
26242/30127 KB   
26246/30127 KB   
26250/30127 KB   
26254/30127 KB   
26258/30127 KB   
26262/30127 KB   
26266/30127 KB   
26270/30127 KB   
26274/30127 KB   
26278/30127 KB   
26282/30127 KB   
26286/30127 KB   
26290/30127 KB   
26294/30127 KB   
26298/30127 KB   
26302/30127 KB   
26306/30127 KB   
26310/30127 KB   
26314/30127 KB   
26318/30127 KB   
26322/30127 KB   
26326/30127 KB   
26330/30127 KB   
26334/30127 KB   
26338/30127 KB   
26342/30127 KB   
26346/30127 KB   
26350/30127 KB   
26354/30127 KB   
26358/30127 KB   
26362/30127 KB   
26366/30127 KB   
26370/30127 KB   
26374/30127 KB   
26378/30127 KB   
26382/30127 KB   
26386/30127 KB   
26390/30127 KB   
26394/30127 KB   
26398/30127 KB   
26402/30127 KB   
26406/30127 KB   
26410/30127 KB   
26414/30127 KB   
26418/30127 KB   
26422/30127 KB   
26426/30127 KB   
26430/30127 KB   
26434/30127 KB   
26438/30127 KB   
26442/30127 KB   
26446/30127 KB   
26450/30127 KB   
26454/30127 KB   
26458/30127 KB   
26462/30127 KB   
26466/30127 KB   
26470/30127 KB   
26474/30127 KB   
26478/30127 KB   
26482/30127 KB   
26486/30127 KB   
26490/30127 KB   
26494/30127 KB   
26498/30127 KB   
26502/30127 KB   
26506/30127 KB   
26510/30127 KB   
26514/30127 KB   
26518/30127 KB   
26522/30127 KB   
26526/30127 KB   
26530/30127 KB   
26534/30127 KB   
26538/30127 KB   
26542/30127 KB   
26546/30127 KB   
26550/30127 KB   
26554/30127 KB   
26558/30127 KB   
26562/30127 KB   
26566/30127 KB   
26570/30127 KB   
26574/30127 KB   
26578/30127 KB   
26582/30127 KB   
26586/30127 KB   
26590/30127 KB   
26594/30127 KB   
26598/30127 KB   
26602/30127 KB   
26606/30127 KB   
26610/30127 KB   
26614/30127 KB   
26618/30127 KB   
26622/30127 KB   
26626/30127 KB   
26630/30127 KB   
26634/30127 KB   
26638/30127 KB   
26642/30127 KB   
26646/30127 KB   
26650/30127 KB   
26654/30127 KB   
26658/30127 KB   
26662/30127 KB   
26666/30127 KB   
26670/30127 KB   
26674/30127 KB   
26678/30127 KB   
26682/30127 KB   
26686/30127 KB   
26690/30127 KB   
26694/30127 KB   
26698/30127 KB   
26702/30127 KB   
26706/30127 KB   
26710/30127 KB   
26714/30127 KB   
26718/30127 KB   
26722/30127 KB   
26726/30127 KB   
26730/30127 KB   
26734/30127 KB   
26738/30127 KB   
26742/30127 KB   
26746/30127 KB   
26750/30127 KB   
26754/30127 KB   
26758/30127 KB   
26762/30127 KB   
26766/30127 KB   
26770/30127 KB   
26774/30127 KB   
26778/30127 KB   
26782/30127 KB   
26786/30127 KB   
26790/30127 KB   
26794/30127 KB   
26798/30127 KB   
26802/30127 KB   
26806/30127 KB   
26810/30127 KB   
26814/30127 KB   
26818/30127 KB   
26822/30127 KB   
26826/30127 KB   
26830/30127 KB   
26834/30127 KB   
26838/30127 KB   
26842/30127 KB   
26846/30127 KB   
26850/30127 KB   
26854/30127 KB   
26858/30127 KB   
26862/30127 KB   
26866/30127 KB   
26870/30127 KB   
26874/30127 KB   
26878/30127 KB   
26882/30127 KB   
26886/30127 KB   
26890/30127 KB   
26894/30127 KB   
26898/30127 KB   
26902/30127 KB   
26906/30127 KB   
26910/30127 KB   
26914/30127 KB   
26918/30127 KB   
26922/30127 KB   
26926/30127 KB   
26930/30127 KB   
26934/30127 KB   
26938/30127 KB   
26942/30127 KB   
26946/30127 KB   
26950/30127 KB   
26954/30127 KB   
26958/30127 KB   
26962/30127 KB   
26966/30127 KB   
26970/30127 KB   
26974/30127 KB   
26978/30127 KB   
26982/30127 KB   
26986/30127 KB   
26990/30127 KB   
26994/30127 KB   
26998/30127 KB   
27002/30127 KB   
27006/30127 KB   
27010/30127 KB   
27014/30127 KB   
27018/30127 KB   
27022/30127 KB   
27026/30127 KB   
27030/30127 KB   
27034/30127 KB   
27038/30127 KB   
27042/30127 KB   
27046/30127 KB   
27050/30127 KB   
27054/30127 KB   
27058/30127 KB   
27062/30127 KB   
27066/30127 KB   
27070/30127 KB   
27074/30127 KB   
27078/30127 KB   
27082/30127 KB   
27086/30127 KB   
27090/30127 KB   
27094/30127 KB   
27098/30127 KB   
27102/30127 KB   
27106/30127 KB   
27110/30127 KB   
27114/30127 KB   
27118/30127 KB   
27122/30127 KB   
27126/30127 KB   
27130/30127 KB   
27134/30127 KB   
27138/30127 KB   
27142/30127 KB   
27146/30127 KB   
27150/30127 KB   
27154/30127 KB   
27158/30127 KB   
27162/30127 KB   
27166/30127 KB   
27170/30127 KB   
27174/30127 KB   
27178/30127 KB   
27182/30127 KB   
27186/30127 KB   
27190/30127 KB   
27194/30127 KB   
27198/30127 KB   
27202/30127 KB   
27206/30127 KB   
27210/30127 KB   
27214/30127 KB   
27218/30127 KB   
27222/30127 KB   
27226/30127 KB   
27230/30127 KB   
27234/30127 KB   
27238/30127 KB   
27242/30127 KB   
27246/30127 KB   
27250/30127 KB   
27254/30127 KB   
27258/30127 KB   
27262/30127 KB   
27266/30127 KB   
27270/30127 KB   
27274/30127 KB   
27278/30127 KB   
27282/30127 KB   
27286/30127 KB   
27290/30127 KB   
27294/30127 KB   
27298/30127 KB   
27302/30127 KB   
27306/30127 KB   
27310/30127 KB   
27314/30127 KB   
27318/30127 KB   
27322/30127 KB   
27326/30127 KB   
27330/30127 KB   
27334/30127 KB   
27338/30127 KB   
27342/30127 KB   
27346/30127 KB   
27350/30127 KB   
27354/30127 KB   
27358/30127 KB   
27362/30127 KB   
27366/30127 KB   
27370/30127 KB   
27374/30127 KB   
27378/30127 KB   
27382/30127 KB   
27386/30127 KB   
27390/30127 KB   
27394/30127 KB   
27398/30127 KB   
27402/30127 KB   
27406/30127 KB   
27410/30127 KB   
27414/30127 KB   
27418/30127 KB   
27422/30127 KB   
27426/30127 KB   
27430/30127 KB   
27434/30127 KB   
27438/30127 KB   
27442/30127 KB   
27446/30127 KB   
27450/30127 KB   
27454/30127 KB   
27458/30127 KB   
27462/30127 KB   
27466/30127 KB   
27470/30127 KB   
27474/30127 KB   
27478/30127 KB   
27482/30127 KB   
27486/30127 KB   
27490/30127 KB   
27494/30127 KB   
27498/30127 KB   
27502/30127 KB   
27506/30127 KB   
27510/30127 KB   
27514/30127 KB   
27518/30127 KB   
27522/30127 KB   
27526/30127 KB   
27530/30127 KB   
27534/30127 KB   
27538/30127 KB   
27542/30127 KB   
27546/30127 KB   
27550/30127 KB   
27554/30127 KB   
27558/30127 KB   
27562/30127 KB   
27566/30127 KB   
27570/30127 KB   
27574/30127 KB   
27578/30127 KB   
27582/30127 KB   
27586/30127 KB   
27590/30127 KB   
27594/30127 KB   
27598/30127 KB   
27602/30127 KB   
27606/30127 KB   
27610/30127 KB   
27614/30127 KB   
27618/30127 KB   
27622/30127 KB   
27626/30127 KB   
27630/30127 KB   
27634/30127 KB   
27638/30127 KB   
27642/30127 KB   
27646/30127 KB   
27650/30127 KB   
27654/30127 KB   
27658/30127 KB   
27662/30127 KB   
27666/30127 KB   
27670/30127 KB   
27674/30127 KB   
27678/30127 KB   
27682/30127 KB   
27686/30127 KB   
27690/30127 KB   
27694/30127 KB   
27698/30127 KB   
27702/30127 KB   
27706/30127 KB   
27710/30127 KB   
27714/30127 KB   
27718/30127 KB   
27722/30127 KB   
27726/30127 KB   
27730/30127 KB   
27734/30127 KB   
27738/30127 KB   
27742/30127 KB   
27746/30127 KB   
27750/30127 KB   
27754/30127 KB   
27758/30127 KB   
27762/30127 KB   
27766/30127 KB   
27770/30127 KB   
27774/30127 KB   
27778/30127 KB   
27782/30127 KB   
27786/30127 KB   
27790/30127 KB   
27794/30127 KB   
27798/30127 KB   
27802/30127 KB   
27806/30127 KB   
27810/30127 KB   
27814/30127 KB   
27818/30127 KB   
27822/30127 KB   
27826/30127 KB   
27830/30127 KB   
27834/30127 KB   
27838/30127 KB   
27842/30127 KB   
27846/30127 KB   
27850/30127 KB   
27854/30127 KB   
27858/30127 KB   
27862/30127 KB   
27866/30127 KB   
27870/30127 KB   
27874/30127 KB   
27878/30127 KB   
27882/30127 KB   
27886/30127 KB   
27890/30127 KB   
27894/30127 KB   
27898/30127 KB   
27902/30127 KB   
27906/30127 KB   
27910/30127 KB   
27914/30127 KB   
27918/30127 KB   
27922/30127 KB   
27926/30127 KB   
27930/30127 KB   
27934/30127 KB   
27938/30127 KB   
27942/30127 KB   
27946/30127 KB   
27950/30127 KB   
27954/30127 KB   
27958/30127 KB   
27962/30127 KB   
27966/30127 KB   
27970/30127 KB   
27974/30127 KB   
27978/30127 KB   
27982/30127 KB   
27986/30127 KB   
27990/30127 KB   
27994/30127 KB   
27998/30127 KB   
28002/30127 KB   
28006/30127 KB   
28010/30127 KB   
28014/30127 KB   
28018/30127 KB   
28022/30127 KB   
28026/30127 KB   
28030/30127 KB   
28034/30127 KB   
28038/30127 KB   
28042/30127 KB   
28046/30127 KB   
28050/30127 KB   
28054/30127 KB   
28058/30127 KB   
28062/30127 KB   
28066/30127 KB   
28070/30127 KB   
28074/30127 KB   
28078/30127 KB   
28082/30127 KB   
28086/30127 KB   
28090/30127 KB   
28094/30127 KB   
28098/30127 KB   
28102/30127 KB   
28106/30127 KB   
28110/30127 KB   
28114/30127 KB   
28118/30127 KB   
28122/30127 KB   
28126/30127 KB   
28130/30127 KB   
28134/30127 KB   
28138/30127 KB   
28142/30127 KB   
28146/30127 KB   
28150/30127 KB   
28154/30127 KB   
28158/30127 KB   
28162/30127 KB   
28166/30127 KB   
28170/30127 KB   
28174/30127 KB   
28178/30127 KB   
28182/30127 KB   
28186/30127 KB   
28190/30127 KB   
28194/30127 KB   
28198/30127 KB   
28202/30127 KB   
28206/30127 KB   
28210/30127 KB   
28214/30127 KB   
28218/30127 KB   
28222/30127 KB   
28226/30127 KB   
28230/30127 KB   
28234/30127 KB   
28238/30127 KB   
28242/30127 KB   
28246/30127 KB   
28250/30127 KB   
28254/30127 KB   
28258/30127 KB   
28262/30127 KB   
28266/30127 KB   
28270/30127 KB   
28274/30127 KB   
28278/30127 KB   
28282/30127 KB   
28286/30127 KB   
28290/30127 KB   
28294/30127 KB   
28298/30127 KB   
28302/30127 KB   
28306/30127 KB   
28310/30127 KB   
28314/30127 KB   
28318/30127 KB   
28322/30127 KB   
28326/30127 KB   
28330/30127 KB   
28334/30127 KB   
28338/30127 KB   
28342/30127 KB   
28346/30127 KB   
28350/30127 KB   
28354/30127 KB   
28358/30127 KB   
28362/30127 KB   
28366/30127 KB   
28370/30127 KB   
28374/30127 KB   
28378/30127 KB   
28382/30127 KB   
28386/30127 KB   
28390/30127 KB   
28394/30127 KB   
28398/30127 KB   
28402/30127 KB   
28406/30127 KB   
28410/30127 KB   
28414/30127 KB   
28418/30127 KB   
28422/30127 KB   
28426/30127 KB   
28430/30127 KB   
28434/30127 KB   
28438/30127 KB   
28442/30127 KB   
28446/30127 KB   
28450/30127 KB   
28454/30127 KB   
28458/30127 KB   
28462/30127 KB   
28466/30127 KB   
28470/30127 KB   
28474/30127 KB   
28478/30127 KB   
28482/30127 KB   
28486/30127 KB   
28490/30127 KB   
28494/30127 KB   
28498/30127 KB   
28502/30127 KB   
28506/30127 KB   
28510/30127 KB   
28514/30127 KB   
28518/30127 KB   
28522/30127 KB   
28526/30127 KB   
28530/30127 KB   
28534/30127 KB   
28538/30127 KB   
28542/30127 KB   
28546/30127 KB   
28550/30127 KB   
28554/30127 KB   
28558/30127 KB   
28562/30127 KB   
28566/30127 KB   
28570/30127 KB   
28574/30127 KB   
28578/30127 KB   
28582/30127 KB   
28586/30127 KB   
28590/30127 KB   
28594/30127 KB   
28598/30127 KB   
28602/30127 KB   
28606/30127 KB   
28610/30127 KB   
28614/30127 KB   
28618/30127 KB   
28622/30127 KB   
28626/30127 KB   
28630/30127 KB   
28634/30127 KB   
28638/30127 KB   
28642/30127 KB   
28646/30127 KB   
28650/30127 KB   
28654/30127 KB   
28658/30127 KB   
28662/30127 KB   
28666/30127 KB   
28670/30127 KB   
28674/30127 KB   
28678/30127 KB   
28682/30127 KB   
28686/30127 KB   
28690/30127 KB   
28694/30127 KB   
28698/30127 KB   
28702/30127 KB   
28706/30127 KB   
28710/30127 KB   
28714/30127 KB   
28718/30127 KB   
28722/30127 KB   
28726/30127 KB   
28730/30127 KB   
28734/30127 KB   
28738/30127 KB   
28742/30127 KB   
28746/30127 KB   
28750/30127 KB   
28754/30127 KB   
28758/30127 KB   
28762/30127 KB   
28766/30127 KB   
28770/30127 KB   
28774/30127 KB   
28778/30127 KB   
28782/30127 KB   
28786/30127 KB   
28790/30127 KB   
28794/30127 KB   
28798/30127 KB   
28802/30127 KB   
28806/30127 KB   
28810/30127 KB   
28814/30127 KB   
28818/30127 KB   
28822/30127 KB   
28826/30127 KB   
28830/30127 KB   
28834/30127 KB   
28838/30127 KB   
28842/30127 KB   
28846/30127 KB   
28850/30127 KB   
28854/30127 KB   
28858/30127 KB   
28862/30127 KB   
28866/30127 KB   
28870/30127 KB   
28874/30127 KB   
28878/30127 KB   
28882/30127 KB   
28886/30127 KB   
28890/30127 KB   
28894/30127 KB   
28898/30127 KB   
28902/30127 KB   
28906/30127 KB   
28910/30127 KB   
28914/30127 KB   
28918/30127 KB   
28922/30127 KB   
28926/30127 KB   
28930/30127 KB   
28934/30127 KB   
28938/30127 KB   
28942/30127 KB   
28946/30127 KB   
28950/30127 KB   
28954/30127 KB   
28958/30127 KB   
28962/30127 KB   
28966/30127 KB   
28970/30127 KB   
28974/30127 KB   
28978/30127 KB   
28982/30127 KB   
28986/30127 KB   
28990/30127 KB   
28994/30127 KB   
28998/30127 KB   
29002/30127 KB   
29006/30127 KB   
29010/30127 KB   
29014/30127 KB   
29018/30127 KB   
29022/30127 KB   
29026/30127 KB   
29030/30127 KB   
29034/30127 KB   
29038/30127 KB   
29042/30127 KB   
29046/30127 KB   
29050/30127 KB   
29054/30127 KB   
29058/30127 KB   
29062/30127 KB   
29066/30127 KB   
29070/30127 KB   
29074/30127 KB   
29078/30127 KB   
29082/30127 KB   
29086/30127 KB   
29090/30127 KB   
29094/30127 KB   
29098/30127 KB   
29102/30127 KB   
29106/30127 KB   
29110/30127 KB   
29114/30127 KB   
29118/30127 KB   
29122/30127 KB   
29126/30127 KB   
29130/30127 KB   
29134/30127 KB   
29138/30127 KB   
29142/30127 KB   
29146/30127 KB   
29150/30127 KB   
29154/30127 KB   
29158/30127 KB   
29162/30127 KB   
29166/30127 KB   
29170/30127 KB   
29174/30127 KB   
29178/30127 KB   
29182/30127 KB   
29186/30127 KB   
29190/30127 KB   
29194/30127 KB   
29198/30127 KB   
29202/30127 KB   
29206/30127 KB   
29210/30127 KB   
29214/30127 KB   
29218/30127 KB   
29222/30127 KB   
29226/30127 KB   
29230/30127 KB   
29234/30127 KB   
29238/30127 KB   
29242/30127 KB   
29246/30127 KB   
29250/30127 KB   
29254/30127 KB   
29258/30127 KB   
29262/30127 KB   
29266/30127 KB   
29270/30127 KB   
29274/30127 KB   
29278/30127 KB   
29282/30127 KB   
29286/30127 KB   
29290/30127 KB   
29294/30127 KB   
29298/30127 KB   
29302/30127 KB   
29306/30127 KB   
29310/30127 KB   
29314/30127 KB   
29318/30127 KB   
29322/30127 KB   
29326/30127 KB   
29330/30127 KB   
29334/30127 KB   
29338/30127 KB   
29342/30127 KB   
29346/30127 KB   
29350/30127 KB   
29354/30127 KB   
29358/30127 KB   
29362/30127 KB   
29366/30127 KB   
29370/30127 KB   
29374/30127 KB   
29378/30127 KB   
29382/30127 KB   
29386/30127 KB   
29390/30127 KB   
29394/30127 KB   
29398/30127 KB   
29402/30127 KB   
29406/30127 KB   
29410/30127 KB   
29414/30127 KB   
29418/30127 KB   
29422/30127 KB   
29426/30127 KB   
29430/30127 KB   
29434/30127 KB   
29438/30127 KB   
29442/30127 KB   
29446/30127 KB   
29450/30127 KB   
29454/30127 KB   
29458/30127 KB   
29462/30127 KB   
29466/30127 KB   
29470/30127 KB   
29474/30127 KB   
29478/30127 KB   
29482/30127 KB   
29486/30127 KB   
29490/30127 KB   
29494/30127 KB   
29498/30127 KB   
29502/30127 KB   
29506/30127 KB   
29510/30127 KB   
29514/30127 KB   
29518/30127 KB   
29522/30127 KB   
29526/30127 KB   
29530/30127 KB   
29534/30127 KB   
29538/30127 KB   
29542/30127 KB   
29546/30127 KB   
29550/30127 KB   
29554/30127 KB   
29558/30127 KB   
29562/30127 KB   
29566/30127 KB   
29570/30127 KB   
29574/30127 KB   
29578/30127 KB   
29582/30127 KB   
29586/30127 KB   
29590/30127 KB   
29594/30127 KB   
29598/30127 KB   
29602/30127 KB   
29606/30127 KB   
29610/30127 KB   
29614/30127 KB   
29618/30127 KB   
29622/30127 KB   
29626/30127 KB   
29630/30127 KB   
29634/30127 KB   
29638/30127 KB   
29642/30127 KB   
29646/30127 KB   
29650/30127 KB   
29654/30127 KB   
29658/30127 KB   
29662/30127 KB   
29666/30127 KB   
29670/30127 KB   
29674/30127 KB   
29678/30127 KB   
29682/30127 KB   
29686/30127 KB   
29690/30127 KB   
29694/30127 KB   
29698/30127 KB   
29702/30127 KB   
29706/30127 KB   
29710/30127 KB   
29714/30127 KB   
29718/30127 KB   
29722/30127 KB   
29726/30127 KB   
29730/30127 KB   
29734/30127 KB   
29738/30127 KB   
29742/30127 KB   
29746/30127 KB   
29750/30127 KB   
29754/30127 KB   
29758/30127 KB   
29762/30127 KB   
29766/30127 KB   
29770/30127 KB   
29774/30127 KB   
29778/30127 KB   
29782/30127 KB   
29786/30127 KB   
29790/30127 KB   
29794/30127 KB   
29798/30127 KB   
29802/30127 KB   
29806/30127 KB   
29810/30127 KB   
29814/30127 KB   
29818/30127 KB   
29822/30127 KB   
29826/30127 KB   
29830/30127 KB   
29834/30127 KB   
29838/30127 KB   
29842/30127 KB   
29846/30127 KB   
29850/30127 KB   
29854/30127 KB   
29858/30127 KB   
29862/30127 KB   
29866/30127 KB   
29870/30127 KB   
29874/30127 KB   
29878/30127 KB   
29882/30127 KB   
29886/30127 KB   
29890/30127 KB   
29894/30127 KB   
29898/30127 KB   
29902/30127 KB   
29906/30127 KB   
29910/30127 KB   
29914/30127 KB   
29918/30127 KB   
29922/30127 KB   
29926/30127 KB   
29930/30127 KB   
29934/30127 KB   
29938/30127 KB   
29942/30127 KB   
29946/30127 KB   
29950/30127 KB   
29954/30127 KB   
29958/30127 KB   
29962/30127 KB   
29966/30127 KB   
29970/30127 KB   
29974/30127 KB   
29978/30127 KB   
29982/30127 KB   
29986/30127 KB   
29990/30127 KB   
29994/30127 KB   
29998/30127 KB   
30002/30127 KB   
30006/30127 KB   
30010/30127 KB   
30014/30127 KB   
30018/30127 KB   
30022/30127 KB   
30026/30127 KB   
30030/30127 KB   
30034/30127 KB   
30038/30127 KB   
30042/30127 KB   
30046/30127 KB   
30050/30127 KB   
30054/30127 KB   
30058/30127 KB   
30062/30127 KB   
30066/30127 KB   
30070/30127 KB   
30074/30127 KB   
30078/30127 KB   
30082/30127 KB   
30086/30127 KB   
30090/30127 KB   
30094/30127 KB   
30098/30127 KB   
30102/30127 KB   
30106/30127 KB   
30110/30127 KB   
30114/30127 KB   
30118/30127 KB   
30122/30127 KB   
30126/30127 KB   
30127/30127 KB   
                 
Downloaded: http://maven.wso2.org/nexus/content/groups/wso2-public/org/apache/hbase/hbase-shaded-client/1.3.1/hbase-shaded-client-1.3.1.jar (30127 KB at 45924.3 KB/sec)
                 
Downloading: https://repo.maven.apache.org/maven2/org/restlet/jee/org.restlet/2.3.0/org.restlet-2.3.0.jar
Downloading: https://repo.maven.apache.org/maven2/org/restlet/jee/org.restlet.ext.servlet/2.3.0/org.restlet.ext.servlet-2.3.0.jar
Downloading: https://repo.maven.apache.org/maven2/io/moquette/moquette-broker/0.8/moquette-broker-0.8.jar
Downloading: https://repo.maven.apache.org/maven2/io/moquette/moquette-parser-commons/0.8/moquette-parser-commons-0.8.jar
Downloading: https://repo.maven.apache.org/maven2/io/moquette/moquette-netty-parser/0.8/moquette-netty-parser-0.8.jar
                 
                 
                 
                 
                 
Downloading: http://maven.restlet.org/org/restlet/jee/org.restlet/2.3.0/org.restlet-2.3.0.jar
Downloading: http://maven.restlet.org/org/restlet/jee/org.restlet.ext.servlet/2.3.0/org.restlet.ext.servlet-2.3.0.jar
4/692 KB         
8/692 KB   
12/692 KB   
14/692 KB   
18/692 KB   
22/692 KB   
26/692 KB   
30/692 KB   
34/692 KB   
38/692 KB   
42/692 KB   
42/692 KB   
42/692 KB   4/23 KB   
42/692 KB   8/23 KB   
42/692 KB   12/23 KB   
42/692 KB   14/23 KB   
46/692 KB   14/23 KB   
50/692 KB   14/23 KB   
54/692 KB   14/23 KB   
58/692 KB   14/23 KB   
62/692 KB   14/23 KB   
66/692 KB   14/23 KB   
70/692 KB   14/23 KB   
74/692 KB   14/23 KB   
78/692 KB   14/23 KB   
82/692 KB   14/23 KB   
86/692 KB   14/23 KB   
90/692 KB   14/23 KB   
94/692 KB   14/23 KB   
98/692 KB   14/23 KB   
99/692 KB   14/23 KB   
99/692 KB   17/23 KB   
99/692 KB   20/23 KB   
99/692 KB   23/23 KB   
102/692 KB   23/23 KB   
106/692 KB   23/23 KB   
108/692 KB   23/23 KB   
112/692 KB   23/23 KB   
116/692 KB   23/23 KB   
120/692 KB   23/23 KB   
124/692 KB   23/23 KB   
127/692 KB   23/23 KB   
130/692 KB   23/23 KB   
134/692 KB   23/23 KB   
138/692 KB   23/23 KB   
142/692 KB   23/23 KB   
146/692 KB   23/23 KB   
150/692 KB   23/23 KB   
153/692 KB   23/23 KB   
156/692 KB   23/23 KB   
158/692 KB   23/23 KB   
162/692 KB   23/23 KB   
164/692 KB   23/23 KB   
167/692 KB   23/23 KB   
170/692 KB   23/23 KB   
173/692 KB   23/23 KB   
175/692 KB   23/23 KB   
179/692 KB   23/23 KB   
182/692 KB   23/23 KB   
186/692 KB   23/23 KB   
187/692 KB   23/23 KB   
190/692 KB   23/23 KB   
192/692 KB   23/23 KB   
195/692 KB   23/23 KB   
198/692 KB   23/23 KB   
201/692 KB   23/23 KB   
204/692 KB   23/23 KB   
206/692 KB   23/23 KB   
209/692 KB   23/23 KB   
212/692 KB   23/23 KB   
216/692 KB   23/23 KB   
220/692 KB   23/23 KB   
224/692 KB   23/23 KB   
228/692 KB   23/23 KB   
232/692 KB   23/23 KB   
236/692 KB   23/23 KB   
240/692 KB   23/23 KB   
244/692 KB   23/23 KB   
248/692 KB   23/23 KB   
252/692 KB   23/23 KB   
256/692 KB   23/23 KB   
260/692 KB   23/23 KB   
264/692 KB   23/23 KB   
268/692 KB   23/23 KB   
272/692 KB   23/23 KB   
276/692 KB   23/23 KB   
280/692 KB   23/23 KB   
284/692 KB   23/23 KB   
288/692 KB   23/23 KB   
292/692 KB   23/23 KB   
296/692 KB   23/23 KB   
300/692 KB   23/23 KB   
304/692 KB   23/23 KB   
305/692 KB   23/23 KB   
308/692 KB   23/23 KB   
311/692 KB   23/23 KB   
314/692 KB   23/23 KB   
317/692 KB   23/23 KB   
320/692 KB   23/23 KB   
322/692 KB   23/23 KB   
325/692 KB   23/23 KB   
328/692 KB   23/23 KB   
331/692 KB   23/23 KB   
334/692 KB   23/23 KB   
337/692 KB   23/23 KB   
339/692 KB   23/23 KB   
342/692 KB   23/23 KB   
345/692 KB   23/23 KB   
348/692 KB   23/23 KB   
352/692 KB   23/23 KB   
356/692 KB   23/23 KB   
359/692 KB   23/23 KB   
362/692 KB   23/23 KB   
365/692 KB   23/23 KB   
368/692 KB   23/23 KB   
369/692 KB   23/23 KB   
373/692 KB   23/23 KB   
377/692 KB   23/23 KB   
381/692 KB   23/23 KB   
385/692 KB   23/23 KB   
389/692 KB   23/23 KB   
393/692 KB   23/23 KB   
397/692 KB   23/23 KB   
401/692 KB   23/23 KB   
405/692 KB   23/23 KB   
409/692 KB   23/23 KB   
413/692 KB   23/23 KB   
417/692 KB   23/23 KB   
421/692 KB   23/23 KB   
425/692 KB   23/23 KB   
429/692 KB   23/23 KB   
433/692 KB   23/23 KB   
436/692 KB   23/23 KB   
438/692 KB   23/23 KB   
442/692 KB   23/23 KB   
446/692 KB   23/23 KB   
450/692 KB   23/23 KB   
454/692 KB   23/23 KB   
458/692 KB   23/23 KB   
462/692 KB   23/23 KB   
466/692 KB   23/23 KB   
470/692 KB   23/23 KB   
474/692 KB   23/23 KB   
478/692 KB   23/23 KB   
482/692 KB   23/23 KB   
486/692 KB   23/23 KB   
490/692 KB   23/23 KB   
494/692 KB   23/23 KB   
498/692 KB   23/23 KB   
501/692 KB   23/23 KB   
503/692 KB   23/23 KB   
506/692 KB   23/23 KB   
509/692 KB   23/23 KB   
512/692 KB   23/23 KB   
515/692 KB   23/23 KB   
518/692 KB   23/23 KB   
520/692 KB   23/23 KB   
523/692 KB   23/23 KB   
526/692 KB   23/23 KB   
529/692 KB   23/23 KB   
532/692 KB   23/23 KB   
535/692 KB   23/23 KB   
537/692 KB   23/23 KB   
540/692 KB   23/23 KB   
543/692 KB   23/23 KB   
546/692 KB   23/23 KB   
549/692 KB   23/23 KB   
552/692 KB   23/23 KB   
554/692 KB   23/23 KB   
557/692 KB   23/23 KB   
560/692 KB   23/23 KB   
563/692 KB   23/23 KB   
566/692 KB   23/23 KB   
568/692 KB   23/23 KB   
571/692 KB   23/23 KB   
574/692 KB   23/23 KB   
578/692 KB   23/23 KB   
582/692 KB   23/23 KB   
586/692 KB   23/23 KB   
590/692 KB   23/23 KB   
594/692 KB   23/23 KB   
598/692 KB   23/23 KB   
602/692 KB   23/23 KB   
606/692 KB   23/23 KB   
610/692 KB   23/23 KB   
614/692 KB   23/23 KB   
618/692 KB   23/23 KB   
622/692 KB   23/23 KB   
626/692 KB   23/23 KB   
                        
Downloaded: http://maven.restlet.org/org/restlet/jee/org.restlet.ext.servlet/2.3.0/org.restlet.ext.servlet-2.3.0.jar (23 KB at 19.7 KB/sec)
630/692 KB              
634/692 KB   
638/692 KB   
642/692 KB   
646/692 KB   
650/692 KB   
654/692 KB   
658/692 KB   
662/692 KB   
666/692 KB   
670/692 KB   
672/692 KB   
676/692 KB   
676/692 KB   
680/692 KB   
680/692 KB   
683/692 KB   
687/692 KB   
687/692 KB   
691/692 KB   
692/692 KB   
             
Downloaded: http://maven.restlet.org/org/restlet/jee/org.restlet/2.3.0/org.restlet-2.3.0.jar (692 KB at 469.4 KB/sec)
Downloading: http://dl.bintray.com/andsel/maven/io/moquette/moquette-broker/0.8/moquette-broker-0.8.jar
Downloading: http://dl.bintray.com/andsel/maven/io/moquette/moquette-parser-commons/0.8/moquette-parser-commons-0.8.jar
Downloading: http://dl.bintray.com/andsel/maven/io/moquette/moquette-netty-parser/0.8/moquette-netty-parser-0.8.jar
4/110 KB     
8/110 KB   
12/110 KB   
14/110 KB   
14/110 KB   4/42 KB   
14/110 KB   8/42 KB   
14/110 KB   12/42 KB   
14/110 KB   14/42 KB   
18/110 KB   14/42 KB   
22/110 KB   14/42 KB   
26/110 KB   14/42 KB   
30/110 KB   14/42 KB   
34/110 KB   14/42 KB   
38/110 KB   14/42 KB   
42/110 KB   14/42 KB   
42/110 KB   14/42 KB   
42/110 KB   3/18 KB   14/42 KB   
42/110 KB   7/18 KB   14/42 KB   
42/110 KB   11/18 KB   14/42 KB   
42/110 KB   13/18 KB   14/42 KB   
42/110 KB   13/18 KB   18/42 KB   
42/110 KB   13/18 KB   22/42 KB   
42/110 KB   13/18 KB   26/42 KB   
42/110 KB   13/18 KB   30/42 KB   
42/110 KB   13/18 KB   34/42 KB   
42/110 KB   13/18 KB   38/42 KB   
42/110 KB   13/18 KB   42/42 KB   
42/110 KB   13/18 KB   42/42 KB   
45/110 KB   13/18 KB   42/42 KB   
48/110 KB   13/18 KB   42/42 KB   
52/110 KB   13/18 KB   42/42 KB   
56/110 KB   13/18 KB   42/42 KB   
60/110 KB   13/18 KB   42/42 KB   
64/110 KB   13/18 KB   42/42 KB   
68/110 KB   13/18 KB   42/42 KB   
72/110 KB   13/18 KB   42/42 KB   
76/110 KB   13/18 KB   42/42 KB   
80/110 KB   13/18 KB   42/42 KB   
84/110 KB   13/18 KB   42/42 KB   
88/110 KB   13/18 KB   42/42 KB   
92/110 KB   13/18 KB   42/42 KB   
96/110 KB   13/18 KB   42/42 KB   
99/110 KB   13/18 KB   42/42 KB   
99/110 KB   16/18 KB   42/42 KB   
99/110 KB   18/18 KB   42/42 KB   
103/110 KB   18/18 KB   42/42 KB   
107/110 KB   18/18 KB   42/42 KB   
110/110 KB   18/18 KB   42/42 KB   
                                   
                                   
Downloaded: http://dl.bintray.com/andsel/maven/io/moquette/moquette-netty-parser/0.8/moquette-netty-parser-0.8.jar (42 KB at 53.5 KB/sec)
Downloaded: http://dl.bintray.com/andsel/maven/io/moquette/moquette-parser-commons/0.8/moquette-parser-commons-0.8.jar (18 KB at 22.5 KB/sec)
                                   
Downloaded: http://dl.bintray.com/andsel/maven/io/moquette/moquette-broker/0.8/moquette-broker-0.8.jar (110 KB at 118.9 KB/sec)
[INFO] 
[INFO] --- maven-clean-plugin:3.0.0:clean (default-clean) @ org.wso2.carbon.das.jobmanager.core ---
[INFO] 
[INFO] --- maven-checkstyle-plugin:2.17:check (validate) @ org.wso2.carbon.das.jobmanager.core ---
[INFO] 
[INFO] --- buildnumber-maven-plugin:1.4:create (default) @ org.wso2.carbon.das.jobmanager.core ---
[INFO] Executing: /bin/sh -c cd '/home/jenkins/workspace/carbon-analytics-pipeline/carbon-analytics/components/org.wso2.carbon.das.jobmanager.core' && 'git' 'rev-parse' '--verify' 'HEAD'
[INFO] Working directory: /home/jenkins/workspace/carbon-analytics-pipeline/carbon-analytics/components/org.wso2.carbon.das.jobmanager.core
[INFO] Storing buildNumber: 08bd73f19f3225ccae428dd5ac887d140680f367 at timestamp: 1510817970910
[INFO] Storing buildScmBranch: master
[INFO] 
[INFO] --- jacoco-maven-plugin:0.7.8:prepare-agent (jacoco-initialize) @ org.wso2.carbon.das.jobmanager.core ---
[INFO] surefireArgLine set to -javaagent:/home/jenkins/.m2/repository/org/jacoco/org.jacoco.agent/0.7.8/org.jacoco.agent-0.7.8-runtime.jar=destfile=/home/jenkins/workspace/carbon-analytics-pipeline/carbon-analytics/components/org.wso2.carbon.das.jobmanager.core/target/coverage-reports/jacoco.exec
[INFO] 
[INFO] --- build-helper-maven-plugin:1.9.1:add-source (add-source) @ org.wso2.carbon.das.jobmanager.core ---
[INFO] Source directory: /home/jenkins/workspace/carbon-analytics-pipeline/carbon-analytics/components/org.wso2.carbon.das.jobmanager.core/src/gen/java added.
[INFO] 
[INFO] --- maven-remote-resources-plugin:1.5:process (default) @ org.wso2.carbon.das.jobmanager.core ---
[INFO] 
[INFO] --- maven-resources-plugin:2.7:resources (default-resources) @ org.wso2.carbon.das.jobmanager.core ---
[WARNING] Using platform encoding (ANSI_X3.4-1968 actually) to copy filtered resources, i.e. build is platform dependent!
[INFO] Copying 1 resource
[INFO] Copying 3 resources
[INFO] 
[INFO] --- maven-compiler-plugin:3.5.1:compile (default-compile) @ org.wso2.carbon.das.jobmanager.core ---
[INFO] Changes detected - recompiling the module!
[WARNING] File encoding has not been set, using platform encoding ANSI_X3.4-1968, i.e. build is platform dependent!
[INFO] Compiling 58 source files to /home/jenkins/workspace/carbon-analytics-pipeline/carbon-analytics/components/org.wso2.carbon.das.jobmanager.core/target/classes
[INFO] 
[INFO] >>> findbugs-maven-plugin:3.0.3:check (analyze-compile) > :findbugs @ org.wso2.carbon.das.jobmanager.core >>>
[INFO] 
[INFO] --- findbugs-maven-plugin:3.0.3:findbugs (findbugs) @ org.wso2.carbon.das.jobmanager.core ---
[INFO] 
[INFO] <<< findbugs-maven-plugin:3.0.3:check (analyze-compile) < :findbugs @ org.wso2.carbon.das.jobmanager.core <<<
[INFO] 
[INFO] --- findbugs-maven-plugin:3.0.3:check (analyze-compile) @ org.wso2.carbon.das.jobmanager.core ---
[INFO] 
[INFO] --- maven-resources-plugin:2.7:testResources (default-testResources) @ org.wso2.carbon.das.jobmanager.core ---
[INFO] Not copying test resources
[INFO] 
[INFO] --- maven-compiler-plugin:3.5.1:testCompile (default-testCompile) @ org.wso2.carbon.das.jobmanager.core ---
[INFO] Not compiling test sources
[INFO] 
[INFO] --- maven-surefire-plugin:2.19.1:test (default-test) @ org.wso2.carbon.das.jobmanager.core ---
[INFO] Tests are skipped.
[INFO] 
[INFO] >>> maven-bundle-plugin:2.5.4:bundle (default-bundle) > package @ org.wso2.carbon.das.jobmanager.core >>>
[INFO] 
[INFO] --- maven-checkstyle-plugin:2.17:check (validate) @ org.wso2.carbon.das.jobmanager.core ---
[INFO] 
[INFO] --- buildnumber-maven-plugin:1.4:create (default) @ org.wso2.carbon.das.jobmanager.core ---
[INFO] Executing: /bin/sh -c cd '/home/jenkins/workspace/carbon-analytics-pipeline/carbon-analytics/components/org.wso2.carbon.das.jobmanager.core' && 'git' 'rev-parse' '--verify' 'HEAD'
[INFO] Working directory: /home/jenkins/workspace/carbon-analytics-pipeline/carbon-analytics/components/org.wso2.carbon.das.jobmanager.core
[INFO] Storing buildNumber: 08bd73f19f3225ccae428dd5ac887d140680f367 at timestamp: 1510817975431
[INFO] Storing buildScmBranch: master
[INFO] 
[INFO] --- jacoco-maven-plugin:0.7.8:prepare-agent (jacoco-initialize) @ org.wso2.carbon.das.jobmanager.core ---
[INFO] surefireArgLine set to -javaagent:/home/jenkins/.m2/repository/org/jacoco/org.jacoco.agent/0.7.8/org.jacoco.agent-0.7.8-runtime.jar=destfile=/home/jenkins/workspace/carbon-analytics-pipeline/carbon-analytics/components/org.wso2.carbon.das.jobmanager.core/target/coverage-reports/jacoco.exec
[INFO] 
[INFO] --- build-helper-maven-plugin:1.9.1:add-source (add-source) @ org.wso2.carbon.das.jobmanager.core ---
[INFO] Source directory: /home/jenkins/workspace/carbon-analytics-pipeline/carbon-analytics/components/org.wso2.carbon.das.jobmanager.core/src/gen/java added.
[INFO] 
[INFO] --- maven-remote-resources-plugin:1.5:process (default) @ org.wso2.carbon.das.jobmanager.core ---
[INFO] 
[INFO] --- maven-resources-plugin:2.7:resources (default-resources) @ org.wso2.carbon.das.jobmanager.core ---
[WARNING] Using platform encoding (ANSI_X3.4-1968 actually) to copy filtered resources, i.e. build is platform dependent!
[INFO] Copying 1 resource
[INFO] Copying 3 resources
[INFO] Copying 3 resources
[INFO] 
[INFO] --- maven-compiler-plugin:3.5.1:compile (default-compile) @ org.wso2.carbon.das.jobmanager.core ---
[INFO] Nothing to compile - all classes are up to date
[INFO] 
[INFO] >>> findbugs-maven-plugin:3.0.3:check (analyze-compile) > :findbugs @ org.wso2.carbon.das.jobmanager.core >>>
[INFO] 
[INFO] --- findbugs-maven-plugin:3.0.3:findbugs (findbugs) @ org.wso2.carbon.das.jobmanager.core ---
[INFO] 
[INFO] <<< findbugs-maven-plugin:3.0.3:check (analyze-compile) < :findbugs @ org.wso2.carbon.das.jobmanager.core <<<
[INFO] 
[INFO] --- findbugs-maven-plugin:3.0.3:check (analyze-compile) @ org.wso2.carbon.das.jobmanager.core ---
[INFO] 
[INFO] --- maven-resources-plugin:2.7:testResources (default-testResources) @ org.wso2.carbon.das.jobmanager.core ---
[INFO] Not copying test resources
[INFO] 
[INFO] --- maven-compiler-plugin:3.5.1:testCompile (default-testCompile) @ org.wso2.carbon.das.jobmanager.core ---
[INFO] Not compiling test sources
[INFO] 
[INFO] --- maven-surefire-plugin:2.19.1:test (default-test) @ org.wso2.carbon.das.jobmanager.core ---
[INFO] Tests are skipped.
[INFO] 
[INFO] <<< maven-bundle-plugin:2.5.4:bundle (default-bundle) < package @ org.wso2.carbon.das.jobmanager.core <<<
[INFO] 
[INFO] --- maven-bundle-plugin:2.5.4:bundle (default-bundle) @ org.wso2.carbon.das.jobmanager.core ---
[INFO] 
[INFO] --- jacoco-maven-plugin:0.7.8:report (jacoco-site) @ org.wso2.carbon.das.jobmanager.core ---
[INFO] Skipping JaCoCo execution due to missing execution data file.
[INFO] 
[INFO] --- maven-install-plugin:2.5.2:install (default-install) @ org.wso2.carbon.das.jobmanager.core ---
[INFO] Installing /home/jenkins/workspace/carbon-analytics-pipeline/carbon-analytics/components/org.wso2.carbon.das.jobmanager.core/target/org.wso2.carbon.das.jobmanager.core-2.0.145-SNAPSHOT.jar to /home/jenkins/.m2/repository/org/wso2/carbon/analytics/org.wso2.carbon.das.jobmanager.core/2.0.145-SNAPSHOT/org.wso2.carbon.das.jobmanager.core-2.0.145-SNAPSHOT.jar
[INFO] Installing /home/jenkins/workspace/carbon-analytics-pipeline/carbon-analytics/components/org.wso2.carbon.das.jobmanager.core/pom.xml to /home/jenkins/.m2/repository/org/wso2/carbon/analytics/org.wso2.carbon.das.jobmanager.core/2.0.145-SNAPSHOT/org.wso2.carbon.das.jobmanager.core-2.0.145-SNAPSHOT.pom
[INFO] 
[INFO] >>> maven-bundle-plugin:2.5.4:install (default-install) > install @ org.wso2.carbon.das.jobmanager.core >>>
[INFO] 
[INFO] --- maven-checkstyle-plugin:2.17:check (validate) @ org.wso2.carbon.das.jobmanager.core ---
[INFO] 
[INFO] --- buildnumber-maven-plugin:1.4:create (default) @ org.wso2.carbon.das.jobmanager.core ---
[INFO] Executing: /bin/sh -c cd '/home/jenkins/workspace/carbon-analytics-pipeline/carbon-analytics/components/org.wso2.carbon.das.jobmanager.core' && 'git' 'rev-parse' '--verify' 'HEAD'
[INFO] Working directory: /home/jenkins/workspace/carbon-analytics-pipeline/carbon-analytics/components/org.wso2.carbon.das.jobmanager.core
[INFO] Storing buildNumber: 08bd73f19f3225ccae428dd5ac887d140680f367 at timestamp: 1510817978023
[INFO] Storing buildScmBranch: master
[INFO] 
[INFO] --- jacoco-maven-plugin:0.7.8:prepare-agent (jacoco-initialize) @ org.wso2.carbon.das.jobmanager.core ---
[INFO] surefireArgLine set to -javaagent:/home/jenkins/.m2/repository/org/jacoco/org.jacoco.agent/0.7.8/org.jacoco.agent-0.7.8-runtime.jar=destfile=/home/jenkins/workspace/carbon-analytics-pipeline/carbon-analytics/components/org.wso2.carbon.das.jobmanager.core/target/coverage-reports/jacoco.exec
[INFO] 
[INFO] --- build-helper-maven-plugin:1.9.1:add-source (add-source) @ org.wso2.carbon.das.jobmanager.core ---
[INFO] Source directory: /home/jenkins/workspace/carbon-analytics-pipeline/carbon-analytics/components/org.wso2.carbon.das.jobmanager.core/src/gen/java added.
[INFO] 
[INFO] --- maven-remote-resources-plugin:1.5:process (default) @ org.wso2.carbon.das.jobmanager.core ---
[INFO] 
[INFO] --- maven-resources-plugin:2.7:resources (default-resources) @ org.wso2.carbon.das.jobmanager.core ---
[WARNING] Using platform encoding (ANSI_X3.4-1968 actually) to copy filtered resources, i.e. build is platform dependent!
[INFO] Copying 1 resource
[INFO] Copying 3 resources
[INFO] Copying 3 resources
[INFO] 
[INFO] --- maven-compiler-plugin:3.5.1:compile (default-compile) @ org.wso2.carbon.das.jobmanager.core ---
[INFO] Nothing to compile - all classes are up to date
[INFO] 
[INFO] >>> findbugs-maven-plugin:3.0.3:check (analyze-compile) > :findbugs @ org.wso2.carbon.das.jobmanager.core >>>
[INFO] 
[INFO] --- findbugs-maven-plugin:3.0.3:findbugs (findbugs) @ org.wso2.carbon.das.jobmanager.core ---
[INFO] 
[INFO] <<< findbugs-maven-plugin:3.0.3:check (analyze-compile) < :findbugs @ org.wso2.carbon.das.jobmanager.core <<<
[INFO] 
[INFO] --- findbugs-maven-plugin:3.0.3:check (analyze-compile) @ org.wso2.carbon.das.jobmanager.core ---
[INFO] 
[INFO] --- maven-resources-plugin:2.7:testResources (default-testResources) @ org.wso2.carbon.das.jobmanager.core ---
[INFO] Not copying test resources
[INFO] 
[INFO] --- maven-compiler-plugin:3.5.1:testCompile (default-testCompile) @ org.wso2.carbon.das.jobmanager.core ---
[INFO] Not compiling test sources
[INFO] 
[INFO] --- maven-surefire-plugin:2.19.1:test (default-test) @ org.wso2.carbon.das.jobmanager.core ---
[INFO] Tests are skipped.
[INFO] 
[INFO] >>> maven-bundle-plugin:2.5.4:bundle (default-bundle) > package @ org.wso2.carbon.das.jobmanager.core >>>
[INFO] 
[INFO] --- maven-checkstyle-plugin:2.17:check (validate) @ org.wso2.carbon.das.jobmanager.core ---
[INFO] 
[INFO] --- buildnumber-maven-plugin:1.4:create (default) @ org.wso2.carbon.das.jobmanager.core ---
[INFO] Executing: /bin/sh -c cd '/home/jenkins/workspace/carbon-analytics-pipeline/carbon-analytics/components/org.wso2.carbon.das.jobmanager.core' && 'git' 'rev-parse' '--verify' 'HEAD'
[INFO] Working directory: /home/jenkins/workspace/carbon-analytics-pipeline/carbon-analytics/components/org.wso2.carbon.das.jobmanager.core
[INFO] Storing buildNumber: 08bd73f19f3225ccae428dd5ac887d140680f367 at timestamp: 1510817979883
[INFO] Storing buildScmBranch: master
[INFO] 
[INFO] --- jacoco-maven-plugin:0.7.8:prepare-agent (jacoco-initialize) @ org.wso2.carbon.das.jobmanager.core ---
[INFO] surefireArgLine set to -javaagent:/home/jenkins/.m2/repository/org/jacoco/org.jacoco.agent/0.7.8/org.jacoco.agent-0.7.8-runtime.jar=destfile=/home/jenkins/workspace/carbon-analytics-pipeline/carbon-analytics/components/org.wso2.carbon.das.jobmanager.core/target/coverage-reports/jacoco.exec
[INFO] 
[INFO] --- build-helper-maven-plugin:1.9.1:add-source (add-source) @ org.wso2.carbon.das.jobmanager.core ---
[INFO] Source directory: /home/jenkins/workspace/carbon-analytics-pipeline/carbon-analytics/components/org.wso2.carbon.das.jobmanager.core/src/gen/java added.
[INFO] 
[INFO] --- maven-remote-resources-plugin:1.5:process (default) @ org.wso2.carbon.das.jobmanager.core ---
[INFO] 
[INFO] --- maven-resources-plugin:2.7:resources (default-resources) @ org.wso2.carbon.das.jobmanager.core ---
[WARNING] Using platform encoding (ANSI_X3.4-1968 actually) to copy filtered resources, i.e. build is platform dependent!
[INFO] Copying 1 resource
[INFO] Copying 3 resources
[INFO] Copying 3 resources
[INFO] Copying 3 resources
[INFO] 
[INFO] --- maven-compiler-plugin:3.5.1:compile (default-compile) @ org.wso2.carbon.das.jobmanager.core ---
[INFO] Nothing to compile - all classes are up to date
[INFO] 
[INFO] >>> findbugs-maven-plugin:3.0.3:check (analyze-compile) > :findbugs @ org.wso2.carbon.das.jobmanager.core >>>
[INFO] 
[INFO] --- findbugs-maven-plugin:3.0.3:findbugs (findbugs) @ org.wso2.carbon.das.jobmanager.core ---
[INFO] 
[INFO] <<< findbugs-maven-plugin:3.0.3:check (analyze-compile) < :findbugs @ org.wso2.carbon.das.jobmanager.core <<<
[INFO] 
[INFO] --- findbugs-maven-plugin:3.0.3:check (analyze-compile) @ org.wso2.carbon.das.jobmanager.core ---
[INFO] 
[INFO] --- maven-resources-plugin:2.7:testResources (default-testResources) @ org.wso2.carbon.das.jobmanager.core ---
[INFO] Not copying test resources
[INFO] 
[INFO] --- maven-compiler-plugin:3.5.1:testCompile (default-testCompile) @ org.wso2.carbon.das.jobmanager.core ---
[INFO] Not compiling test sources
[INFO] 
[INFO] --- maven-surefire-plugin:2.19.1:test (default-test) @ org.wso2.carbon.das.jobmanager.core ---
[INFO] Tests are skipped.
[INFO] 
[INFO] <<< maven-bundle-plugin:2.5.4:bundle (default-bundle) < package @ org.wso2.carbon.das.jobmanager.core <<<
[INFO] 
[INFO] --- maven-bundle-plugin:2.5.4:bundle (default-bundle) @ org.wso2.carbon.das.jobmanager.core ---
[INFO] 
[INFO] --- jacoco-maven-plugin:0.7.8:report (jacoco-site) @ org.wso2.carbon.das.jobmanager.core ---
[INFO] Skipping JaCoCo execution due to missing execution data file.
[INFO] 
[INFO] --- maven-install-plugin:2.5.2:install (default-install) @ org.wso2.carbon.das.jobmanager.core ---
[INFO] Installing /home/jenkins/workspace/carbon-analytics-pipeline/carbon-analytics/components/org.wso2.carbon.das.jobmanager.core/target/org.wso2.carbon.das.jobmanager.core-2.0.145-SNAPSHOT.jar to /home/jenkins/.m2/repository/org/wso2/carbon/analytics/org.wso2.carbon.das.jobmanager.core/2.0.145-SNAPSHOT/org.wso2.carbon.das.jobmanager.core-2.0.145-SNAPSHOT.jar
[INFO] Installing /home/jenkins/workspace/carbon-analytics-pipeline/carbon-analytics/components/org.wso2.carbon.das.jobmanager.core/pom.xml to /home/jenkins/.m2/repository/org/wso2/carbon/analytics/org.wso2.carbon.das.jobmanager.core/2.0.145-SNAPSHOT/org.wso2.carbon.das.jobmanager.core-2.0.145-SNAPSHOT.pom
[INFO] 
[INFO] <<< maven-bundle-plugin:2.5.4:install (default-install) < install @ org.wso2.carbon.das.jobmanager.core <<<
[INFO] 
[INFO] --- maven-bundle-plugin:2.5.4:install (default-install) @ org.wso2.carbon.das.jobmanager.core ---
[INFO] Local OBR update disabled (enable with -DobrRepository)
[INFO]                                                                         
[INFO] ------------------------------------------------------------------------
[INFO] Building WSO2 Streaming Processor - Distributed Resource 2.0.145-SNAPSHOT
[INFO] ------------------------------------------------------------------------
[INFO] 
[INFO] --- maven-clean-plugin:3.0.0:clean (default-clean) @ org.wso2.carbon.sp.distributed.resource.core ---
[INFO] 
[INFO] --- maven-checkstyle-plugin:2.17:check (validate) @ org.wso2.carbon.sp.distributed.resource.core ---
[INFO] 
[INFO] --- buildnumber-maven-plugin:1.4:create (default) @ org.wso2.carbon.sp.distributed.resource.core ---
[INFO] Executing: /bin/sh -c cd '/home/jenkins/workspace/carbon-analytics-pipeline/carbon-analytics/components/org.wso2.carbon.sp.distributed.resource.core' && 'git' 'rev-parse' '--verify' 'HEAD'
[INFO] Working directory: /home/jenkins/workspace/carbon-analytics-pipeline/carbon-analytics/components/org.wso2.carbon.sp.distributed.resource.core
[INFO] Storing buildNumber: 08bd73f19f3225ccae428dd5ac887d140680f367 at timestamp: 1510817982099
[INFO] Storing buildScmBranch: master
[INFO] 
[INFO] --- jacoco-maven-plugin:0.7.8:prepare-agent (jacoco-initialize) @ org.wso2.carbon.sp.distributed.resource.core ---
[INFO] surefireArgLine set to -javaagent:/home/jenkins/.m2/repository/org/jacoco/org.jacoco.agent/0.7.8/org.jacoco.agent-0.7.8-runtime.jar=destfile=/home/jenkins/workspace/carbon-analytics-pipeline/carbon-analytics/components/org.wso2.carbon.sp.distributed.resource.core/target/coverage-reports/jacoco.exec
[INFO] 
[INFO] --- build-helper-maven-plugin:1.9.1:add-source (add-source) @ org.wso2.carbon.sp.distributed.resource.core ---
[INFO] Source directory: /home/jenkins/workspace/carbon-analytics-pipeline/carbon-analytics/components/org.wso2.carbon.sp.distributed.resource.core/src/gen/java added.
[INFO] 
[INFO] --- maven-remote-resources-plugin:1.5:process (default) @ org.wso2.carbon.sp.distributed.resource.core ---
[INFO] 
[INFO] --- maven-resources-plugin:2.7:resources (default-resources) @ org.wso2.carbon.sp.distributed.resource.core ---
[WARNING] Using platform encoding (ANSI_X3.4-1968 actually) to copy filtered resources, i.e. build is platform dependent!
[INFO] skip non existing resourceDirectory /home/jenkins/workspace/carbon-analytics-pipeline/carbon-analytics/components/org.wso2.carbon.sp.distributed.resource.core/src/main/resources
[INFO] Copying 3 resources
[INFO] 
[INFO] --- maven-compiler-plugin:3.5.1:compile (default-compile) @ org.wso2.carbon.sp.distributed.resource.core ---
[INFO] Changes detected - recompiling the module!
[WARNING] File encoding has not been set, using platform encoding ANSI_X3.4-1968, i.e. build is platform dependent!
[INFO] Compiling 14 source files to /home/jenkins/workspace/carbon-analytics-pipeline/carbon-analytics/components/org.wso2.carbon.sp.distributed.resource.core/target/classes
[INFO] 
[INFO] >>> findbugs-maven-plugin:3.0.3:check (analyze-compile) > :findbugs @ org.wso2.carbon.sp.distributed.resource.core >>>
[INFO] 
[INFO] --- findbugs-maven-plugin:3.0.3:findbugs (findbugs) @ org.wso2.carbon.sp.distributed.resource.core ---
[INFO] 
[INFO] <<< findbugs-maven-plugin:3.0.3:check (analyze-compile) < :findbugs @ org.wso2.carbon.sp.distributed.resource.core <<<
[INFO] 
[INFO] --- findbugs-maven-plugin:3.0.3:check (analyze-compile) @ org.wso2.carbon.sp.distributed.resource.core ---
[INFO] 
[INFO] --- maven-resources-plugin:2.7:testResources (default-testResources) @ org.wso2.carbon.sp.distributed.resource.core ---
[INFO] Not copying test resources
[INFO] 
[INFO] --- maven-compiler-plugin:3.5.1:testCompile (default-testCompile) @ org.wso2.carbon.sp.distributed.resource.core ---
[INFO] Not compiling test sources
[INFO] 
[INFO] --- maven-surefire-plugin:2.19.1:test (default-test) @ org.wso2.carbon.sp.distributed.resource.core ---
[INFO] Tests are skipped.
[INFO] 
[INFO] >>> maven-bundle-plugin:2.5.4:bundle (default-bundle) > package @ org.wso2.carbon.sp.distributed.resource.core >>>
[INFO] 
[INFO] --- maven-checkstyle-plugin:2.17:check (validate) @ org.wso2.carbon.sp.distributed.resource.core ---
[INFO] 
[INFO] --- buildnumber-maven-plugin:1.4:create (default) @ org.wso2.carbon.sp.distributed.resource.core ---
[INFO] Executing: /bin/sh -c cd '/home/jenkins/workspace/carbon-analytics-pipeline/carbon-analytics/components/org.wso2.carbon.sp.distributed.resource.core' && 'git' 'rev-parse' '--verify' 'HEAD'
[INFO] Working directory: /home/jenkins/workspace/carbon-analytics-pipeline/carbon-analytics/components/org.wso2.carbon.sp.distributed.resource.core
[INFO] Storing buildNumber: 08bd73f19f3225ccae428dd5ac887d140680f367 at timestamp: 1510817982592
[INFO] Storing buildScmBranch: master
[INFO] 
[INFO] --- jacoco-maven-plugin:0.7.8:prepare-agent (jacoco-initialize) @ org.wso2.carbon.sp.distributed.resource.core ---
[INFO] surefireArgLine set to -javaagent:/home/jenkins/.m2/repository/org/jacoco/org.jacoco.agent/0.7.8/org.jacoco.agent-0.7.8-runtime.jar=destfile=/home/jenkins/workspace/carbon-analytics-pipeline/carbon-analytics/components/org.wso2.carbon.sp.distributed.resource.core/target/coverage-reports/jacoco.exec
[INFO] 
[INFO] --- build-helper-maven-plugin:1.9.1:add-source (add-source) @ org.wso2.carbon.sp.distributed.resource.core ---
[INFO] Source directory: /home/jenkins/workspace/carbon-analytics-pipeline/carbon-analytics/components/org.wso2.carbon.sp.distributed.resource.core/src/gen/java added.
[INFO] 
[INFO] --- maven-remote-resources-plugin:1.5:process (default) @ org.wso2.carbon.sp.distributed.resource.core ---
[INFO] 
[INFO] --- maven-resources-plugin:2.7:resources (default-resources) @ org.wso2.carbon.sp.distributed.resource.core ---
[WARNING] Using platform encoding (ANSI_X3.4-1968 actually) to copy filtered resources, i.e. build is platform dependent!
[INFO] skip non existing resourceDirectory /home/jenkins/workspace/carbon-analytics-pipeline/carbon-analytics/components/org.wso2.carbon.sp.distributed.resource.core/src/main/resources
[INFO] Copying 3 resources
[INFO] Copying 3 resources
[INFO] 
[INFO] --- maven-compiler-plugin:3.5.1:compile (default-compile) @ org.wso2.carbon.sp.distributed.resource.core ---
[INFO] Nothing to compile - all classes are up to date
[INFO] 
[INFO] >>> findbugs-maven-plugin:3.0.3:check (analyze-compile) > :findbugs @ org.wso2.carbon.sp.distributed.resource.core >>>
[INFO] 
[INFO] --- findbugs-maven-plugin:3.0.3:findbugs (findbugs) @ org.wso2.carbon.sp.distributed.resource.core ---
[INFO] 
[INFO] <<< findbugs-maven-plugin:3.0.3:check (analyze-compile) < :findbugs @ org.wso2.carbon.sp.distributed.resource.core <<<
[INFO] 
[INFO] --- findbugs-maven-plugin:3.0.3:check (analyze-compile) @ org.wso2.carbon.sp.distributed.resource.core ---
[INFO] 
[INFO] --- maven-resources-plugin:2.7:testResources (default-testResources) @ org.wso2.carbon.sp.distributed.resource.core ---
[INFO] Not copying test resources
[INFO] 
[INFO] --- maven-compiler-plugin:3.5.1:testCompile (default-testCompile) @ org.wso2.carbon.sp.distributed.resource.core ---
[INFO] Not compiling test sources
[INFO] 
[INFO] --- maven-surefire-plugin:2.19.1:test (default-test) @ org.wso2.carbon.sp.distributed.resource.core ---
[INFO] Tests are skipped.
[INFO] 
[INFO] <<< maven-bundle-plugin:2.5.4:bundle (default-bundle) < package @ org.wso2.carbon.sp.distributed.resource.core <<<
[INFO] 
[INFO] --- maven-bundle-plugin:2.5.4:bundle (default-bundle) @ org.wso2.carbon.sp.distributed.resource.core ---
[WARNING] Bundle org.wso2.carbon.analytics:org.wso2.carbon.sp.distributed.resource.core:bundle:2.0.145-SNAPSHOT : Unused Import-Package instructions: [org.wso2.msf4j.*, javax.ws.rs.*] 
[INFO] 
[INFO] --- jacoco-maven-plugin:0.7.8:report (jacoco-site) @ org.wso2.carbon.sp.distributed.resource.core ---
[INFO] Skipping JaCoCo execution due to missing execution data file.
[INFO] 
[INFO] --- maven-install-plugin:2.5.2:install (default-install) @ org.wso2.carbon.sp.distributed.resource.core ---
[INFO] Installing /home/jenkins/workspace/carbon-analytics-pipeline/carbon-analytics/components/org.wso2.carbon.sp.distributed.resource.core/target/org.wso2.carbon.sp.distributed.resource.core-2.0.145-SNAPSHOT.jar to /home/jenkins/.m2/repository/org/wso2/carbon/analytics/org.wso2.carbon.sp.distributed.resource.core/2.0.145-SNAPSHOT/org.wso2.carbon.sp.distributed.resource.core-2.0.145-SNAPSHOT.jar
[INFO] Installing /home/jenkins/workspace/carbon-analytics-pipeline/carbon-analytics/components/org.wso2.carbon.sp.distributed.resource.core/pom.xml to /home/jenkins/.m2/repository/org/wso2/carbon/analytics/org.wso2.carbon.sp.distributed.resource.core/2.0.145-SNAPSHOT/org.wso2.carbon.sp.distributed.resource.core-2.0.145-SNAPSHOT.pom
[INFO] 
[INFO] >>> maven-bundle-plugin:2.5.4:install (default-install) > install @ org.wso2.carbon.sp.distributed.resource.core >>>
[INFO] 
[INFO] --- maven-checkstyle-plugin:2.17:check (validate) @ org.wso2.carbon.sp.distributed.resource.core ---
[INFO] 
[INFO] --- buildnumber-maven-plugin:1.4:create (default) @ org.wso2.carbon.sp.distributed.resource.core ---
[INFO] Executing: /bin/sh -c cd '/home/jenkins/workspace/carbon-analytics-pipeline/carbon-analytics/components/org.wso2.carbon.sp.distributed.resource.core' && 'git' 'rev-parse' '--verify' 'HEAD'
[INFO] Working directory: /home/jenkins/workspace/carbon-analytics-pipeline/carbon-analytics/components/org.wso2.carbon.sp.distributed.resource.core
[INFO] Storing buildNumber: 08bd73f19f3225ccae428dd5ac887d140680f367 at timestamp: 1510817983127
[INFO] Storing buildScmBranch: master
[INFO] 
[INFO] --- jacoco-maven-plugin:0.7.8:prepare-agent (jacoco-initialize) @ org.wso2.carbon.sp.distributed.resource.core ---
[INFO] surefireArgLine set to -javaagent:/home/jenkins/.m2/repository/org/jacoco/org.jacoco.agent/0.7.8/org.jacoco.agent-0.7.8-runtime.jar=destfile=/home/jenkins/workspace/carbon-analytics-pipeline/carbon-analytics/components/org.wso2.carbon.sp.distributed.resource.core/target/coverage-reports/jacoco.exec
[INFO] 
[INFO] --- build-helper-maven-plugin:1.9.1:add-source (add-source) @ org.wso2.carbon.sp.distributed.resource.core ---
[INFO] Source directory: /home/jenkins/workspace/carbon-analytics-pipeline/carbon-analytics/components/org.wso2.carbon.sp.distributed.resource.core/src/gen/java added.
[INFO] 
[INFO] --- maven-remote-resources-plugin:1.5:process (default) @ org.wso2.carbon.sp.distributed.resource.core ---
[INFO] 
[INFO] --- maven-resources-plugin:2.7:resources (default-resources) @ org.wso2.carbon.sp.distributed.resource.core ---
[WARNING] Using platform encoding (ANSI_X3.4-1968 actually) to copy filtered resources, i.e. build is platform dependent!
[INFO] skip non existing resourceDirectory /home/jenkins/workspace/carbon-analytics-pipeline/carbon-analytics/components/org.wso2.carbon.sp.distributed.resource.core/src/main/resources
[INFO] Copying 3 resources
[INFO] Copying 3 resources
[INFO] 
[INFO] --- maven-compiler-plugin:3.5.1:compile (default-compile) @ org.wso2.carbon.sp.distributed.resource.core ---
[INFO] Nothing to compile - all classes are up to date
[INFO] 
[INFO] >>> findbugs-maven-plugin:3.0.3:check (analyze-compile) > :findbugs @ org.wso2.carbon.sp.distributed.resource.core >>>
[INFO] 
[INFO] --- findbugs-maven-plugin:3.0.3:findbugs (findbugs) @ org.wso2.carbon.sp.distributed.resource.core ---
[INFO] 
[INFO] <<< findbugs-maven-plugin:3.0.3:check (analyze-compile) < :findbugs @ org.wso2.carbon.sp.distributed.resource.core <<<
[INFO] 
[INFO] --- findbugs-maven-plugin:3.0.3:check (analyze-compile) @ org.wso2.carbon.sp.distributed.resource.core ---
[INFO] 
[INFO] --- maven-resources-plugin:2.7:testResources (default-testResources) @ org.wso2.carbon.sp.distributed.resource.core ---
[INFO] Not copying test resources
[INFO] 
[INFO] --- maven-compiler-plugin:3.5.1:testCompile (default-testCompile) @ org.wso2.carbon.sp.distributed.resource.core ---
[INFO] Not compiling test sources
[INFO] 
[INFO] --- maven-surefire-plugin:2.19.1:test (default-test) @ org.wso2.carbon.sp.distributed.resource.core ---
[INFO] Tests are skipped.
[INFO] 
[INFO] >>> maven-bundle-plugin:2.5.4:bundle (default-bundle) > package @ org.wso2.carbon.sp.distributed.resource.core >>>
[INFO] 
[INFO] --- maven-checkstyle-plugin:2.17:check (validate) @ org.wso2.carbon.sp.distributed.resource.core ---
[INFO] 
[INFO] --- buildnumber-maven-plugin:1.4:create (default) @ org.wso2.carbon.sp.distributed.resource.core ---
[INFO] Executing: /bin/sh -c cd '/home/jenkins/workspace/carbon-analytics-pipeline/carbon-analytics/components/org.wso2.carbon.sp.distributed.resource.core' && 'git' 'rev-parse' '--verify' 'HEAD'
[INFO] Working directory: /home/jenkins/workspace/carbon-analytics-pipeline/carbon-analytics/components/org.wso2.carbon.sp.distributed.resource.core
[INFO] Storing buildNumber: 08bd73f19f3225ccae428dd5ac887d140680f367 at timestamp: 1510817983472
[INFO] Storing buildScmBranch: master
[INFO] 
[INFO] --- jacoco-maven-plugin:0.7.8:prepare-agent (jacoco-initialize) @ org.wso2.carbon.sp.distributed.resource.core ---
[INFO] surefireArgLine set to -javaagent:/home/jenkins/.m2/repository/org/jacoco/org.jacoco.agent/0.7.8/org.jacoco.agent-0.7.8-runtime.jar=destfile=/home/jenkins/workspace/carbon-analytics-pipeline/carbon-analytics/components/org.wso2.carbon.sp.distributed.resource.core/target/coverage-reports/jacoco.exec
[INFO] 
[INFO] --- build-helper-maven-plugin:1.9.1:add-source (add-source) @ org.wso2.carbon.sp.distributed.resource.core ---
[INFO] Source directory: /home/jenkins/workspace/carbon-analytics-pipeline/carbon-analytics/components/org.wso2.carbon.sp.distributed.resource.core/src/gen/java added.
[INFO] 
[INFO] --- maven-remote-resources-plugin:1.5:process (default) @ org.wso2.carbon.sp.distributed.resource.core ---
[INFO] 
[INFO] --- maven-resources-plugin:2.7:resources (default-resources) @ org.wso2.carbon.sp.distributed.resource.core ---
[WARNING] Using platform encoding (ANSI_X3.4-1968 actually) to copy filtered resources, i.e. build is platform dependent!
[INFO] skip non existing resourceDirectory /home/jenkins/workspace/carbon-analytics-pipeline/carbon-analytics/components/org.wso2.carbon.sp.distributed.resource.core/src/main/resources
[INFO] Copying 3 resources
[INFO] Copying 3 resources
[INFO] Copying 3 resources
[INFO] 
[INFO] --- maven-compiler-plugin:3.5.1:compile (default-compile) @ org.wso2.carbon.sp.distributed.resource.core ---
[INFO] Nothing to compile - all classes are up to date
[INFO] 
[INFO] >>> findbugs-maven-plugin:3.0.3:check (analyze-compile) > :findbugs @ org.wso2.carbon.sp.distributed.resource.core >>>
[INFO] 
[INFO] --- findbugs-maven-plugin:3.0.3:findbugs (findbugs) @ org.wso2.carbon.sp.distributed.resource.core ---
[INFO] 
[INFO] <<< findbugs-maven-plugin:3.0.3:check (analyze-compile) < :findbugs @ org.wso2.carbon.sp.distributed.resource.core <<<
[INFO] 
[INFO] --- findbugs-maven-plugin:3.0.3:check (analyze-compile) @ org.wso2.carbon.sp.distributed.resource.core ---
[INFO] 
[INFO] --- maven-resources-plugin:2.7:testResources (default-testResources) @ org.wso2.carbon.sp.distributed.resource.core ---
[INFO] Not copying test resources
[INFO] 
[INFO] --- maven-compiler-plugin:3.5.1:testCompile (default-testCompile) @ org.wso2.carbon.sp.distributed.resource.core ---
[INFO] Not compiling test sources
[INFO] 
[INFO] --- maven-surefire-plugin:2.19.1:test (default-test) @ org.wso2.carbon.sp.distributed.resource.core ---
[INFO] Tests are skipped.
[INFO] 
[INFO] <<< maven-bundle-plugin:2.5.4:bundle (default-bundle) < package @ org.wso2.carbon.sp.distributed.resource.core <<<
[INFO] 
[INFO] --- maven-bundle-plugin:2.5.4:bundle (default-bundle) @ org.wso2.carbon.sp.distributed.resource.core ---
[WARNING] Bundle org.wso2.carbon.analytics:org.wso2.carbon.sp.distributed.resource.core:bundle:2.0.145-SNAPSHOT : Unused Import-Package instructions: [org.wso2.msf4j.*, javax.ws.rs.*] 
[INFO] 
[INFO] --- jacoco-maven-plugin:0.7.8:report (jacoco-site) @ org.wso2.carbon.sp.distributed.resource.core ---
[INFO] Skipping JaCoCo execution due to missing execution data file.
[INFO] 
[INFO] --- maven-install-plugin:2.5.2:install (default-install) @ org.wso2.carbon.sp.distributed.resource.core ---
[INFO] Installing /home/jenkins/workspace/carbon-analytics-pipeline/carbon-analytics/components/org.wso2.carbon.sp.distributed.resource.core/target/org.wso2.carbon.sp.distributed.resource.core-2.0.145-SNAPSHOT.jar to /home/jenkins/.m2/repository/org/wso2/carbon/analytics/org.wso2.carbon.sp.distributed.resource.core/2.0.145-SNAPSHOT/org.wso2.carbon.sp.distributed.resource.core-2.0.145-SNAPSHOT.jar
[INFO] Installing /home/jenkins/workspace/carbon-analytics-pipeline/carbon-analytics/components/org.wso2.carbon.sp.distributed.resource.core/pom.xml to /home/jenkins/.m2/repository/org/wso2/carbon/analytics/org.wso2.carbon.sp.distributed.resource.core/2.0.145-SNAPSHOT/org.wso2.carbon.sp.distributed.resource.core-2.0.145-SNAPSHOT.pom
[INFO] 
[INFO] <<< maven-bundle-plugin:2.5.4:install (default-install) < install @ org.wso2.carbon.sp.distributed.resource.core <<<
[INFO] 
[INFO] --- maven-bundle-plugin:2.5.4:install (default-install) @ org.wso2.carbon.sp.distributed.resource.core ---
[INFO] Local OBR update disabled (enable with -DobrRepository)
[INFO]                                                                         
[INFO] ------------------------------------------------------------------------
[INFO] Building WSO2 Data Analytics Server - Editor 2.0.145-SNAPSHOT
[INFO] ------------------------------------------------------------------------
Downloading: https://jitpack.io/org/wso2/orbit/org/antlr/antlr4-runtime/4.5.1.wso2v1/antlr4-runtime-4.5.1.wso2v1.pom
                                   
Downloading: https://oss.sonatype.org/content/repositories/releases/org/wso2/orbit/org/antlr/antlr4-runtime/4.5.1.wso2v1/antlr4-runtime-4.5.1.wso2v1.pom
                                   
Downloading: http://maven.wso2.org/nexus/content/repositories/releases/org/wso2/orbit/org/antlr/antlr4-runtime/4.5.1.wso2v1/antlr4-runtime-4.5.1.wso2v1.pom
4/4 KB                             
         
Downloaded: http://maven.wso2.org/nexus/content/repositories/releases/org/wso2/orbit/org/antlr/antlr4-runtime/4.5.1.wso2v1/antlr4-runtime-4.5.1.wso2v1.pom (4 KB at 565.6 KB/sec)
Downloading: https://jitpack.io/org/wso2/orbit/org/antlr/antlr4-runtime/4.5.1.wso2v1/antlr4-runtime-4.5.1.wso2v1.jar
         
Downloading: https://oss.sonatype.org/content/repositories/releases/org/wso2/orbit/org/antlr/antlr4-runtime/4.5.1.wso2v1/antlr4-runtime-4.5.1.wso2v1.jar
         
Downloading: http://maven.wso2.org/nexus/content/repositories/releases/org/wso2/orbit/org/antlr/antlr4-runtime/4.5.1.wso2v1/antlr4-runtime-4.5.1.wso2v1.jar
4/299 KB   
8/299 KB   
12/299 KB   
16/299 KB   
20/299 KB   
24/299 KB   
28/299 KB   
32/299 KB   
36/299 KB   
40/299 KB   
42/299 KB   
46/299 KB   
50/299 KB   
54/299 KB   
58/299 KB   
62/299 KB   
66/299 KB   
70/299 KB   
74/299 KB   
78/299 KB   
80/299 KB   
84/299 KB   
88/299 KB   
92/299 KB   
96/299 KB   
100/299 KB   
104/299 KB   
108/299 KB   
112/299 KB   
114/299 KB   
118/299 KB   
122/299 KB   
126/299 KB   
130/299 KB   
134/299 KB   
138/299 KB   
142/299 KB   
146/299 KB   
147/299 KB   
151/299 KB   
152/299 KB   
156/299 KB   
160/299 KB   
164/299 KB   
168/299 KB   
172/299 KB   
176/299 KB   
180/299 KB   
184/299 KB   
186/299 KB   
190/299 KB   
194/299 KB   
198/299 KB   
202/299 KB   
206/299 KB   
210/299 KB   
214/299 KB   
218/299 KB   
222/299 KB   
226/299 KB   
230/299 KB   
234/299 KB   
238/299 KB   
241/299 KB   
245/299 KB   
249/299 KB   
253/299 KB   
257/299 KB   
261/299 KB   
265/299 KB   
269/299 KB   
273/299 KB   
277/299 KB   
281/299 KB   
285/299 KB   
289/299 KB   
293/299 KB   
297/299 KB   
299/299 KB   
             
Downloaded: http://maven.wso2.org/nexus/content/repositories/releases/org/wso2/orbit/org/antlr/antlr4-runtime/4.5.1.wso2v1/antlr4-runtime-4.5.1.wso2v1.jar (299 KB at 33213.3 KB/sec)
[INFO] 
[INFO] --- maven-clean-plugin:3.0.0:clean (default-clean) @ org.wso2.carbon.siddhi.editor.core ---
[INFO] 
[INFO] --- maven-checkstyle-plugin:2.17:check (validate) @ org.wso2.carbon.siddhi.editor.core ---
[INFO] 
[INFO] --- buildnumber-maven-plugin:1.4:create (default) @ org.wso2.carbon.siddhi.editor.core ---
[INFO] Executing: /bin/sh -c cd '/home/jenkins/workspace/carbon-analytics-pipeline/carbon-analytics/components/org.wso2.carbon.siddhi.editor.core' && 'git' 'rev-parse' '--verify' 'HEAD'
[INFO] Working directory: /home/jenkins/workspace/carbon-analytics-pipeline/carbon-analytics/components/org.wso2.carbon.siddhi.editor.core
[INFO] Storing buildNumber: 08bd73f19f3225ccae428dd5ac887d140680f367 at timestamp: 1510817985974
[INFO] Storing buildScmBranch: master
[INFO] 
[INFO] --- jacoco-maven-plugin:0.7.8:prepare-agent (jacoco-initialize) @ org.wso2.carbon.siddhi.editor.core ---
[INFO] surefireArgLine set to -javaagent:/home/jenkins/.m2/repository/org/jacoco/org.jacoco.agent/0.7.8/org.jacoco.agent-0.7.8-runtime.jar=destfile=/home/jenkins/workspace/carbon-analytics-pipeline/carbon-analytics/components/org.wso2.carbon.siddhi.editor.core/target/coverage-reports/jacoco.exec
[INFO] 
[INFO] --- maven-remote-resources-plugin:1.5:process (default) @ org.wso2.carbon.siddhi.editor.core ---
[INFO] 
[INFO] --- maven-resources-plugin:2.7:resources (default-resources) @ org.wso2.carbon.siddhi.editor.core ---
[WARNING] Using platform encoding (ANSI_X3.4-1968 actually) to copy filtered resources, i.e. build is platform dependent!
[INFO] Copying 1647 resources
[INFO] Copying 3 resources
[INFO] 
[INFO] --- maven-compiler-plugin:3.5.1:compile (default-compile) @ org.wso2.carbon.siddhi.editor.core ---
[INFO] Changes detected - recompiling the module!
[WARNING] File encoding has not been set, using platform encoding ANSI_X3.4-1968, i.e. build is platform dependent!
[INFO] Compiling 34 source files to /home/jenkins/workspace/carbon-analytics-pipeline/carbon-analytics/components/org.wso2.carbon.siddhi.editor.core/target/classes
[INFO] /home/jenkins/workspace/carbon-analytics-pipeline/carbon-analytics/components/org.wso2.carbon.siddhi.editor.core/src/main/java/org/wso2/carbon/siddhi/editor/core/internal/EditorConsoleService.java: /home/jenkins/workspace/carbon-analytics-pipeline/carbon-analytics/components/org.wso2.carbon.siddhi.editor.core/src/main/java/org/wso2/carbon/siddhi/editor/core/internal/EditorConsoleService.java uses unchecked or unsafe operations.
[INFO] /home/jenkins/workspace/carbon-analytics-pipeline/carbon-analytics/components/org.wso2.carbon.siddhi.editor.core/src/main/java/org/wso2/carbon/siddhi/editor/core/internal/EditorConsoleService.java: Recompile with -Xlint:unchecked for details.
[INFO] 
[INFO] >>> findbugs-maven-plugin:3.0.3:check (analyze-compile) > :findbugs @ org.wso2.carbon.siddhi.editor.core >>>
[INFO] 
[INFO] --- findbugs-maven-plugin:3.0.3:findbugs (findbugs) @ org.wso2.carbon.siddhi.editor.core ---
[INFO] 
[INFO] <<< findbugs-maven-plugin:3.0.3:check (analyze-compile) < :findbugs @ org.wso2.carbon.siddhi.editor.core <<<
[INFO] 
[INFO] --- findbugs-maven-plugin:3.0.3:check (analyze-compile) @ org.wso2.carbon.siddhi.editor.core ---
[INFO] 
[INFO] --- maven-resources-plugin:2.7:testResources (default-testResources) @ org.wso2.carbon.siddhi.editor.core ---
[INFO] Not copying test resources
[INFO] 
[INFO] --- maven-compiler-plugin:3.5.1:testCompile (default-testCompile) @ org.wso2.carbon.siddhi.editor.core ---
[INFO] Not compiling test sources
[INFO] 
[INFO] --- maven-surefire-plugin:2.19.1:test (default-test) @ org.wso2.carbon.siddhi.editor.core ---
[INFO] Tests are skipped.
[INFO] 
[INFO] >>> maven-bundle-plugin:2.5.4:bundle (default-bundle) > package @ org.wso2.carbon.siddhi.editor.core >>>
[INFO] 
[INFO] --- maven-checkstyle-plugin:2.17:check (validate) @ org.wso2.carbon.siddhi.editor.core ---
[INFO] 
[INFO] --- buildnumber-maven-plugin:1.4:create (default) @ org.wso2.carbon.siddhi.editor.core ---
[INFO] Executing: /bin/sh -c cd '/home/jenkins/workspace/carbon-analytics-pipeline/carbon-analytics/components/org.wso2.carbon.siddhi.editor.core' && 'git' 'rev-parse' '--verify' 'HEAD'
[INFO] Working directory: /home/jenkins/workspace/carbon-analytics-pipeline/carbon-analytics/components/org.wso2.carbon.siddhi.editor.core
[INFO] Storing buildNumber: 08bd73f19f3225ccae428dd5ac887d140680f367 at timestamp: 1510817987274
[INFO] Storing buildScmBranch: master
[INFO] 
[INFO] --- jacoco-maven-plugin:0.7.8:prepare-agent (jacoco-initialize) @ org.wso2.carbon.siddhi.editor.core ---
[INFO] surefireArgLine set to -javaagent:/home/jenkins/.m2/repository/org/jacoco/org.jacoco.agent/0.7.8/org.jacoco.agent-0.7.8-runtime.jar=destfile=/home/jenkins/workspace/carbon-analytics-pipeline/carbon-analytics/components/org.wso2.carbon.siddhi.editor.core/target/coverage-reports/jacoco.exec
[INFO] 
[INFO] --- maven-remote-resources-plugin:1.5:process (default) @ org.wso2.carbon.siddhi.editor.core ---
[INFO] 
[INFO] --- maven-resources-plugin:2.7:resources (default-resources) @ org.wso2.carbon.siddhi.editor.core ---
[WARNING] Using platform encoding (ANSI_X3.4-1968 actually) to copy filtered resources, i.e. build is platform dependent!
[INFO] Copying 1647 resources
[INFO] Copying 3 resources
[INFO] Copying 3 resources
[INFO] 
[INFO] --- maven-compiler-plugin:3.5.1:compile (default-compile) @ org.wso2.carbon.siddhi.editor.core ---
[INFO] Nothing to compile - all classes are up to date
[INFO] 
[INFO] >>> findbugs-maven-plugin:3.0.3:check (analyze-compile) > :findbugs @ org.wso2.carbon.siddhi.editor.core >>>
[INFO] 
[INFO] --- findbugs-maven-plugin:3.0.3:findbugs (findbugs) @ org.wso2.carbon.siddhi.editor.core ---
[INFO] 
[INFO] <<< findbugs-maven-plugin:3.0.3:check (analyze-compile) < :findbugs @ org.wso2.carbon.siddhi.editor.core <<<
[INFO] 
[INFO] --- findbugs-maven-plugin:3.0.3:check (analyze-compile) @ org.wso2.carbon.siddhi.editor.core ---
[INFO] 
[INFO] --- maven-resources-plugin:2.7:testResources (default-testResources) @ org.wso2.carbon.siddhi.editor.core ---
[INFO] Not copying test resources
[INFO] 
[INFO] --- maven-compiler-plugin:3.5.1:testCompile (default-testCompile) @ org.wso2.carbon.siddhi.editor.core ---
[INFO] Not compiling test sources
[INFO] 
[INFO] --- maven-surefire-plugin:2.19.1:test (default-test) @ org.wso2.carbon.siddhi.editor.core ---
[INFO] Tests are skipped.
[INFO] 
[INFO] <<< maven-bundle-plugin:2.5.4:bundle (default-bundle) < package @ org.wso2.carbon.siddhi.editor.core <<<
[INFO] 
[INFO] --- maven-bundle-plugin:2.5.4:bundle (default-bundle) @ org.wso2.carbon.siddhi.editor.core ---
[WARNING] Bundle org.wso2.carbon.analytics:org.wso2.carbon.siddhi.editor.core:bundle:2.0.145-SNAPSHOT : Unused Import-Package instructions: [javax.management.*] 
[INFO] 
[INFO] --- jacoco-maven-plugin:0.7.8:report (jacoco-site) @ org.wso2.carbon.siddhi.editor.core ---
[INFO] Skipping JaCoCo execution due to missing execution data file.
[INFO] 
[INFO] --- maven-install-plugin:2.5.2:install (default-install) @ org.wso2.carbon.siddhi.editor.core ---
[INFO] Installing /home/jenkins/workspace/carbon-analytics-pipeline/carbon-analytics/components/org.wso2.carbon.siddhi.editor.core/target/org.wso2.carbon.siddhi.editor.core-2.0.145-SNAPSHOT.jar to /home/jenkins/.m2/repository/org/wso2/carbon/analytics/org.wso2.carbon.siddhi.editor.core/2.0.145-SNAPSHOT/org.wso2.carbon.siddhi.editor.core-2.0.145-SNAPSHOT.jar
[INFO] Installing /home/jenkins/workspace/carbon-analytics-pipeline/carbon-analytics/components/org.wso2.carbon.siddhi.editor.core/pom.xml to /home/jenkins/.m2/repository/org/wso2/carbon/analytics/org.wso2.carbon.siddhi.editor.core/2.0.145-SNAPSHOT/org.wso2.carbon.siddhi.editor.core-2.0.145-SNAPSHOT.pom
[INFO] 
[INFO] >>> maven-bundle-plugin:2.5.4:install (default-install) > install @ org.wso2.carbon.siddhi.editor.core >>>
[INFO] 
[INFO] --- maven-checkstyle-plugin:2.17:check (validate) @ org.wso2.carbon.siddhi.editor.core ---
[INFO] 
[INFO] --- buildnumber-maven-plugin:1.4:create (default) @ org.wso2.carbon.siddhi.editor.core ---
[INFO] Executing: /bin/sh -c cd '/home/jenkins/workspace/carbon-analytics-pipeline/carbon-analytics/components/org.wso2.carbon.siddhi.editor.core' && 'git' 'rev-parse' '--verify' 'HEAD'
[INFO] Working directory: /home/jenkins/workspace/carbon-analytics-pipeline/carbon-analytics/components/org.wso2.carbon.siddhi.editor.core
[INFO] Storing buildNumber: 08bd73f19f3225ccae428dd5ac887d140680f367 at timestamp: 1510817989473
[INFO] Storing buildScmBranch: master
[INFO] 
[INFO] --- jacoco-maven-plugin:0.7.8:prepare-agent (jacoco-initialize) @ org.wso2.carbon.siddhi.editor.core ---
[INFO] surefireArgLine set to -javaagent:/home/jenkins/.m2/repository/org/jacoco/org.jacoco.agent/0.7.8/org.jacoco.agent-0.7.8-runtime.jar=destfile=/home/jenkins/workspace/carbon-analytics-pipeline/carbon-analytics/components/org.wso2.carbon.siddhi.editor.core/target/coverage-reports/jacoco.exec
[INFO] 
[INFO] --- maven-remote-resources-plugin:1.5:process (default) @ org.wso2.carbon.siddhi.editor.core ---
[INFO] 
[INFO] --- maven-resources-plugin:2.7:resources (default-resources) @ org.wso2.carbon.siddhi.editor.core ---
[WARNING] Using platform encoding (ANSI_X3.4-1968 actually) to copy filtered resources, i.e. build is platform dependent!
[INFO] Copying 1647 resources
[INFO] Copying 3 resources
[INFO] Copying 3 resources
[INFO] 
[INFO] --- maven-compiler-plugin:3.5.1:compile (default-compile) @ org.wso2.carbon.siddhi.editor.core ---
[INFO] Nothing to compile - all classes are up to date
[INFO] 
[INFO] >>> findbugs-maven-plugin:3.0.3:check (analyze-compile) > :findbugs @ org.wso2.carbon.siddhi.editor.core >>>
[INFO] 
[INFO] --- findbugs-maven-plugin:3.0.3:findbugs (findbugs) @ org.wso2.carbon.siddhi.editor.core ---
[INFO] 
[INFO] <<< findbugs-maven-plugin:3.0.3:check (analyze-compile) < :findbugs @ org.wso2.carbon.siddhi.editor.core <<<
[INFO] 
[INFO] --- findbugs-maven-plugin:3.0.3:check (analyze-compile) @ org.wso2.carbon.siddhi.editor.core ---
[INFO] 
[INFO] --- maven-resources-plugin:2.7:testResources (default-testResources) @ org.wso2.carbon.siddhi.editor.core ---
[INFO] Not copying test resources
[INFO] 
[INFO] --- maven-compiler-plugin:3.5.1:testCompile (default-testCompile) @ org.wso2.carbon.siddhi.editor.core ---
[INFO] Not compiling test sources
[INFO] 
[INFO] --- maven-surefire-plugin:2.19.1:test (default-test) @ org.wso2.carbon.siddhi.editor.core ---
[INFO] Tests are skipped.
[INFO] 
[INFO] >>> maven-bundle-plugin:2.5.4:bundle (default-bundle) > package @ org.wso2.carbon.siddhi.editor.core >>>
[INFO] 
[INFO] --- maven-checkstyle-plugin:2.17:check (validate) @ org.wso2.carbon.siddhi.editor.core ---
[INFO] 
[INFO] --- buildnumber-maven-plugin:1.4:create (default) @ org.wso2.carbon.siddhi.editor.core ---
[INFO] Executing: /bin/sh -c cd '/home/jenkins/workspace/carbon-analytics-pipeline/carbon-analytics/components/org.wso2.carbon.siddhi.editor.core' && 'git' 'rev-parse' '--verify' 'HEAD'
[INFO] Working directory: /home/jenkins/workspace/carbon-analytics-pipeline/carbon-analytics/components/org.wso2.carbon.siddhi.editor.core
[INFO] Storing buildNumber: 08bd73f19f3225ccae428dd5ac887d140680f367 at timestamp: 1510817989829
[INFO] Storing buildScmBranch: master
[INFO] 
[INFO] --- jacoco-maven-plugin:0.7.8:prepare-agent (jacoco-initialize) @ org.wso2.carbon.siddhi.editor.core ---
[INFO] surefireArgLine set to -javaagent:/home/jenkins/.m2/repository/org/jacoco/org.jacoco.agent/0.7.8/org.jacoco.agent-0.7.8-runtime.jar=destfile=/home/jenkins/workspace/carbon-analytics-pipeline/carbon-analytics/components/org.wso2.carbon.siddhi.editor.core/target/coverage-reports/jacoco.exec
[INFO] 
[INFO] --- maven-remote-resources-plugin:1.5:process (default) @ org.wso2.carbon.siddhi.editor.core ---
[INFO] 
[INFO] --- maven-resources-plugin:2.7:resources (default-resources) @ org.wso2.carbon.siddhi.editor.core ---
[WARNING] Using platform encoding (ANSI_X3.4-1968 actually) to copy filtered resources, i.e. build is platform dependent!
[INFO] Copying 1647 resources
[INFO] Copying 3 resources
[INFO] Copying 3 resources
[INFO] Copying 3 resources
[INFO] 
[INFO] --- maven-compiler-plugin:3.5.1:compile (default-compile) @ org.wso2.carbon.siddhi.editor.core ---
[INFO] Nothing to compile - all classes are up to date
[INFO] 
[INFO] >>> findbugs-maven-plugin:3.0.3:check (analyze-compile) > :findbugs @ org.wso2.carbon.siddhi.editor.core >>>
[INFO] 
[INFO] --- findbugs-maven-plugin:3.0.3:findbugs (findbugs) @ org.wso2.carbon.siddhi.editor.core ---
[INFO] 
[INFO] <<< findbugs-maven-plugin:3.0.3:check (analyze-compile) < :findbugs @ org.wso2.carbon.siddhi.editor.core <<<
[INFO] 
[INFO] --- findbugs-maven-plugin:3.0.3:check (analyze-compile) @ org.wso2.carbon.siddhi.editor.core ---
[INFO] 
[INFO] --- maven-resources-plugin:2.7:testResources (default-testResources) @ org.wso2.carbon.siddhi.editor.core ---
[INFO] Not copying test resources
[INFO] 
[INFO] --- maven-compiler-plugin:3.5.1:testCompile (default-testCompile) @ org.wso2.carbon.siddhi.editor.core ---
[INFO] Not compiling test sources
[INFO] 
[INFO] --- maven-surefire-plugin:2.19.1:test (default-test) @ org.wso2.carbon.siddhi.editor.core ---
[INFO] Tests are skipped.
[INFO] 
[INFO] <<< maven-bundle-plugin:2.5.4:bundle (default-bundle) < package @ org.wso2.carbon.siddhi.editor.core <<<
[INFO] 
[INFO] --- maven-bundle-plugin:2.5.4:bundle (default-bundle) @ org.wso2.carbon.siddhi.editor.core ---
[WARNING] Bundle org.wso2.carbon.analytics:org.wso2.carbon.siddhi.editor.core:bundle:2.0.145-SNAPSHOT : Unused Import-Package instructions: [javax.management.*] 
[INFO] 
[INFO] --- jacoco-maven-plugin:0.7.8:report (jacoco-site) @ org.wso2.carbon.siddhi.editor.core ---
[INFO] Skipping JaCoCo execution due to missing execution data file.
[INFO] 
[INFO] --- maven-install-plugin:2.5.2:install (default-install) @ org.wso2.carbon.siddhi.editor.core ---
[INFO] Installing /home/jenkins/workspace/carbon-analytics-pipeline/carbon-analytics/components/org.wso2.carbon.siddhi.editor.core/target/org.wso2.carbon.siddhi.editor.core-2.0.145-SNAPSHOT.jar to /home/jenkins/.m2/repository/org/wso2/carbon/analytics/org.wso2.carbon.siddhi.editor.core/2.0.145-SNAPSHOT/org.wso2.carbon.siddhi.editor.core-2.0.145-SNAPSHOT.jar
[INFO] Installing /home/jenkins/workspace/carbon-analytics-pipeline/carbon-analytics/components/org.wso2.carbon.siddhi.editor.core/pom.xml to /home/jenkins/.m2/repository/org/wso2/carbon/analytics/org.wso2.carbon.siddhi.editor.core/2.0.145-SNAPSHOT/org.wso2.carbon.siddhi.editor.core-2.0.145-SNAPSHOT.pom
[INFO] 
[INFO] <<< maven-bundle-plugin:2.5.4:install (default-install) < install @ org.wso2.carbon.siddhi.editor.core <<<
[INFO] 
[INFO] --- maven-bundle-plugin:2.5.4:install (default-install) @ org.wso2.carbon.siddhi.editor.core ---
[INFO] Local OBR update disabled (enable with -DobrRepository)
[INFO]                                                                         
[INFO] ------------------------------------------------------------------------
[INFO] Building WSO2 Stream Processor : Database Query Manager 2.0.145-SNAPSHOT
[INFO] ------------------------------------------------------------------------
Downloading: http://maven.wso2.org/nexus/content/repositories/releases/org/wso2/carbon/config/org.wso2.carbon.config.feature/2.1.4/org.wso2.carbon.config.feature-2.1.4.pom
4/4 KB       
         
Downloaded: http://maven.wso2.org/nexus/content/repositories/releases/org/wso2/carbon/config/org.wso2.carbon.config.feature/2.1.4/org.wso2.carbon.config.feature-2.1.4.pom (4 KB at 122.9 KB/sec)
Downloading: http://maven.wso2.org/nexus/content/repositories/releases/org/wso2/carbon/secvault/org.wso2.carbon.secvault.feature/5.0.10/org.wso2.carbon.secvault.feature-5.0.10.pom
4/6 KB   
6/6 KB   
         
Downloaded: http://maven.wso2.org/nexus/content/repositories/releases/org/wso2/carbon/secvault/org.wso2.carbon.secvault.feature/5.0.10/org.wso2.carbon.secvault.feature-5.0.10.pom (6 KB at 70.5 KB/sec)
Downloading: http://maven.wso2.org/nexus/content/repositories/releases/org/wso2/carbon/secvault/carbon-secvault/5.0.10/carbon-secvault-5.0.10.pom
4/10 KB   
8/10 KB   
10/10 KB   
           
Downloaded: http://maven.wso2.org/nexus/content/repositories/releases/org/wso2/carbon/secvault/carbon-secvault/5.0.10/carbon-secvault-5.0.10.pom (10 KB at 1560.9 KB/sec)
Downloading: http://maven.wso2.org/nexus/content/repositories/releases/org/wso2/carbon/secvault/org.wso2.carbon.secvault/5.0.10/org.wso2.carbon.secvault-5.0.10.pom
4/6 KB     
6/6 KB   
         
Downloaded: http://maven.wso2.org/nexus/content/repositories/releases/org/wso2/carbon/secvault/org.wso2.carbon.secvault/5.0.10/org.wso2.carbon.secvault-5.0.10.pom (6 KB at 901.9 KB/sec)
Downloading: http://maven.wso2.org/nexus/content/repositories/releases/org/wso2/carbon/utils/org.wso2.carbon.utils.feature/2.0.4/org.wso2.carbon.utils.feature-2.0.4.pom
3/3 KB   
         
Downloaded: http://maven.wso2.org/nexus/content/repositories/releases/org/wso2/carbon/utils/org.wso2.carbon.utils.feature/2.0.4/org.wso2.carbon.utils.feature-2.0.4.pom (3 KB at 494.8 KB/sec)
Downloading: http://maven.wso2.org/nexus/content/repositories/releases/org/wso2/carbon/config/org.wso2.carbon.config.feature/2.1.4/org.wso2.carbon.config.feature-2.1.4.zip
Downloading: http://maven.wso2.org/nexus/content/repositories/releases/org/wso2/carbon/secvault/org.wso2.carbon.secvault.feature/5.0.10/org.wso2.carbon.secvault.feature-5.0.10.zip
Downloading: http://maven.wso2.org/nexus/content/repositories/releases/org/wso2/carbon/utils/org.wso2.carbon.utils.feature/2.0.4/org.wso2.carbon.utils.feature-2.0.4.zip
4/305 KB   
8/305 KB   
12/305 KB   
16/305 KB   
20/305 KB   
24/305 KB   
28/305 KB   
32/305 KB   
36/305 KB   
40/305 KB   
44/305 KB   
48/305 KB   
52/305 KB   
56/305 KB   
60/305 KB   
64/305 KB   
68/305 KB   
72/305 KB   
76/305 KB   
80/305 KB   
84/305 KB   
88/305 KB   
92/305 KB   
96/305 KB   
100/305 KB   
104/305 KB   
108/305 KB   
112/305 KB   
116/305 KB   
120/305 KB   
124/305 KB   
128/305 KB   
132/305 KB   
136/305 KB   
140/305 KB   
144/305 KB   
148/305 KB   
152/305 KB   
156/305 KB   
160/305 KB   
164/305 KB   
168/305 KB   
172/305 KB   
176/305 KB   
180/305 KB   
184/305 KB   
188/305 KB   
192/305 KB   
196/305 KB   
200/305 KB   
204/305 KB   
208/305 KB   
212/305 KB   
216/305 KB   
220/305 KB   
224/305 KB   
224/305 KB   
228/305 KB   
230/305 KB   
234/305 KB   
238/305 KB   
241/305 KB   
245/305 KB   
249/305 KB   
253/305 KB   
257/305 KB   
261/305 KB   
265/305 KB   
269/305 KB   
273/305 KB   
277/305 KB   
281/305 KB   
285/305 KB   
289/305 KB   
293/305 KB   
297/305 KB   
301/305 KB   
303/305 KB   
305/305 KB   
             
Downloaded: http://maven.wso2.org/nexus/content/repositories/releases/org/wso2/carbon/secvault/org.wso2.carbon.secvault.feature/5.0.10/org.wso2.carbon.secvault.feature-5.0.10.zip (305 KB at 15233.4 KB/sec)
4/28 KB      
8/28 KB   
12/28 KB   
16/28 KB   
19/28 KB   
23/28 KB   
27/28 KB   
28/28 KB   
           
Downloaded: http://maven.wso2.org/nexus/content/repositories/releases/org/wso2/carbon/utils/org.wso2.carbon.utils.feature/2.0.4/org.wso2.carbon.utils.feature-2.0.4.zip (28 KB at 1315.2 KB/sec)
4/43 KB    
6/43 KB   
10/43 KB   
14/43 KB   
18/43 KB   
22/43 KB   
26/43 KB   
30/43 KB   
33/43 KB   
37/43 KB   
41/43 KB   
43/43 KB   
           
Downloaded: http://maven.wso2.org/nexus/content/repositories/releases/org/wso2/carbon/config/org.wso2.carbon.config.feature/2.1.4/org.wso2.carbon.config.feature-2.1.4.zip (43 KB at 1433.0 KB/sec)
[INFO] 
[INFO] --- maven-clean-plugin:3.0.0:clean (default-clean) @ org.wso2.carbon.database.query.manager ---
[INFO] 
[INFO] --- maven-checkstyle-plugin:2.17:check (validate) @ org.wso2.carbon.database.query.manager ---
[INFO] 
[INFO] --- buildnumber-maven-plugin:1.4:create (default) @ org.wso2.carbon.database.query.manager ---
[INFO] Executing: /bin/sh -c cd '/home/jenkins/workspace/carbon-analytics-pipeline/carbon-analytics/components/org.wso2.carbon.database.query.manager' && 'git' 'rev-parse' '--verify' 'HEAD'
[INFO] Working directory: /home/jenkins/workspace/carbon-analytics-pipeline/carbon-analytics/components/org.wso2.carbon.database.query.manager
[INFO] Storing buildNumber: 08bd73f19f3225ccae428dd5ac887d140680f367 at timestamp: 1510817992189
[INFO] Storing buildScmBranch: master
[INFO] 
[INFO] --- jacoco-maven-plugin:0.7.8:prepare-agent (jacoco-initialize) @ org.wso2.carbon.database.query.manager ---
[INFO] surefireArgLine set to -javaagent:/home/jenkins/.m2/repository/org/jacoco/org.jacoco.agent/0.7.8/org.jacoco.agent-0.7.8-runtime.jar=destfile=/home/jenkins/workspace/carbon-analytics-pipeline/carbon-analytics/components/org.wso2.carbon.database.query.manager/target/coverage-reports/jacoco.exec
[INFO] 
[INFO] --- build-helper-maven-plugin:1.9.1:add-source (add-source) @ org.wso2.carbon.database.query.manager ---
[INFO] Source directory: /home/jenkins/workspace/carbon-analytics-pipeline/carbon-analytics/components/org.wso2.carbon.database.query.manager/src/gen/java added.
[INFO] 
[INFO] --- maven-remote-resources-plugin:1.5:process (default) @ org.wso2.carbon.database.query.manager ---
[INFO] 
[INFO] --- maven-resources-plugin:2.7:resources (default-resources) @ org.wso2.carbon.database.query.manager ---
[WARNING] Using platform encoding (ANSI_X3.4-1968 actually) to copy filtered resources, i.e. build is platform dependent!
[INFO] skip non existing resourceDirectory /home/jenkins/workspace/carbon-analytics-pipeline/carbon-analytics/components/org.wso2.carbon.database.query.manager/src/main/resources
[INFO] Copying 3 resources
[INFO] 
[INFO] --- maven-compiler-plugin:3.5.1:compile (default-compile) @ org.wso2.carbon.database.query.manager ---
[INFO] Changes detected - recompiling the module!
[WARNING] File encoding has not been set, using platform encoding ANSI_X3.4-1968, i.e. build is platform dependent!
[INFO] Compiling 3 source files to /home/jenkins/workspace/carbon-analytics-pipeline/carbon-analytics/components/org.wso2.carbon.database.query.manager/target/classes
[INFO] /home/jenkins/workspace/carbon-analytics-pipeline/carbon-analytics/components/org.wso2.carbon.database.query.manager/src/main/java/org/wso2/carbon/database/query/manager/QueryManager.java: /home/jenkins/workspace/carbon-analytics-pipeline/carbon-analytics/components/org.wso2.carbon.database.query.manager/src/main/java/org/wso2/carbon/database/query/manager/QueryManager.java uses unchecked or unsafe operations.
[INFO] /home/jenkins/workspace/carbon-analytics-pipeline/carbon-analytics/components/org.wso2.carbon.database.query.manager/src/main/java/org/wso2/carbon/database/query/manager/QueryManager.java: Recompile with -Xlint:unchecked for details.
[INFO] 
[INFO] >>> findbugs-maven-plugin:3.0.3:check (analyze-compile) > :findbugs @ org.wso2.carbon.database.query.manager >>>
[INFO] 
[INFO] --- findbugs-maven-plugin:3.0.3:findbugs (findbugs) @ org.wso2.carbon.database.query.manager ---
[INFO] 
[INFO] <<< findbugs-maven-plugin:3.0.3:check (analyze-compile) < :findbugs @ org.wso2.carbon.database.query.manager <<<
[INFO] 
[INFO] --- findbugs-maven-plugin:3.0.3:check (analyze-compile) @ org.wso2.carbon.database.query.manager ---
[INFO] 
[INFO] --- maven-resources-plugin:2.7:testResources (default-testResources) @ org.wso2.carbon.database.query.manager ---
[INFO] Not copying test resources
[INFO] 
[INFO] --- maven-compiler-plugin:3.5.1:testCompile (default-testCompile) @ org.wso2.carbon.database.query.manager ---
[INFO] Not compiling test sources
[INFO] 
[INFO] --- maven-surefire-plugin:2.19.1:test (default-test) @ org.wso2.carbon.database.query.manager ---
[INFO] Tests are skipped.
[INFO] 
[INFO] >>> maven-bundle-plugin:2.5.4:bundle (default-bundle) > package @ org.wso2.carbon.database.query.manager >>>
[INFO] 
[INFO] --- maven-checkstyle-plugin:2.17:check (validate) @ org.wso2.carbon.database.query.manager ---
[INFO] 
[INFO] --- buildnumber-maven-plugin:1.4:create (default) @ org.wso2.carbon.database.query.manager ---
[INFO] Executing: /bin/sh -c cd '/home/jenkins/workspace/carbon-analytics-pipeline/carbon-analytics/components/org.wso2.carbon.database.query.manager' && 'git' 'rev-parse' '--verify' 'HEAD'
[INFO] Working directory: /home/jenkins/workspace/carbon-analytics-pipeline/carbon-analytics/components/org.wso2.carbon.database.query.manager
[INFO] Storing buildNumber: 08bd73f19f3225ccae428dd5ac887d140680f367 at timestamp: 1510817992481
[INFO] Storing buildScmBranch: master
[INFO] 
[INFO] --- jacoco-maven-plugin:0.7.8:prepare-agent (jacoco-initialize) @ org.wso2.carbon.database.query.manager ---
[INFO] surefireArgLine set to -javaagent:/home/jenkins/.m2/repository/org/jacoco/org.jacoco.agent/0.7.8/org.jacoco.agent-0.7.8-runtime.jar=destfile=/home/jenkins/workspace/carbon-analytics-pipeline/carbon-analytics/components/org.wso2.carbon.database.query.manager/target/coverage-reports/jacoco.exec
[INFO] 
[INFO] --- build-helper-maven-plugin:1.9.1:add-source (add-source) @ org.wso2.carbon.database.query.manager ---
[INFO] Source directory: /home/jenkins/workspace/carbon-analytics-pipeline/carbon-analytics/components/org.wso2.carbon.database.query.manager/src/gen/java added.
[INFO] 
[INFO] --- maven-remote-resources-plugin:1.5:process (default) @ org.wso2.carbon.database.query.manager ---
[INFO] 
[INFO] --- maven-resources-plugin:2.7:resources (default-resources) @ org.wso2.carbon.database.query.manager ---
[WARNING] Using platform encoding (ANSI_X3.4-1968 actually) to copy filtered resources, i.e. build is platform dependent!
[INFO] skip non existing resourceDirectory /home/jenkins/workspace/carbon-analytics-pipeline/carbon-analytics/components/org.wso2.carbon.database.query.manager/src/main/resources
[INFO] Copying 3 resources
[INFO] Copying 3 resources
[INFO] 
[INFO] --- maven-compiler-plugin:3.5.1:compile (default-compile) @ org.wso2.carbon.database.query.manager ---
[INFO] Nothing to compile - all classes are up to date
[INFO] 
[INFO] >>> findbugs-maven-plugin:3.0.3:check (analyze-compile) > :findbugs @ org.wso2.carbon.database.query.manager >>>
[INFO] 
[INFO] --- findbugs-maven-plugin:3.0.3:findbugs (findbugs) @ org.wso2.carbon.database.query.manager ---
[INFO] 
[INFO] <<< findbugs-maven-plugin:3.0.3:check (analyze-compile) < :findbugs @ org.wso2.carbon.database.query.manager <<<
[INFO] 
[INFO] --- findbugs-maven-plugin:3.0.3:check (analyze-compile) @ org.wso2.carbon.database.query.manager ---
[INFO] 
[INFO] --- maven-resources-plugin:2.7:testResources (default-testResources) @ org.wso2.carbon.database.query.manager ---
[INFO] Not copying test resources
[INFO] 
[INFO] --- maven-compiler-plugin:3.5.1:testCompile (default-testCompile) @ org.wso2.carbon.database.query.manager ---
[INFO] Not compiling test sources
[INFO] 
[INFO] --- maven-surefire-plugin:2.19.1:test (default-test) @ org.wso2.carbon.database.query.manager ---
[INFO] Tests are skipped.
[INFO] 
[INFO] <<< maven-bundle-plugin:2.5.4:bundle (default-bundle) < package @ org.wso2.carbon.database.query.manager <<<
[INFO] 
[INFO] --- maven-bundle-plugin:2.5.4:bundle (default-bundle) @ org.wso2.carbon.database.query.manager ---
[INFO] 
[INFO] --- jacoco-maven-plugin:0.7.8:report (jacoco-site) @ org.wso2.carbon.database.query.manager ---
[INFO] Skipping JaCoCo execution due to missing execution data file.
[INFO] 
[INFO] --- maven-install-plugin:2.5.2:install (default-install) @ org.wso2.carbon.database.query.manager ---
[INFO] Installing /home/jenkins/workspace/carbon-analytics-pipeline/carbon-analytics/components/org.wso2.carbon.database.query.manager/target/org.wso2.carbon.database.query.manager-2.0.145-SNAPSHOT.jar to /home/jenkins/.m2/repository/org/wso2/carbon/analytics/org.wso2.carbon.database.query.manager/2.0.145-SNAPSHOT/org.wso2.carbon.database.query.manager-2.0.145-SNAPSHOT.jar
[INFO] Installing /home/jenkins/workspace/carbon-analytics-pipeline/carbon-analytics/components/org.wso2.carbon.database.query.manager/pom.xml to /home/jenkins/.m2/repository/org/wso2/carbon/analytics/org.wso2.carbon.database.query.manager/2.0.145-SNAPSHOT/org.wso2.carbon.database.query.manager-2.0.145-SNAPSHOT.pom
[INFO] 
[INFO] >>> maven-bundle-plugin:2.5.4:install (default-install) > install @ org.wso2.carbon.database.query.manager >>>
[INFO] 
[INFO] --- maven-checkstyle-plugin:2.17:check (validate) @ org.wso2.carbon.database.query.manager ---
[INFO] 
[INFO] --- buildnumber-maven-plugin:1.4:create (default) @ org.wso2.carbon.database.query.manager ---
[INFO] Executing: /bin/sh -c cd '/home/jenkins/workspace/carbon-analytics-pipeline/carbon-analytics/components/org.wso2.carbon.database.query.manager' && 'git' 'rev-parse' '--verify' 'HEAD'
[INFO] Working directory: /home/jenkins/workspace/carbon-analytics-pipeline/carbon-analytics/components/org.wso2.carbon.database.query.manager
[INFO] Storing buildNumber: 08bd73f19f3225ccae428dd5ac887d140680f367 at timestamp: 1510817992788
[INFO] Storing buildScmBranch: master
[INFO] 
[INFO] --- jacoco-maven-plugin:0.7.8:prepare-agent (jacoco-initialize) @ org.wso2.carbon.database.query.manager ---
[INFO] surefireArgLine set to -javaagent:/home/jenkins/.m2/repository/org/jacoco/org.jacoco.agent/0.7.8/org.jacoco.agent-0.7.8-runtime.jar=destfile=/home/jenkins/workspace/carbon-analytics-pipeline/carbon-analytics/components/org.wso2.carbon.database.query.manager/target/coverage-reports/jacoco.exec
[INFO] 
[INFO] --- build-helper-maven-plugin:1.9.1:add-source (add-source) @ org.wso2.carbon.database.query.manager ---
[INFO] Source directory: /home/jenkins/workspace/carbon-analytics-pipeline/carbon-analytics/components/org.wso2.carbon.database.query.manager/src/gen/java added.
[INFO] 
[INFO] --- maven-remote-resources-plugin:1.5:process (default) @ org.wso2.carbon.database.query.manager ---
[INFO] 
[INFO] --- maven-resources-plugin:2.7:resources (default-resources) @ org.wso2.carbon.database.query.manager ---
[WARNING] Using platform encoding (ANSI_X3.4-1968 actually) to copy filtered resources, i.e. build is platform dependent!
[INFO] skip non existing resourceDirectory /home/jenkins/workspace/carbon-analytics-pipeline/carbon-analytics/components/org.wso2.carbon.database.query.manager/src/main/resources
[INFO] Copying 3 resources
[INFO] Copying 3 resources
[INFO] 
[INFO] --- maven-compiler-plugin:3.5.1:compile (default-compile) @ org.wso2.carbon.database.query.manager ---
[INFO] Nothing to compile - all classes are up to date
[INFO] 
[INFO] >>> findbugs-maven-plugin:3.0.3:check (analyze-compile) > :findbugs @ org.wso2.carbon.database.query.manager >>>
[INFO] 
[INFO] --- findbugs-maven-plugin:3.0.3:findbugs (findbugs) @ org.wso2.carbon.database.query.manager ---
[INFO] 
[INFO] <<< findbugs-maven-plugin:3.0.3:check (analyze-compile) < :findbugs @ org.wso2.carbon.database.query.manager <<<
[INFO] 
[INFO] --- findbugs-maven-plugin:3.0.3:check (analyze-compile) @ org.wso2.carbon.database.query.manager ---
[INFO] 
[INFO] --- maven-resources-plugin:2.7:testResources (default-testResources) @ org.wso2.carbon.database.query.manager ---
[INFO] Not copying test resources
[INFO] 
[INFO] --- maven-compiler-plugin:3.5.1:testCompile (default-testCompile) @ org.wso2.carbon.database.query.manager ---
[INFO] Not compiling test sources
[INFO] 
[INFO] --- maven-surefire-plugin:2.19.1:test (default-test) @ org.wso2.carbon.database.query.manager ---
[INFO] Tests are skipped.
[INFO] 
[INFO] >>> maven-bundle-plugin:2.5.4:bundle (default-bundle) > package @ org.wso2.carbon.database.query.manager >>>
[INFO] 
[INFO] --- maven-checkstyle-plugin:2.17:check (validate) @ org.wso2.carbon.database.query.manager ---
[INFO] 
[INFO] --- buildnumber-maven-plugin:1.4:create (default) @ org.wso2.carbon.database.query.manager ---
[INFO] Executing: /bin/sh -c cd '/home/jenkins/workspace/carbon-analytics-pipeline/carbon-analytics/components/org.wso2.carbon.database.query.manager' && 'git' 'rev-parse' '--verify' 'HEAD'
[INFO] Working directory: /home/jenkins/workspace/carbon-analytics-pipeline/carbon-analytics/components/org.wso2.carbon.database.query.manager
[INFO] Storing buildNumber: 08bd73f19f3225ccae428dd5ac887d140680f367 at timestamp: 1510817992986
[INFO] Storing buildScmBranch: master
[INFO] 
[INFO] --- jacoco-maven-plugin:0.7.8:prepare-agent (jacoco-initialize) @ org.wso2.carbon.database.query.manager ---
[INFO] surefireArgLine set to -javaagent:/home/jenkins/.m2/repository/org/jacoco/org.jacoco.agent/0.7.8/org.jacoco.agent-0.7.8-runtime.jar=destfile=/home/jenkins/workspace/carbon-analytics-pipeline/carbon-analytics/components/org.wso2.carbon.database.query.manager/target/coverage-reports/jacoco.exec
[INFO] 
[INFO] --- build-helper-maven-plugin:1.9.1:add-source (add-source) @ org.wso2.carbon.database.query.manager ---
[INFO] Source directory: /home/jenkins/workspace/carbon-analytics-pipeline/carbon-analytics/components/org.wso2.carbon.database.query.manager/src/gen/java added.
[INFO] 
[INFO] --- maven-remote-resources-plugin:1.5:process (default) @ org.wso2.carbon.database.query.manager ---
[INFO] 
[INFO] --- maven-resources-plugin:2.7:resources (default-resources) @ org.wso2.carbon.database.query.manager ---
[WARNING] Using platform encoding (ANSI_X3.4-1968 actually) to copy filtered resources, i.e. build is platform dependent!
[INFO] skip non existing resourceDirectory /home/jenkins/workspace/carbon-analytics-pipeline/carbon-analytics/components/org.wso2.carbon.database.query.manager/src/main/resources
[INFO] Copying 3 resources
[INFO] Copying 3 resources
[INFO] Copying 3 resources
[INFO] 
[INFO] --- maven-compiler-plugin:3.5.1:compile (default-compile) @ org.wso2.carbon.database.query.manager ---
[INFO] Nothing to compile - all classes are up to date
[INFO] 
[INFO] >>> findbugs-maven-plugin:3.0.3:check (analyze-compile) > :findbugs @ org.wso2.carbon.database.query.manager >>>
[INFO] 
[INFO] --- findbugs-maven-plugin:3.0.3:findbugs (findbugs) @ org.wso2.carbon.database.query.manager ---
[INFO] 
[INFO] <<< findbugs-maven-plugin:3.0.3:check (analyze-compile) < :findbugs @ org.wso2.carbon.database.query.manager <<<
[INFO] 
[INFO] --- findbugs-maven-plugin:3.0.3:check (analyze-compile) @ org.wso2.carbon.database.query.manager ---
[INFO] 
[INFO] --- maven-resources-plugin:2.7:testResources (default-testResources) @ org.wso2.carbon.database.query.manager ---
[INFO] Not copying test resources
[INFO] 
[INFO] --- maven-compiler-plugin:3.5.1:testCompile (default-testCompile) @ org.wso2.carbon.database.query.manager ---
[INFO] Not compiling test sources
[INFO] 
[INFO] --- maven-surefire-plugin:2.19.1:test (default-test) @ org.wso2.carbon.database.query.manager ---
[INFO] Tests are skipped.
[INFO] 
[INFO] <<< maven-bundle-plugin:2.5.4:bundle (default-bundle) < package @ org.wso2.carbon.database.query.manager <<<
[INFO] 
[INFO] --- maven-bundle-plugin:2.5.4:bundle (default-bundle) @ org.wso2.carbon.database.query.manager ---
[INFO] 
[INFO] --- jacoco-maven-plugin:0.7.8:report (jacoco-site) @ org.wso2.carbon.database.query.manager ---
[INFO] Skipping JaCoCo execution due to missing execution data file.
[INFO] 
[INFO] --- maven-install-plugin:2.5.2:install (default-install) @ org.wso2.carbon.database.query.manager ---
[INFO] Installing /home/jenkins/workspace/carbon-analytics-pipeline/carbon-analytics/components/org.wso2.carbon.database.query.manager/target/org.wso2.carbon.database.query.manager-2.0.145-SNAPSHOT.jar to /home/jenkins/.m2/repository/org/wso2/carbon/analytics/org.wso2.carbon.database.query.manager/2.0.145-SNAPSHOT/org.wso2.carbon.database.query.manager-2.0.145-SNAPSHOT.jar
[INFO] Installing /home/jenkins/workspace/carbon-analytics-pipeline/carbon-analytics/components/org.wso2.carbon.database.query.manager/pom.xml to /home/jenkins/.m2/repository/org/wso2/carbon/analytics/org.wso2.carbon.database.query.manager/2.0.145-SNAPSHOT/org.wso2.carbon.database.query.manager-2.0.145-SNAPSHOT.pom
[INFO] 
[INFO] <<< maven-bundle-plugin:2.5.4:install (default-install) < install @ org.wso2.carbon.database.query.manager <<<
[INFO] 
[INFO] --- maven-bundle-plugin:2.5.4:install (default-install) @ org.wso2.carbon.database.query.manager ---
[INFO] Local OBR update disabled (enable with -DobrRepository)
[INFO]                                                                         
[INFO] ------------------------------------------------------------------------
[INFO] Building WSO2 Data Analytics Server - Business Rules 2.0.145-SNAPSHOT
[INFO] ------------------------------------------------------------------------
Downloading: http://maven.wso2.org/nexus/content/repositories/releases/slf4j/wso2/slf4j/1.5.10.wso2v1/slf4j-1.5.10.wso2v1.pom
           
Downloading: http://maven.wso2.org/nexus/content/groups/wso2-public/slf4j/wso2/slf4j/1.5.10.wso2v1/slf4j-1.5.10.wso2v1.pom
3/3 KB     
         
Downloaded: http://maven.wso2.org/nexus/content/groups/wso2-public/slf4j/wso2/slf4j/1.5.10.wso2v1/slf4j-1.5.10.wso2v1.pom (3 KB at 458.8 KB/sec)
Downloading: http://maven.wso2.org/nexus/content/repositories/releases/org/wso2/carbon/orbit-parent/4.0.0/orbit-parent-4.0.0.pom
         
Downloading: http://maven.wso2.org/nexus/content/groups/wso2-public/org/wso2/carbon/orbit-parent/4.0.0/orbit-parent-4.0.0.pom
4/22 KB   
8/22 KB   
12/22 KB   
16/22 KB   
20/22 KB   
22/22 KB   
           
Downloaded: http://maven.wso2.org/nexus/content/groups/wso2-public/org/wso2/carbon/orbit-parent/4.0.0/orbit-parent-4.0.0.pom (22 KB at 3521.5 KB/sec)
Downloading: http://maven.wso2.org/nexus/content/repositories/releases/slf4j/wso2/slf4j/1.5.10.wso2v1/slf4j-1.5.10.wso2v1.jar
           
Downloading: http://maven.wso2.org/nexus/content/groups/wso2-public/slf4j/wso2/slf4j/1.5.10.wso2v1/slf4j-1.5.10.wso2v1.jar
4/32 KB    
8/32 KB   
12/32 KB   
16/32 KB   
20/32 KB   
24/32 KB   
28/32 KB   
32/32 KB   
           
Downloaded: http://maven.wso2.org/nexus/content/groups/wso2-public/slf4j/wso2/slf4j/1.5.10.wso2v1/slf4j-1.5.10.wso2v1.jar (32 KB at 6256.1 KB/sec)
[INFO] 
[INFO] --- maven-clean-plugin:3.0.0:clean (default-clean) @ org.wso2.carbon.business.rules.core ---
[INFO] 
[INFO] --- maven-checkstyle-plugin:2.17:check (validate) @ org.wso2.carbon.business.rules.core ---
[INFO] 
[INFO] --- buildnumber-maven-plugin:1.4:create (default) @ org.wso2.carbon.business.rules.core ---
[INFO] Executing: /bin/sh -c cd '/home/jenkins/workspace/carbon-analytics-pipeline/carbon-analytics/components/org.wso2.carbon.business.rules.core' && 'git' 'rev-parse' '--verify' 'HEAD'
[INFO] Working directory: /home/jenkins/workspace/carbon-analytics-pipeline/carbon-analytics/components/org.wso2.carbon.business.rules.core
[INFO] Storing buildNumber: 08bd73f19f3225ccae428dd5ac887d140680f367 at timestamp: 1510817993322
[INFO] Storing buildScmBranch: master
[INFO] 
[INFO] --- jacoco-maven-plugin:0.7.8:prepare-agent (jacoco-initialize) @ org.wso2.carbon.business.rules.core ---
[INFO] surefireArgLine set to -javaagent:/home/jenkins/.m2/repository/org/jacoco/org.jacoco.agent/0.7.8/org.jacoco.agent-0.7.8-runtime.jar=destfile=/home/jenkins/workspace/carbon-analytics-pipeline/carbon-analytics/components/org.wso2.carbon.business.rules.core/target/coverage-reports/jacoco.exec
[INFO] 
[INFO] --- build-helper-maven-plugin:1.9.1:add-source (add-source) @ org.wso2.carbon.business.rules.core ---
[INFO] Source directory: /home/jenkins/workspace/carbon-analytics-pipeline/carbon-analytics/components/org.wso2.carbon.business.rules.core/src/gen/java added.
[INFO] 
[INFO] --- maven-remote-resources-plugin:1.5:process (default) @ org.wso2.carbon.business.rules.core ---
[INFO] 
[INFO] --- maven-resources-plugin:2.7:resources (default-resources) @ org.wso2.carbon.business.rules.core ---
[WARNING] Using platform encoding (ANSI_X3.4-1968 actually) to copy filtered resources, i.e. build is platform dependent!
[INFO] Copying 1 resource
[INFO] Copying 3 resources
[INFO] 
[INFO] --- maven-compiler-plugin:3.5.1:compile (default-compile) @ org.wso2.carbon.business.rules.core ---
[INFO] Changes detected - recompiling the module!
[WARNING] File encoding has not been set, using platform encoding ANSI_X3.4-1968, i.e. build is platform dependent!
[INFO] Compiling 46 source files to /home/jenkins/workspace/carbon-analytics-pipeline/carbon-analytics/components/org.wso2.carbon.business.rules.core/target/classes
[INFO] /home/jenkins/workspace/carbon-analytics-pipeline/carbon-analytics/components/org.wso2.carbon.business.rules.core/src/main/java/org/wso2/carbon/business/rules/core/api/impl/BusinessRulesApiServiceImpl.java: Some input files use unchecked or unsafe operations.
[INFO] /home/jenkins/workspace/carbon-analytics-pipeline/carbon-analytics/components/org.wso2.carbon.business.rules.core/src/main/java/org/wso2/carbon/business/rules/core/api/impl/BusinessRulesApiServiceImpl.java: Recompile with -Xlint:unchecked for details.
[INFO] 
[INFO] >>> findbugs-maven-plugin:3.0.3:check (analyze-compile) > :findbugs @ org.wso2.carbon.business.rules.core >>>
[INFO] 
[INFO] --- findbugs-maven-plugin:3.0.3:findbugs (findbugs) @ org.wso2.carbon.business.rules.core ---
[INFO] 
[INFO] <<< findbugs-maven-plugin:3.0.3:check (analyze-compile) < :findbugs @ org.wso2.carbon.business.rules.core <<<
[INFO] 
[INFO] --- findbugs-maven-plugin:3.0.3:check (analyze-compile) @ org.wso2.carbon.business.rules.core ---
[INFO] 
[INFO] --- maven-resources-plugin:2.7:testResources (default-testResources) @ org.wso2.carbon.business.rules.core ---
[INFO] Not copying test resources
[INFO] 
[INFO] --- maven-compiler-plugin:3.5.1:testCompile (default-testCompile) @ org.wso2.carbon.business.rules.core ---
[INFO] Not compiling test sources
[INFO] 
[INFO] --- maven-surefire-plugin:2.19.1:test (default-test) @ org.wso2.carbon.business.rules.core ---
[INFO] Tests are skipped.
[INFO] 
[INFO] >>> maven-bundle-plugin:2.5.4:bundle (default-bundle) > package @ org.wso2.carbon.business.rules.core >>>
[INFO] 
[INFO] --- maven-checkstyle-plugin:2.17:check (validate) @ org.wso2.carbon.business.rules.core ---
[INFO] 
[INFO] --- buildnumber-maven-plugin:1.4:create (default) @ org.wso2.carbon.business.rules.core ---
[INFO] Executing: /bin/sh -c cd '/home/jenkins/workspace/carbon-analytics-pipeline/carbon-analytics/components/org.wso2.carbon.business.rules.core' && 'git' 'rev-parse' '--verify' 'HEAD'
[INFO] Working directory: /home/jenkins/workspace/carbon-analytics-pipeline/carbon-analytics/components/org.wso2.carbon.business.rules.core
[INFO] Storing buildNumber: 08bd73f19f3225ccae428dd5ac887d140680f367 at timestamp: 1510817994081
[INFO] Storing buildScmBranch: master
[INFO] 
[INFO] --- jacoco-maven-plugin:0.7.8:prepare-agent (jacoco-initialize) @ org.wso2.carbon.business.rules.core ---
[INFO] surefireArgLine set to -javaagent:/home/jenkins/.m2/repository/org/jacoco/org.jacoco.agent/0.7.8/org.jacoco.agent-0.7.8-runtime.jar=destfile=/home/jenkins/workspace/carbon-analytics-pipeline/carbon-analytics/components/org.wso2.carbon.business.rules.core/target/coverage-reports/jacoco.exec
[INFO] 
[INFO] --- build-helper-maven-plugin:1.9.1:add-source (add-source) @ org.wso2.carbon.business.rules.core ---
[INFO] Source directory: /home/jenkins/workspace/carbon-analytics-pipeline/carbon-analytics/components/org.wso2.carbon.business.rules.core/src/gen/java added.
[INFO] 
[INFO] --- maven-remote-resources-plugin:1.5:process (default) @ org.wso2.carbon.business.rules.core ---
[INFO] 
[INFO] --- maven-resources-plugin:2.7:resources (default-resources) @ org.wso2.carbon.business.rules.core ---
[WARNING] Using platform encoding (ANSI_X3.4-1968 actually) to copy filtered resources, i.e. build is platform dependent!
[INFO] Copying 1 resource
[INFO] Copying 3 resources
[INFO] Copying 3 resources
[INFO] 
[INFO] --- maven-compiler-plugin:3.5.1:compile (default-compile) @ org.wso2.carbon.business.rules.core ---
[INFO] Nothing to compile - all classes are up to date
[INFO] 
[INFO] >>> findbugs-maven-plugin:3.0.3:check (analyze-compile) > :findbugs @ org.wso2.carbon.business.rules.core >>>
[INFO] 
[INFO] --- findbugs-maven-plugin:3.0.3:findbugs (findbugs) @ org.wso2.carbon.business.rules.core ---
[INFO] 
[INFO] <<< findbugs-maven-plugin:3.0.3:check (analyze-compile) < :findbugs @ org.wso2.carbon.business.rules.core <<<
[INFO] 
[INFO] --- findbugs-maven-plugin:3.0.3:check (analyze-compile) @ org.wso2.carbon.business.rules.core ---
[INFO] 
[INFO] --- maven-resources-plugin:2.7:testResources (default-testResources) @ org.wso2.carbon.business.rules.core ---
[INFO] Not copying test resources
[INFO] 
[INFO] --- maven-compiler-plugin:3.5.1:testCompile (default-testCompile) @ org.wso2.carbon.business.rules.core ---
[INFO] Not compiling test sources
[INFO] 
[INFO] --- maven-surefire-plugin:2.19.1:test (default-test) @ org.wso2.carbon.business.rules.core ---
[INFO] Tests are skipped.
[INFO] 
[INFO] <<< maven-bundle-plugin:2.5.4:bundle (default-bundle) < package @ org.wso2.carbon.business.rules.core <<<
[INFO] 
[INFO] --- maven-bundle-plugin:2.5.4:bundle (default-bundle) @ org.wso2.carbon.business.rules.core ---
[INFO] 
[INFO] --- jacoco-maven-plugin:0.7.8:report (jacoco-site) @ org.wso2.carbon.business.rules.core ---
[INFO] Skipping JaCoCo execution due to missing execution data file.
[INFO] 
[INFO] --- maven-install-plugin:2.5.2:install (default-install) @ org.wso2.carbon.business.rules.core ---
[INFO] Installing /home/jenkins/workspace/carbon-analytics-pipeline/carbon-analytics/components/org.wso2.carbon.business.rules.core/target/org.wso2.carbon.business.rules.core-2.0.145-SNAPSHOT.jar to /home/jenkins/.m2/repository/org/wso2/carbon/analytics/org.wso2.carbon.business.rules.core/2.0.145-SNAPSHOT/org.wso2.carbon.business.rules.core-2.0.145-SNAPSHOT.jar
[INFO] Installing /home/jenkins/workspace/carbon-analytics-pipeline/carbon-analytics/components/org.wso2.carbon.business.rules.core/pom.xml to /home/jenkins/.m2/repository/org/wso2/carbon/analytics/org.wso2.carbon.business.rules.core/2.0.145-SNAPSHOT/org.wso2.carbon.business.rules.core-2.0.145-SNAPSHOT.pom
[INFO] 
[INFO] >>> maven-bundle-plugin:2.5.4:install (default-install) > install @ org.wso2.carbon.business.rules.core >>>
[INFO] 
[INFO] --- maven-checkstyle-plugin:2.17:check (validate) @ org.wso2.carbon.business.rules.core ---
[INFO] 
[INFO] --- buildnumber-maven-plugin:1.4:create (default) @ org.wso2.carbon.business.rules.core ---
[INFO] Executing: /bin/sh -c cd '/home/jenkins/workspace/carbon-analytics-pipeline/carbon-analytics/components/org.wso2.carbon.business.rules.core' && 'git' 'rev-parse' '--verify' 'HEAD'
[INFO] Working directory: /home/jenkins/workspace/carbon-analytics-pipeline/carbon-analytics/components/org.wso2.carbon.business.rules.core
[INFO] Storing buildNumber: 08bd73f19f3225ccae428dd5ac887d140680f367 at timestamp: 1510817994619
[INFO] Storing buildScmBranch: master
[INFO] 
[INFO] --- jacoco-maven-plugin:0.7.8:prepare-agent (jacoco-initialize) @ org.wso2.carbon.business.rules.core ---
[INFO] surefireArgLine set to -javaagent:/home/jenkins/.m2/repository/org/jacoco/org.jacoco.agent/0.7.8/org.jacoco.agent-0.7.8-runtime.jar=destfile=/home/jenkins/workspace/carbon-analytics-pipeline/carbon-analytics/components/org.wso2.carbon.business.rules.core/target/coverage-reports/jacoco.exec
[INFO] 
[INFO] --- build-helper-maven-plugin:1.9.1:add-source (add-source) @ org.wso2.carbon.business.rules.core ---
[INFO] Source directory: /home/jenkins/workspace/carbon-analytics-pipeline/carbon-analytics/components/org.wso2.carbon.business.rules.core/src/gen/java added.
[INFO] 
[INFO] --- maven-remote-resources-plugin:1.5:process (default) @ org.wso2.carbon.business.rules.core ---
[INFO] 
[INFO] --- maven-resources-plugin:2.7:resources (default-resources) @ org.wso2.carbon.business.rules.core ---
[WARNING] Using platform encoding (ANSI_X3.4-1968 actually) to copy filtered resources, i.e. build is platform dependent!
[INFO] Copying 1 resource
[INFO] Copying 3 resources
[INFO] Copying 3 resources
[INFO] 
[INFO] --- maven-compiler-plugin:3.5.1:compile (default-compile) @ org.wso2.carbon.business.rules.core ---
[INFO] Nothing to compile - all classes are up to date
[INFO] 
[INFO] >>> findbugs-maven-plugin:3.0.3:check (analyze-compile) > :findbugs @ org.wso2.carbon.business.rules.core >>>
[INFO] 
[INFO] --- findbugs-maven-plugin:3.0.3:findbugs (findbugs) @ org.wso2.carbon.business.rules.core ---
[INFO] 
[INFO] <<< findbugs-maven-plugin:3.0.3:check (analyze-compile) < :findbugs @ org.wso2.carbon.business.rules.core <<<
[INFO] 
[INFO] --- findbugs-maven-plugin:3.0.3:check (analyze-compile) @ org.wso2.carbon.business.rules.core ---
[INFO] 
[INFO] --- maven-resources-plugin:2.7:testResources (default-testResources) @ org.wso2.carbon.business.rules.core ---
[INFO] Not copying test resources
[INFO] 
[INFO] --- maven-compiler-plugin:3.5.1:testCompile (default-testCompile) @ org.wso2.carbon.business.rules.core ---
[INFO] Not compiling test sources
[INFO] 
[INFO] --- maven-surefire-plugin:2.19.1:test (default-test) @ org.wso2.carbon.business.rules.core ---
[INFO] Tests are skipped.
[INFO] 
[INFO] >>> maven-bundle-plugin:2.5.4:bundle (default-bundle) > package @ org.wso2.carbon.business.rules.core >>>
[INFO] 
[INFO] --- maven-checkstyle-plugin:2.17:check (validate) @ org.wso2.carbon.business.rules.core ---
[INFO] 
[INFO] --- buildnumber-maven-plugin:1.4:create (default) @ org.wso2.carbon.business.rules.core ---
[INFO] Executing: /bin/sh -c cd '/home/jenkins/workspace/carbon-analytics-pipeline/carbon-analytics/components/org.wso2.carbon.business.rules.core' && 'git' 'rev-parse' '--verify' 'HEAD'
[INFO] Working directory: /home/jenkins/workspace/carbon-analytics-pipeline/carbon-analytics/components/org.wso2.carbon.business.rules.core
[INFO] Storing buildNumber: 08bd73f19f3225ccae428dd5ac887d140680f367 at timestamp: 1510817994902
[INFO] Storing buildScmBranch: master
[INFO] 
[INFO] --- jacoco-maven-plugin:0.7.8:prepare-agent (jacoco-initialize) @ org.wso2.carbon.business.rules.core ---
[INFO] surefireArgLine set to -javaagent:/home/jenkins/.m2/repository/org/jacoco/org.jacoco.agent/0.7.8/org.jacoco.agent-0.7.8-runtime.jar=destfile=/home/jenkins/workspace/carbon-analytics-pipeline/carbon-analytics/components/org.wso2.carbon.business.rules.core/target/coverage-reports/jacoco.exec
[INFO] 
[INFO] --- build-helper-maven-plugin:1.9.1:add-source (add-source) @ org.wso2.carbon.business.rules.core ---
[INFO] Source directory: /home/jenkins/workspace/carbon-analytics-pipeline/carbon-analytics/components/org.wso2.carbon.business.rules.core/src/gen/java added.
[INFO] 
[INFO] --- maven-remote-resources-plugin:1.5:process (default) @ org.wso2.carbon.business.rules.core ---
[INFO] 
[INFO] --- maven-resources-plugin:2.7:resources (default-resources) @ org.wso2.carbon.business.rules.core ---
[WARNING] Using platform encoding (ANSI_X3.4-1968 actually) to copy filtered resources, i.e. build is platform dependent!
[INFO] Copying 1 resource
[INFO] Copying 3 resources
[INFO] Copying 3 resources
[INFO] Copying 3 resources
[INFO] 
[INFO] --- maven-compiler-plugin:3.5.1:compile (default-compile) @ org.wso2.carbon.business.rules.core ---
[INFO] Nothing to compile - all classes are up to date
[INFO] 
[INFO] >>> findbugs-maven-plugin:3.0.3:check (analyze-compile) > :findbugs @ org.wso2.carbon.business.rules.core >>>
[INFO] 
[INFO] --- findbugs-maven-plugin:3.0.3:findbugs (findbugs) @ org.wso2.carbon.business.rules.core ---
[INFO] 
[INFO] <<< findbugs-maven-plugin:3.0.3:check (analyze-compile) < :findbugs @ org.wso2.carbon.business.rules.core <<<
[INFO] 
[INFO] --- findbugs-maven-plugin:3.0.3:check (analyze-compile) @ org.wso2.carbon.business.rules.core ---
[INFO] 
[INFO] --- maven-resources-plugin:2.7:testResources (default-testResources) @ org.wso2.carbon.business.rules.core ---
[INFO] Not copying test resources
[INFO] 
[INFO] --- maven-compiler-plugin:3.5.1:testCompile (default-testCompile) @ org.wso2.carbon.business.rules.core ---
[INFO] Not compiling test sources
[INFO] 
[INFO] --- maven-surefire-plugin:2.19.1:test (default-test) @ org.wso2.carbon.business.rules.core ---
[INFO] Tests are skipped.
[INFO] 
[INFO] <<< maven-bundle-plugin:2.5.4:bundle (default-bundle) < package @ org.wso2.carbon.business.rules.core <<<
[INFO] 
[INFO] --- maven-bundle-plugin:2.5.4:bundle (default-bundle) @ org.wso2.carbon.business.rules.core ---
[INFO] 
[INFO] --- jacoco-maven-plugin:0.7.8:report (jacoco-site) @ org.wso2.carbon.business.rules.core ---
[INFO] Skipping JaCoCo execution due to missing execution data file.
[INFO] 
[INFO] --- maven-install-plugin:2.5.2:install (default-install) @ org.wso2.carbon.business.rules.core ---
[INFO] Installing /home/jenkins/workspace/carbon-analytics-pipeline/carbon-analytics/components/org.wso2.carbon.business.rules.core/target/org.wso2.carbon.business.rules.core-2.0.145-SNAPSHOT.jar to /home/jenkins/.m2/repository/org/wso2/carbon/analytics/org.wso2.carbon.business.rules.core/2.0.145-SNAPSHOT/org.wso2.carbon.business.rules.core-2.0.145-SNAPSHOT.jar
[INFO] Installing /home/jenkins/workspace/carbon-analytics-pipeline/carbon-analytics/components/org.wso2.carbon.business.rules.core/pom.xml to /home/jenkins/.m2/repository/org/wso2/carbon/analytics/org.wso2.carbon.business.rules.core/2.0.145-SNAPSHOT/org.wso2.carbon.business.rules.core-2.0.145-SNAPSHOT.pom
[INFO] 
[INFO] <<< maven-bundle-plugin:2.5.4:install (default-install) < install @ org.wso2.carbon.business.rules.core <<<
[INFO] 
[INFO] --- maven-bundle-plugin:2.5.4:install (default-install) @ org.wso2.carbon.business.rules.core ---
[INFO] Local OBR update disabled (enable with -DobrRepository)
[INFO]                                                                         
[INFO] ------------------------------------------------------------------------
[INFO] Building Business Rules Web Component 2.0.145-SNAPSHOT
[INFO] ------------------------------------------------------------------------
Downloading: http://maven.wso2.org/nexus/content/repositories/releases/org/codehaus/mojo/exec-maven-plugin/1.5.0/exec-maven-plugin-1.5.0.pom
           
Downloading: http://maven.wso2.org/nexus/content/groups/wso2-public/org/codehaus/mojo/exec-maven-plugin/1.5.0/exec-maven-plugin-1.5.0.pom
4/13 KB    
8/13 KB   
12/13 KB   
13/13 KB   
           
Downloaded: http://maven.wso2.org/nexus/content/groups/wso2-public/org/codehaus/mojo/exec-maven-plugin/1.5.0/exec-maven-plugin-1.5.0.pom (13 KB at 2407.0 KB/sec)
Downloading: http://maven.wso2.org/nexus/content/repositories/releases/org/codehaus/mojo/exec-maven-plugin/1.5.0/exec-maven-plugin-1.5.0.jar
           
Downloading: http://maven.wso2.org/nexus/content/groups/wso2-public/org/codehaus/mojo/exec-maven-plugin/1.5.0/exec-maven-plugin-1.5.0.jar
4/53 KB    
8/53 KB   
12/53 KB   
16/53 KB   
20/53 KB   
24/53 KB   
28/53 KB   
32/53 KB   
36/53 KB   
40/53 KB   
44/53 KB   
48/53 KB   
52/53 KB   
53/53 KB   
           
Downloaded: http://maven.wso2.org/nexus/content/groups/wso2-public/org/codehaus/mojo/exec-maven-plugin/1.5.0/exec-maven-plugin-1.5.0.jar (53 KB at 10410.7 KB/sec)
Downloading: http://maven.wso2.org/nexus/content/repositories/releases/org/apache/maven/plugins/maven-jar-plugin/2.6/maven-jar-plugin-2.6.pom
           
Downloading: http://maven.wso2.org/nexus/content/groups/wso2-public/org/apache/maven/plugins/maven-jar-plugin/2.6/maven-jar-plugin-2.6.pom
4/6 KB     
6/6 KB   
         
Downloaded: http://maven.wso2.org/nexus/content/groups/wso2-public/org/apache/maven/plugins/maven-jar-plugin/2.6/maven-jar-plugin-2.6.pom (6 KB at 1439.0 KB/sec)
Downloading: http://maven.wso2.org/nexus/content/repositories/releases/org/apache/maven/plugins/maven-plugins/27/maven-plugins-27.pom
         
Downloading: http://maven.wso2.org/nexus/content/groups/wso2-public/org/apache/maven/plugins/maven-plugins/27/maven-plugins-27.pom
4/12 KB   
8/12 KB   
12/12 KB   
           
Downloaded: http://maven.wso2.org/nexus/content/groups/wso2-public/org/apache/maven/plugins/maven-plugins/27/maven-plugins-27.pom (12 KB at 2774.7 KB/sec)
Downloading: http://maven.wso2.org/nexus/content/repositories/releases/org/apache/maven/plugins/maven-jar-plugin/2.6/maven-jar-plugin-2.6.jar
           
Downloading: http://maven.wso2.org/nexus/content/groups/wso2-public/org/apache/maven/plugins/maven-jar-plugin/2.6/maven-jar-plugin-2.6.jar
4/26 KB    
8/26 KB   
12/26 KB   
16/26 KB   
20/26 KB   
24/26 KB   
26/26 KB   
           
Downloaded: http://maven.wso2.org/nexus/content/groups/wso2-public/org/apache/maven/plugins/maven-jar-plugin/2.6/maven-jar-plugin-2.6.jar (26 KB at 5006.6 KB/sec)
[INFO] 
[INFO] --- exec-maven-plugin:1.5.0:exec (npm install rimraf (clean)) @ org.wso2.carbon.business.rules.web ---
Downloading: http://maven.wso2.org/nexus/content/repositories/releases/org/apache/maven/maven-toolchain/1.0/maven-toolchain-1.0.pom
           
Downloading: http://maven.wso2.org/nexus/content/groups/wso2-public/org/apache/maven/maven-toolchain/1.0/maven-toolchain-1.0.pom
4/4 KB     
         
Downloaded: http://maven.wso2.org/nexus/content/groups/wso2-public/org/apache/maven/maven-toolchain/1.0/maven-toolchain-1.0.pom (4 KB at 833.5 KB/sec)
Downloading: http://maven.wso2.org/nexus/content/repositories/releases/org/apache/maven/maven-toolchain/1.0/maven-toolchain-1.0.jar
         
Downloading: http://maven.wso2.org/nexus/content/groups/wso2-public/org/apache/maven/maven-toolchain/1.0/maven-toolchain-1.0.jar
4/33 KB   
8/33 KB   
12/33 KB   
16/33 KB   
20/33 KB   
24/33 KB   
28/33 KB   
32/33 KB   
33/33 KB   
           
Downloaded: http://maven.wso2.org/nexus/content/groups/wso2-public/org/apache/maven/maven-toolchain/1.0/maven-toolchain-1.0.jar (33 KB at 8034.9 KB/sec)
[ERROR] Command execution failed.
java.io.IOException: Cannot run program "npm" (in directory "/home/jenkins/workspace/carbon-analytics-pipeline/carbon-analytics/components/org.wso2.carbon.business.rules.web"): error=2, No such file or directory
	at java.lang.ProcessBuilder.start(ProcessBuilder.java:1048)
	at java.lang.Runtime.exec(Runtime.java:620)
	at org.apache.commons.exec.launcher.Java13CommandLauncher.exec(Java13CommandLauncher.java:61)
	at org.apache.commons.exec.DefaultExecutor.launch(DefaultExecutor.java:279)
	at org.apache.commons.exec.DefaultExecutor.executeInternal(DefaultExecutor.java:336)
	at org.apache.commons.exec.DefaultExecutor.execute(DefaultExecutor.java:166)
	at org.codehaus.mojo.exec.ExecMojo.executeCommandLine(ExecMojo.java:764)
	at org.codehaus.mojo.exec.ExecMojo.executeCommandLine(ExecMojo.java:711)
	at org.codehaus.mojo.exec.ExecMojo.execute(ExecMojo.java:289)
	at org.apache.maven.plugin.DefaultBuildPluginManager.executeMojo(DefaultBuildPluginManager.java:134)
	at org.apache.maven.lifecycle.internal.MojoExecutor.execute(MojoExecutor.java:207)
	at org.apache.maven.lifecycle.internal.MojoExecutor.execute(MojoExecutor.java:153)
	at org.apache.maven.lifecycle.internal.MojoExecutor.execute(MojoExecutor.java:145)
	at org.apache.maven.lifecycle.internal.LifecycleModuleBuilder.buildProject(LifecycleModuleBuilder.java:116)
	at org.apache.maven.lifecycle.internal.LifecycleModuleBuilder.buildProject(LifecycleModuleBuilder.java:80)
	at org.apache.maven.lifecycle.internal.builder.singlethreaded.SingleThreadedBuilder.build(SingleThreadedBuilder.java:51)
	at org.apache.maven.lifecycle.internal.LifecycleStarter.execute(LifecycleStarter.java:128)
	at org.apache.maven.DefaultMaven.doExecute(DefaultMaven.java:307)
	at org.apache.maven.DefaultMaven.doExecute(DefaultMaven.java:193)
	at org.apache.maven.DefaultMaven.execute(DefaultMaven.java:106)
	at org.apache.maven.cli.MavenCli.execute(MavenCli.java:863)
	at org.apache.maven.cli.MavenCli.doMain(MavenCli.java:288)
	at org.apache.maven.cli.MavenCli.main(MavenCli.java:199)
	at sun.reflect.NativeMethodAccessorImpl.invoke0(Native Method)
	at sun.reflect.NativeMethodAccessorImpl.invoke(NativeMethodAccessorImpl.java:62)
	at sun.reflect.DelegatingMethodAccessorImpl.invoke(DelegatingMethodAccessorImpl.java:43)
	at java.lang.reflect.Method.invoke(Method.java:498)
	at org.codehaus.plexus.classworlds.launcher.Launcher.launchEnhanced(Launcher.java:289)
	at org.codehaus.plexus.classworlds.launcher.Launcher.launch(Launcher.java:229)
	at org.codehaus.plexus.classworlds.launcher.Launcher.mainWithExitCode(Launcher.java:415)
	at org.codehaus.plexus.classworlds.launcher.Launcher.main(Launcher.java:356)
Caused by: java.io.IOException: error=2, No such file or directory
	at java.lang.UNIXProcess.forkAndExec(Native Method)
	at java.lang.UNIXProcess.<init>(UNIXProcess.java:247)
	at java.lang.ProcessImpl.start(ProcessImpl.java:134)
	at java.lang.ProcessBuilder.start(ProcessBuilder.java:1029)
	... 30 more
[INFO] ------------------------------------------------------------------------
[INFO] Reactor Summary:
[INFO] 
[INFO] WSO2 Carbon Analytics - Parent ..................... SUCCESS [  6.296 s]
[INFO] WSO2 Data Analytics Server - Common ................ SUCCESS [  6.267 s]
[INFO] WSO2 Carbon - Siddhi Metrics Core .................. SUCCESS [  1.676 s]
[INFO] WSO2 Data Analytics Server - Core .................. SUCCESS [  7.889 s]
[INFO] WSO2 Data Analytics Server - Event Simulator ....... SUCCESS [  5.456 s]
[INFO] WSO2 Carbon - Editor Log Appender .................. SUCCESS [  1.875 s]
[INFO] WSO2 Data Analytics Server - Job Manager ........... SUCCESS [ 31.114 s]
[INFO] WSO2 Streaming Processor - Distributed Resource .... SUCCESS [  1.883 s]
[INFO] WSO2 Data Analytics Server - Editor ................ SUCCESS [  8.044 s]
[INFO] WSO2 Stream Processor : Database Query Manager ..... SUCCESS [  1.256 s]
[INFO] WSO2 Data Analytics Server - Business Rules ........ SUCCESS [  2.089 s]
[INFO] Business Rules Web Component ....................... FAILURE [  0.123 s]
[INFO] org.wso2.carbon.stream.processor.statistics ........ SKIPPED
[INFO] WSO2 Stream Processor - Status Dashboard Core ...... SKIPPED
[INFO] Status Dashboard Web Component ..................... SKIPPED
[INFO] WSO2 Data Analytics Server - Core Feature .......... SKIPPED
[INFO] WSO2 Data Analytics Server - Common Feature ........ SKIPPED
[INFO] WSO2 Data Analytics Server - Event Simulator Feature SKIPPED
[INFO] WSO2 Data Analytics Server - Job Manager Feature ... SKIPPED
[INFO] WSO2 Stream Processor - Distributed Resource Feature SKIPPED
[INFO] WSO2 Data Analytics Server - Siddhi Editor Feature . SKIPPED
[INFO] WSO2 Data Analytics Server - Business Rules Core Feature SKIPPED
[INFO] WSO2 Stream Processor Business Rule Web Component .. SKIPPED
[INFO] WSO2 Data Analytics Server - Siddhi Feature ........ SKIPPED
[INFO] WSO2 Carbon - Siddhi Metrics Core .................. SKIPPED
[INFO] WSO2 Data Analytics Server - Statistics Feature .... SKIPPED
[INFO] WSO2 Carbon - Status Dashboard Core Feature ........ SKIPPED
[INFO] WSO2 Carbon - Status Dashboard Webapp Feature ...... SKIPPED
[INFO] WSO2 Carbon Analytics - Test Distribution .......... SKIPPED
[INFO] WSO2 Carbon Analytics - OSGi Tests ................. SKIPPED
[INFO] ------------------------------------------------------------------------
[INFO] BUILD FAILURE
[INFO] ------------------------------------------------------------------------
[INFO] Total time: 01:23 min
[INFO] Finished at: 2017-11-16T07:39:55+00:00
[INFO] Final Memory: 138M/1386M
[INFO] ------------------------------------------------------------------------
[ERROR] Failed to execute goal org.codehaus.mojo:exec-maven-plugin:1.5.0:exec (npm install rimraf (clean)) on project org.wso2.carbon.business.rules.web: Command execution failed. Cannot run program "npm" (in directory "/home/jenkins/workspace/carbon-analytics-pipeline/carbon-analytics/components/org.wso2.carbon.business.rules.web"): error=2, No such file or directory -> [Help 1]
org.apache.maven.lifecycle.LifecycleExecutionException: Failed to execute goal org.codehaus.mojo:exec-maven-plugin:1.5.0:exec (npm install rimraf (clean)) on project org.wso2.carbon.business.rules.web: Command execution failed.
	at org.apache.maven.lifecycle.internal.MojoExecutor.execute(MojoExecutor.java:212)
	at org.apache.maven.lifecycle.internal.MojoExecutor.execute(MojoExecutor.java:153)
	at org.apache.maven.lifecycle.internal.MojoExecutor.execute(MojoExecutor.java:145)
	at org.apache.maven.lifecycle.internal.LifecycleModuleBuilder.buildProject(LifecycleModuleBuilder.java:116)
	at org.apache.maven.lifecycle.internal.LifecycleModuleBuilder.buildProject(LifecycleModuleBuilder.java:80)
	at org.apache.maven.lifecycle.internal.builder.singlethreaded.SingleThreadedBuilder.build(SingleThreadedBuilder.java:51)
	at org.apache.maven.lifecycle.internal.LifecycleStarter.execute(LifecycleStarter.java:128)
	at org.apache.maven.DefaultMaven.doExecute(DefaultMaven.java:307)
	at org.apache.maven.DefaultMaven.doExecute(DefaultMaven.java:193)
	at org.apache.maven.DefaultMaven.execute(DefaultMaven.java:106)
	at org.apache.maven.cli.MavenCli.execute(MavenCli.java:863)
	at org.apache.maven.cli.MavenCli.doMain(MavenCli.java:288)
	at org.apache.maven.cli.MavenCli.main(MavenCli.java:199)
	at sun.reflect.NativeMethodAccessorImpl.invoke0(Native Method)
	at sun.reflect.NativeMethodAccessorImpl.invoke(NativeMethodAccessorImpl.java:62)
	at sun.reflect.DelegatingMethodAccessorImpl.invoke(DelegatingMethodAccessorImpl.java:43)
	at java.lang.reflect.Method.invoke(Method.java:498)
	at org.codehaus.plexus.classworlds.launcher.Launcher.launchEnhanced(Launcher.java:289)
	at org.codehaus.plexus.classworlds.launcher.Launcher.launch(Launcher.java:229)
	at org.codehaus.plexus.classworlds.launcher.Launcher.mainWithExitCode(Launcher.java:415)
	at org.codehaus.plexus.classworlds.launcher.Launcher.main(Launcher.java:356)
Caused by: org.apache.maven.plugin.MojoExecutionException: Command execution failed.
	at org.codehaus.mojo.exec.ExecMojo.execute(ExecMojo.java:307)
	at org.apache.maven.plugin.DefaultBuildPluginManager.executeMojo(DefaultBuildPluginManager.java:134)
	at org.apache.maven.lifecycle.internal.MojoExecutor.execute(MojoExecutor.java:207)
	... 20 more
Caused by: java.io.IOException: Cannot run program "npm" (in directory "/home/jenkins/workspace/carbon-analytics-pipeline/carbon-analytics/components/org.wso2.carbon.business.rules.web"): error=2, No such file or directory
	at java.lang.ProcessBuilder.start(ProcessBuilder.java:1048)
	at java.lang.Runtime.exec(Runtime.java:620)
	at org.apache.commons.exec.launcher.Java13CommandLauncher.exec(Java13CommandLauncher.java:61)
	at org.apache.commons.exec.DefaultExecutor.launch(DefaultExecutor.java:279)
	at org.apache.commons.exec.DefaultExecutor.executeInternal(DefaultExecutor.java:336)
	at org.apache.commons.exec.DefaultExecutor.execute(DefaultExecutor.java:166)
	at org.codehaus.mojo.exec.ExecMojo.executeCommandLine(ExecMojo.java:764)
	at org.codehaus.mojo.exec.ExecMojo.executeCommandLine(ExecMojo.java:711)
	at org.codehaus.mojo.exec.ExecMojo.execute(ExecMojo.java:289)
	... 22 more
Caused by: java.io.IOException: error=2, No such file or directory
	at java.lang.UNIXProcess.forkAndExec(Native Method)
	at java.lang.UNIXProcess.<init>(UNIXProcess.java:247)
	at java.lang.ProcessImpl.start(ProcessImpl.java:134)
	at java.lang.ProcessBuilder.start(ProcessBuilder.java:1029)
	... 30 more
[ERROR] 
[ERROR] Re-run Maven using the -X switch to enable full debug logging.
[ERROR] 
[ERROR] For more information about the errors and possible solutions, please read the following articles:
[ERROR] [Help 1] http://cwiki.apache.org/confluence/display/MAVEN/MojoExecutionException
[ERROR] 
[ERROR] After correcting the problems, you can resume the build with the command
[ERROR]   mvn <goals> -rf :org.wso2.carbon.business.rules.web
[Pipeline] }
[Pipeline] // withEnv
[Pipeline] }
[Pipeline] // stage
[Pipeline] step
An attempt to send an e-mail to empty list of recipients, ignored.
[Pipeline] }
[Pipeline] // node
[Pipeline] End of Pipeline
[BFA] Scanning build for known causes...
...[BFA] No failure causes found
[BFA] Done. 3s
ERROR: script returned exit code 1
Finished: FAILURE